maven-notifications mailing list archives

Site index · List index
Message view « Date » · « Thread »
Top « Date » · « Thread »
From Apache Jenkins Server <jenk...@builds.apache.org>
Subject Build failed in Jenkins: maven-plugins-ITs-m3 #1569
Date Sun, 19 Oct 2014 15:38:57 GMT
See <https://builds.apache.org/job/maven-plugins-ITs-m3/1569/changes>

Changes:

[hboutemy] remove rat profile for release

[hboutemy] [maven-release-plugin] prepare for next development iteration

[hboutemy] [maven-release-plugin] prepare release maven-plugins-26

[hboutemy] move download files to site-docs

[hboutemy] prepare release

------------------------------------------
Started by an SCM change
Building remotely on ubuntu3 (Ubuntu ubuntu) in workspace <https://builds.apache.org/job/maven-plugins-ITs-m3/ws/>
Updating http://svn.apache.org/repos/asf/maven/plugins/trunk at revision '2014-10-19T15:36:48.509
+0000'
D         maven-plugins/src/site/resources
D         maven-plugins/src/site/xdoc
A         maven-plugins/src/site-docs/resources
A         maven-plugins/src/site-docs/resources/download.cgi
A         maven-plugins/src/site-docs/xdoc
A         maven-plugins/src/site-docs/xdoc/download.xml.vm
U         maven-plugins/src/site-docs/apt/index.apt.vm
U         maven-plugins/pom.xml
U         maven-plugins/site-pom.xml
At revision 1632946
provisoning config files...
copy managed file [simple-deploy-settings-no-mirror] to file:/tmp/config9025827484752870973tmp
[maven-plugins-ITs-m3] $ /home/jenkins/jenkins-slave/tools/hudson.tasks.Maven_MavenInstallation/maven-3.1.0/bin/mvn
clean install -Prun-its -U -B -V -fae -Papache.snapshots -s /tmp/config9025827484752870973tmp
Apache Maven 3.1.0 (893ca28a1da9d5f51ac03827af98bb730128f9f2; 2013-06-28 02:15:32+0000)
Maven home: /home/jenkins/jenkins-slave/tools/hudson.tasks.Maven_MavenInstallation/maven-3.1.0
Java version: 1.5.0_22, vendor: Sun Microsystems Inc.
Java home: /x1/jenkins/tools/java/jdk1.5.0_22-32/jre
Default locale: en_US, platform encoding: ANSI_X3.4-1968
OS name: "linux", version: "3.2.0-68-generic", arch: "i386", family: "unix"
[INFO] Scanning for projects...
[INFO] Downloading: http://repo.maven.apache.org/maven2/org/apache/maven/maven-parent/25/maven-parent-25.pom
[ERROR] The build could not read 1 project -> [Help 1]
[ERROR]   
[ERROR]   The project org.apache.maven.plugins:maven-plugins:27-SNAPSHOT (/x1/jenkins/jenkins-slave/workspace/maven-plugins-ITs-m3/maven-plugins/pom.xml)
has 1 error
[ERROR]     Non-resolvable parent POM: Could not find artifact org.apache.maven:maven-parent:pom:25
in central (http://repo.maven.apache.org/maven2) and 'parent.relativePath' points at wrong
local POM @ line 23, column 11 -> [Help 2]
[ERROR] 
[ERROR] To see the full stack trace of the errors, re-run Maven with the -e switch.
[ERROR] Re-run Maven using the -X switch to enable full debug logging.
[ERROR] 
[ERROR] For more information about the errors and possible solutions, please read the following
articles:
[ERROR] [Help 1] http://cwiki.apache.org/confluence/display/MAVEN/ProjectBuildingException
[ERROR] [Help 2] http://cwiki.apache.org/confluence/display/MAVEN/UnresolvableModelException
Build step 'Invoke top-level Maven targets' marked build as failure
Recording test results

Mime
View raw message