maven-notifications mailing list archives

Site index · List index
Message view « Date » · « Thread »
Top « Date » · « Thread »
From Apache Jenkins Server <jenk...@builds.apache.org>
Subject Build failed in Jenkins: maven-plugins #2232
Date Sun, 19 Oct 2014 15:09:51 GMT
See <https://builds.apache.org/job/maven-plugins/2232/changes>

Changes:

[hboutemy] remove rat profile for release

[hboutemy] [maven-release-plugin] prepare for next development iteration

[hboutemy] [maven-release-plugin] prepare release maven-plugins-26

[hboutemy] move download files to site-docs

[hboutemy] prepare release

[krosenvold] Updated to p-u .20

[khmarbaise] [MASSEMBLY-720]
 - Followup furhter cleanup of checkstyle reported issues.

[khmarbaise] [MASSEMBLY-720]
 - Cleaning up checkstyle reporting things.

[khmarbaise] [MACR-14]
 - Upgrade plexus-interpolation from 1.19 to 1.21

[khmarbaise] [MACR-13]
 - Upgrade plexus-archiver from 2.6.3 to 2.7.1.

[khmarbaise] [MPDF-68]
 - Removed org.codehaus.plexus:plexus-container-default:1.0-alpha-9

[khmarbaise] [MPDF-66]
 - Patch applied by Leo Breuss

[khmarbaise] [MDEPLOY-171]
 - Removed deprecated marked entries.
   artifact, packaging, pomFile, attachedArtifacts fixed unit tests accordingly.

[khmarbaise] [MDEPLOY-188]
 - Upgrade plexus-utils from 3.0.15 to 3.0.18

[khmarbaise] [MJAR-185]
 - Upgraded plexus-archiver from 2.7 to 2.7.1

[krosenvold] [MRAR-41] Updated p-i and p-a

[krosenvold] [MPIR-301] Update p-i

[krosenvold] [MPDF-67] Update p-i

[krosenvold] [MINVOKER-176] Update p-i

[krosenvold] [MEJB-74] p-i updated

[krosenvold] [MCHECKSTYLE-254] Updated p-i to avoid thread safety issues

[krosenvold] [MDOAP-42] p-i update

[krosenvold] [MCHANGES-346] Updated plexus-interpolation to avoid possible thread safety issues

[krosenvold] [MDEP-465] Updated pleuxs-archiver to 2.7.1, test-scoped pinterpolation to 1.21

[krosenvold] [MRRESOURCES-76] Updated plexus-archiver

[krosenvold] [MRESOURCES-191] Updated plexus-archiver

[krosenvold] [MWAR-329][MWAR-333] Dependency uprades

[krosenvold] Removed previous attempt at fixing thread safety problem

[krosenvold] Updated p-interpolation to 1.21, p-archiver to 2.7.1

[krosenvold] Changed scopes to fix threading issues

[krosenvold] Reverted IT due to some weird invoker problem. Testcase is good, but running
in invoker is broken

[krosenvold] Added a few files to testcase

[krosenvold] [MASSEMBLY-474]  Added testcase, supplied by Ronald Sigmund

Fix was actually made in refactoring in previous commit

[krosenvold] Refactored assembly building logic with slightly more powerful building blocks
and a little more correctness

[krosenvold] Misc code cleanup2

[krosenvold] Run some code duplication analysis

[krosenvold] Updated p-archiver 2.7 and p-io 2.2

[krosenvold] [MASSEMBLY-576] Manifest classpath not added for maven 3.x

------------------------------------------
Started by upstream project "maven-parent" build number 182
originally caused by:
 Started by an SCM change
Building remotely on ubuntu-4 (docker Ubuntu ubuntu4 ubuntu) in workspace <https://builds.apache.org/job/maven-plugins/ws/>
Updating http://svn.apache.org/repos/asf/maven/plugins/trunk at revision '2014-10-19T15:07:24.274
+0000'
U         maven-assembly-plugin/pom.xml
A         maven-assembly-plugin/src/it/projects/basic-features/add-classpath
A         maven-assembly-plugin/src/it/projects/basic-features/add-classpath/invoker.properties
A         maven-assembly-plugin/src/it/projects/basic-features/add-classpath/pom.xml
A         maven-assembly-plugin/src/it/projects/basic-features/add-classpath/assembly.xml
A         maven-assembly-plugin/src/it/projects/basic-features/add-classpath/verify.bsh
U         maven-assembly-plugin/src/it/projects/basic-features/formats/src/assemblies/format-test.xml
U         maven-assembly-plugin/src/it/projects/basic-features/formats/pom.xml
U         maven-assembly-plugin/src/it/projects/basic-features/formats/verify.bsh
A         maven-assembly-plugin/src/it/projects/module-sets
A         maven-assembly-plugin/src/it/projects/module-sets/maven-assembly-test
A         maven-assembly-plugin/src/it/projects/module-sets/maven-assembly-test/modul-client
A         maven-assembly-plugin/src/it/projects/module-sets/maven-assembly-test/modul-client/src
A         maven-assembly-plugin/src/it/projects/module-sets/maven-assembly-test/modul-client/src/main
A         maven-assembly-plugin/src/it/projects/module-sets/maven-assembly-test/modul-client/src/main/resources
A         maven-assembly-plugin/src/it/projects/module-sets/maven-assembly-test/distribution
A         maven-assembly-plugin/src/it/projects/module-sets/maven-assembly-test/distribution/src
A         maven-assembly-plugin/src/it/projects/module-sets/maven-assembly-test/distribution/src/assembly
A         maven-assembly-plugin/src/it/projects/module-sets/maven-assembly-test/modul-server
A         maven-assembly-plugin/src/it/projects/module-sets/maven-assembly-test/modul-server/src
A         maven-assembly-plugin/src/it/projects/module-sets/maven-assembly-test/modul-server/src/main
A         maven-assembly-plugin/src/it/projects/module-sets/maven-assembly-test/modul-server/src/main/resources
U         maven-assembly-plugin/src/test/java/org/apache/maven/plugin/assembly/artifact/DefaultDependencyResolverTest.java
U         maven-assembly-plugin/src/test/java/org/apache/maven/plugin/assembly/archive/phase/DependencySetAssemblyPhaseTest.java
U         maven-assembly-plugin/src/test/java/org/apache/maven/plugin/assembly/archive/phase/FileSetAssemblyPhaseTest.java
U         maven-assembly-plugin/src/test/java/org/apache/maven/plugin/assembly/archive/phase/FileItemAssemblyPhaseTest.java
U         maven-assembly-plugin/src/test/java/org/apache/maven/plugin/assembly/archive/phase/RepositoryAssemblyPhaseTest.java
U         maven-assembly-plugin/src/test/java/org/apache/maven/plugin/assembly/archive/phase/ModuleSetAssemblyPhaseTest.java
U         maven-assembly-plugin/src/test/java/org/apache/maven/plugin/assembly/archive/DefaultAssemblyArchiverTest.java
U         maven-assembly-plugin/src/main/resources/META-INF/plexus/components.xml
D         maven-assembly-plugin/src/main/java/org/apache/maven/plugin/assembly/AssemblyContext.java
D         maven-assembly-plugin/src/main/java/org/apache/maven/plugin/assembly/DefaultAssemblyContext.java
U         maven-assembly-plugin/src/main/java/org/apache/maven/plugin/assembly/InvalidAssemblerConfigurationException.java
U         maven-assembly-plugin/src/main/java/org/apache/maven/plugin/assembly/artifact/DependencyResolver.java
U         maven-assembly-plugin/src/main/java/org/apache/maven/plugin/assembly/artifact/DefaultDependencyResolver.java
U         maven-assembly-plugin/src/main/java/org/apache/maven/plugin/assembly/utils/LineEndings.java
U         maven-assembly-plugin/src/main/java/org/apache/maven/plugin/assembly/utils/AssemblyFileUtils.java
U         maven-assembly-plugin/src/main/java/org/apache/maven/plugin/assembly/utils/FilterUtils.java
U         maven-assembly-plugin/src/main/java/org/apache/maven/plugin/assembly/utils/TypeConversionUtils.java
U         maven-assembly-plugin/src/main/java/org/apache/maven/plugin/assembly/utils/AssemblyFormatUtils.java
U         maven-assembly-plugin/src/main/java/org/apache/maven/plugin/assembly/archive/phase/wrappers/GroupVersionAlignmentWrapper.java
U         maven-assembly-plugin/src/main/java/org/apache/maven/plugin/assembly/archive/phase/wrappers/RepoInfoWrapper.java
U         maven-assembly-plugin/src/main/java/org/apache/maven/plugin/assembly/archive/phase/AssemblyArchiverPhase.java
U         maven-assembly-plugin/src/main/java/org/apache/maven/plugin/assembly/archive/phase/DependencySetAssemblyPhase.java
U         maven-assembly-plugin/src/main/java/org/apache/maven/plugin/assembly/archive/phase/FileSetAssemblyPhase.java
U         maven-assembly-plugin/src/main/java/org/apache/maven/plugin/assembly/archive/phase/FileItemAssemblyPhase.java
U         maven-assembly-plugin/src/main/java/org/apache/maven/plugin/assembly/archive/phase/RepositoryAssemblyPhase.java
U         maven-assembly-plugin/src/main/java/org/apache/maven/plugin/assembly/archive/phase/ModuleSetAssemblyPhase.java
U         maven-assembly-plugin/src/main/java/org/apache/maven/plugin/assembly/archive/task/AddDependencySetsTask.java
U         maven-assembly-plugin/src/main/java/org/apache/maven/plugin/assembly/archive/task/AddFileSetsTask.java
U         maven-assembly-plugin/src/main/java/org/apache/maven/plugin/assembly/archive/task/AddDirectoryTask.java
U         maven-assembly-plugin/src/main/java/org/apache/maven/plugin/assembly/archive/AssemblyArchiver.java
U         maven-assembly-plugin/src/main/java/org/apache/maven/plugin/assembly/archive/archiver/PrefixedFileSet.java
U         maven-assembly-plugin/src/main/java/org/apache/maven/plugin/assembly/archive/archiver/AssemblyProxyArchiver.java
U         maven-assembly-plugin/src/main/java/org/apache/maven/plugin/assembly/archive/archiver/PrefixedArchivedFileSet.java
U         maven-assembly-plugin/src/main/java/org/apache/maven/plugin/assembly/archive/ArchiveCreationException.java
U         maven-assembly-plugin/src/main/java/org/apache/maven/plugin/assembly/archive/ArchiveExpansionException.java
U         maven-assembly-plugin/src/main/java/org/apache/maven/plugin/assembly/archive/DefaultAssemblyArchiver.java
A         maven-assembly-plugin/src/main/java/org/apache/maven/plugin/assembly/resolved
A         maven-assembly-plugin/src/main/java/org/apache/maven/plugin/assembly/resolved/ResolvedAssembly.java
A         maven-assembly-plugin/src/main/java/org/apache/maven/plugin/assembly/resolved/ResolvedModuleSet.java
A         maven-assembly-plugin/src/main/java/org/apache/maven/plugin/assembly/resolved/functions
A         maven-assembly-plugin/src/main/java/org/apache/maven/plugin/assembly/resolved/functions/ResolvedModuleSetConsumer.java
A         maven-assembly-plugin/src/main/java/org/apache/maven/plugin/assembly/resolved/AssemblyId.java
U         maven-assembly-plugin/src/main/java/org/apache/maven/plugin/assembly/filter/MetaInfSpringHandler.java
U         maven-assembly-plugin/src/main/java/org/apache/maven/plugin/assembly/filter/MetaInfServicesHandler.java
U         maven-assembly-plugin/src/main/java/org/apache/maven/plugin/assembly/filter/SimpleAggregatingDescriptorHandler.java
U         maven-assembly-plugin/src/main/java/org/apache/maven/plugin/assembly/filter/AbstractLineAggregatingHandler.java
U         maven-assembly-plugin/src/main/java/org/apache/maven/plugin/assembly/filter/ComponentsXmlArchiverFileFilter.java
U         maven-assembly-plugin/src/main/java/org/apache/maven/plugin/assembly/AssemblerConfigurationSource.java
U         maven-assembly-plugin/src/main/java/org/apache/maven/plugin/assembly/interpolation/AssemblyInterpolator.java
U         maven-assembly-plugin/src/main/java/org/apache/maven/plugin/assembly/io/DefaultAssemblyReader.java
U         maven-assembly-plugin/src/main/java/org/apache/maven/plugin/assembly/mojos/SingleAssemblyMojo.java
G         maven-assembly-plugin/src/main/java/org/apache/maven/plugin/assembly/mojos/UnpackMojo.java
U         maven-assembly-plugin/src/main/java/org/apache/maven/plugin/assembly/format/FileSetFormatter.java
U         maven-assembly-plugin/src/main/java/org/apache/maven/plugin/assembly/format/FileFormatter.java
U         maven-repository-plugin/pom.xml
U         maven-docck-plugin/pom.xml
U         maven-doap-plugin/pom.xml
U         maven-rar-plugin/pom.xml
U         maven-scm-publish-plugin/pom.xml
U         maven-help-plugin/pom.xml
U         maven-linkcheck-plugin/pom.xml
U         maven-project-info-reports-plugin/pom.xml
U         maven-deploy-plugin/src/test/resources/unit/basic-deploy-test/plugin-config.xml
U         maven-deploy-plugin/src/test/resources/unit/deploy-file-artifact-not-jar/plugin-config.xml
U         maven-deploy-plugin/src/test/resources/unit/basic-deploy-with-attached-artifacts/plugin-config.xml
U         maven-deploy-plugin/src/test/resources/unit/basic-deploy-scp/plugin-config.xml
U         maven-deploy-plugin/src/test/resources/unit/basic-deploy-pom/plugin-config.xml
U         maven-deploy-plugin/src/test/java/org/apache/maven/plugin/deploy/DeployFileMojoTest.java
U         maven-deploy-plugin/src/test/java/org/apache/maven/plugin/deploy/DeployMojoTest.java
U         maven-deploy-plugin/src/main/java/org/apache/maven/plugin/deploy/DeployMojo.java
U         maven-deploy-plugin/pom.xml
U         maven-patch-plugin/pom.xml
U         maven-source-plugin/pom.xml
U         maven-ejb-plugin/pom.xml
U         maven-acr-plugin/pom.xml
U         maven-install-plugin/pom.xml
U         maven-antrun-plugin/pom.xml
U         maven-ear-plugin/pom.xml
U         maven-changes-plugin/pom.xml
U         maven-resources-plugin/pom.xml
U         maven-ant-plugin/pom.xml
U         maven-eclipse-plugin/pom.xml
U         maven-shade-plugin/pom.xml
A         maven-plugins/src/site-docs/xdoc
A         maven-plugins/src/site-docs/xdoc/download.xml.vm
U         maven-plugins/src/site-docs/apt/index.apt.vm
A         maven-plugins/src/site-docs/resources
A         maven-plugins/src/site-docs/resources/download.cgi
D         maven-plugins/src/site/resources
D         maven-plugins/src/site/xdoc
U         maven-plugins/pom.xml
U         maven-plugins/site-pom.xml
U         maven-changelog-plugin/pom.xml
U         maven-war-plugin/pom.xml
U         maven-checkstyle-plugin/pom.xml
U         maven-remote-resources-plugin/pom.xml
U         maven-stage-plugin/pom.xml
U         maven-site-plugin/pom.xml
U         maven-javadoc-plugin/pom.xml
U         maven-pdf-plugin/src/main/java/org/apache/maven/plugins/pdf/PdfMojo.java
U         maven-pdf-plugin/pom.xml
U         maven-verifier-plugin/pom.xml
U         maven-jar-plugin/pom.xml
U         maven-invoker-plugin/pom.xml
U         maven-gpg-plugin/pom.xml
U         maven-dependency-plugin/pom.xml
At revision 1632939
Parsing POMs
Failed to transfer Could not find artifact org.apache.maven:maven-parent:pom:25 in central
(http://repo.maven.apache.org/maven2)
ERROR: Failed to parse POMs
java.io.IOException: remote file operation failed: <https://builds.apache.org/job/maven-plugins/ws/>
at hudson.remoting.Channel@7ad4edfd:ubuntu-4
	at hudson.FilePath.act(FilePath.java:910)
	at hudson.FilePath.act(FilePath.java:887)
	at hudson.maven.MavenModuleSetBuild$MavenModuleSetBuildExecution.parsePoms(MavenModuleSetBuild.java:953)
	at hudson.maven.MavenModuleSetBuild$MavenModuleSetBuildExecution.doRun(MavenModuleSetBuild.java:681)
	at hudson.model.AbstractBuild$AbstractBuildExecution.run(AbstractBuild.java:585)
	at hudson.model.Run.execute(Run.java:1676)
	at hudson.maven.MavenModuleSetBuild.run(MavenModuleSetBuild.java:529)
	at hudson.model.ResourceController.execute(ResourceController.java:88)
	at hudson.model.Executor.run(Executor.java:231)
Caused by: hudson.remoting.ProxyException: hudson.maven.MavenModuleSetBuild$MavenExecutionException:
org.apache.maven.project.ProjectBuildingException: Some problems were encountered while processing
the POMs:
[FATAL] Non-resolvable parent POM: Could not find artifact org.apache.maven:maven-parent:pom:25
in central (http://repo.maven.apache.org/maven2) and 'parent.relativePath' points at wrong
local POM @ line 23, column 11

	at hudson.maven.MavenModuleSetBuild$PomParser.invoke(MavenModuleSetBuild.java:1357)
	at hudson.maven.MavenModuleSetBuild$PomParser.invoke(MavenModuleSetBuild.java:1091)
	at hudson.FilePath$FileCallableWrapper.call(FilePath.java:2462)
	at hudson.remoting.UserRequest.perform(UserRequest.java:118)
	at hudson.remoting.UserRequest.perform(UserRequest.java:48)
	at hudson.remoting.Request$2.run(Request.java:328)
	at hudson.remoting.InterceptingExecutorService$1.call(InterceptingExecutorService.java:72)
	at java.util.concurrent.FutureTask.run(FutureTask.java:262)
	at java.util.concurrent.ThreadPoolExecutor.runWorker(ThreadPoolExecutor.java:1145)
	at java.util.concurrent.ThreadPoolExecutor$Worker.run(ThreadPoolExecutor.java:615)
	at java.lang.Thread.run(Thread.java:745)
Caused by: hudson.remoting.ProxyException: org.apache.maven.project.ProjectBuildingException:
Some problems were encountered while processing the POMs:
[FATAL] Non-resolvable parent POM: Could not find artifact org.apache.maven:maven-parent:pom:25
in central (http://repo.maven.apache.org/maven2) and 'parent.relativePath' points at wrong
local POM @ line 23, column 11

	at org.apache.maven.project.DefaultProjectBuilder.build(DefaultProjectBuilder.java:364)
	at hudson.maven.MavenEmbedder.buildProjects(MavenEmbedder.java:361)
	at hudson.maven.MavenEmbedder.readProjects(MavenEmbedder.java:331)
	at hudson.maven.MavenModuleSetBuild$PomParser.invoke(MavenModuleSetBuild.java:1294)
	... 10 more
[WARNINGS] Skipping publisher since build result is FAILURE

Mime
View raw message