maven-notifications mailing list archives

Site index · List index
Message view « Date » · « Thread »
Top « Date » · « Thread »
From Apache Jenkins Server <jenk...@builds.apache.org>
Subject Build failed in Jenkins: maven-indexer #221
Date Thu, 11 Sep 2014 22:21:28 GMT
See <https://builds.apache.org/job/maven-indexer/221/>

------------------------------------------
[...truncated 2018 lines...]
Downloading: http://repo.maven.apache.org/maven2/org/apache/maven/maven-model-builder/3.2.3/maven-model-builder-3.2.3.pom
Downloaded: http://repo.maven.apache.org/maven2/org/apache/maven/maven-model-builder/3.2.3/maven-model-builder-3.2.3.pom
(3 KB at 68.6 KB/sec)
Downloading: http://repo.maven.apache.org/maven2/org/apache/maven/maven/3.2.3/maven-3.2.3.pom
Downloaded: http://repo.maven.apache.org/maven2/org/apache/maven/maven/3.2.3/maven-3.2.3.pom
(23 KB at 417.6 KB/sec)
Downloading: http://repo.maven.apache.org/maven2/org/codehaus/plexus/plexus-utils/3.0.17/plexus-utils-3.0.17.pom
Downloaded: http://repo.maven.apache.org/maven2/org/codehaus/plexus/plexus-utils/3.0.17/plexus-utils-3.0.17.pom
(4 KB at 94.7 KB/sec)
Downloading: http://repo.maven.apache.org/maven2/org/springframework/spring-beans/4.0.6.RELEASE/spring-beans-4.0.6.RELEASE.pom
Downloaded: http://repo.maven.apache.org/maven2/org/springframework/spring-beans/4.0.6.RELEASE/spring-beans-4.0.6.RELEASE.pom
(3 KB at 66.1 KB/sec)
Downloading: http://repo.maven.apache.org/maven2/org/springframework/spring-core/4.0.6.RELEASE/spring-core-4.0.6.RELEASE.pom
Downloaded: http://repo.maven.apache.org/maven2/org/springframework/spring-core/4.0.6.RELEASE/spring-core-4.0.6.RELEASE.pom
(3 KB at 65.6 KB/sec)
Downloading: http://repo.maven.apache.org/maven2/org/springframework/spring-context/4.0.6.RELEASE/spring-context-4.0.6.RELEASE.pom
Downloaded: http://repo.maven.apache.org/maven2/org/springframework/spring-context/4.0.6.RELEASE/spring-context-4.0.6.RELEASE.pom
(5 KB at 138.7 KB/sec)
Downloading: http://repo.maven.apache.org/maven2/org/springframework/spring-aop/4.0.6.RELEASE/spring-aop-4.0.6.RELEASE.pom
Downloaded: http://repo.maven.apache.org/maven2/org/springframework/spring-aop/4.0.6.RELEASE/spring-aop-4.0.6.RELEASE.pom
(3 KB at 76.2 KB/sec)
Downloading: http://repo.maven.apache.org/maven2/org/springframework/spring-expression/4.0.6.RELEASE/spring-expression-4.0.6.RELEASE.pom
Downloaded: http://repo.maven.apache.org/maven2/org/springframework/spring-expression/4.0.6.RELEASE/spring-expression-4.0.6.RELEASE.pom
(2 KB at 48.2 KB/sec)
Downloading: http://repo.maven.apache.org/maven2/org/springframework/spring-test/4.0.6.RELEASE/spring-test-4.0.6.RELEASE.pom
Downloaded: http://repo.maven.apache.org/maven2/org/springframework/spring-test/4.0.6.RELEASE/spring-test-4.0.6.RELEASE.pom
(7 KB at 191.1 KB/sec)
Downloading: http://repo.maven.apache.org/maven2/ch/qos/logback/logback-classic/1.1.2/logback-classic-1.1.2.jar
Downloading: http://repo.maven.apache.org/maven2/ch/qos/logback/logback-core/1.1.2/logback-core-1.1.2.jar
Downloading: http://repo.maven.apache.org/maven2/org/slf4j/jcl-over-slf4j/1.7.7/jcl-over-slf4j-1.7.7.jar
Downloading: http://repo.maven.apache.org/maven2/org/apache/maven/maven-model-builder/3.2.3/maven-model-builder-3.2.3.jar
Downloading: http://repo.maven.apache.org/maven2/org/codehaus/plexus/plexus-utils/3.0.17/plexus-utils-3.0.17.jar
Downloaded: http://repo.maven.apache.org/maven2/org/slf4j/jcl-over-slf4j/1.7.7/jcl-over-slf4j-1.7.7.jar
(17 KB at 252.1 KB/sec)
Downloading: http://repo.maven.apache.org/maven2/org/springframework/spring-beans/4.0.6.RELEASE/spring-beans-4.0.6.RELEASE.jar
Downloaded: http://repo.maven.apache.org/maven2/ch/qos/logback/logback-classic/1.1.2/logback-classic-1.1.2.jar
(265 KB at 1739.5 KB/sec)
Downloading: http://repo.maven.apache.org/maven2/org/springframework/spring-context/4.0.6.RELEASE/spring-context-4.0.6.RELEASE.jar
Downloaded: http://repo.maven.apache.org/maven2/org/apache/maven/maven-model-builder/3.2.3/maven-model-builder-3.2.3.jar
(165 KB at 1094.1 KB/sec)
Downloading: http://repo.maven.apache.org/maven2/org/springframework/spring-aop/4.0.6.RELEASE/spring-aop-4.0.6.RELEASE.jar
Downloaded: http://repo.maven.apache.org/maven2/org/codehaus/plexus/plexus-utils/3.0.17/plexus-utils-3.0.17.jar
(246 KB at 1490.2 KB/sec)
Downloading: http://repo.maven.apache.org/maven2/org/springframework/spring-expression/4.0.6.RELEASE/spring-expression-4.0.6.RELEASE.jar
Downloaded: http://repo.maven.apache.org/maven2/ch/qos/logback/logback-core/1.1.2/logback-core-1.1.2.jar
(418 KB at 1873.1 KB/sec)
Downloading: http://repo.maven.apache.org/maven2/org/springframework/spring-core/4.0.6.RELEASE/spring-core-4.0.6.RELEASE.jar
Downloaded: http://repo.maven.apache.org/maven2/org/springframework/spring-expression/4.0.6.RELEASE/spring-expression-4.0.6.RELEASE.jar
(201 KB at 2538.6 KB/sec)
Downloading: http://repo.maven.apache.org/maven2/org/springframework/spring-test/4.0.6.RELEASE/spring-test-4.0.6.RELEASE.jar
Downloaded: http://repo.maven.apache.org/maven2/org/springframework/spring-beans/4.0.6.RELEASE/spring-beans-4.0.6.RELEASE.jar
(655 KB at 3408.9 KB/sec)
Downloaded: http://repo.maven.apache.org/maven2/org/springframework/spring-aop/4.0.6.RELEASE/spring-aop-4.0.6.RELEASE.jar
(345 KB at 2871.2 KB/sec)
Downloaded: http://repo.maven.apache.org/maven2/org/springframework/spring-context/4.0.6.RELEASE/spring-context-4.0.6.RELEASE.jar
(955 KB at 4798.2 KB/sec)
Downloaded: http://repo.maven.apache.org/maven2/org/springframework/spring-test/4.0.6.RELEASE/spring-test-4.0.6.RELEASE.jar
(439 KB at 4023.9 KB/sec)
Downloaded: http://repo.maven.apache.org/maven2/org/springframework/spring-core/4.0.6.RELEASE/spring-core-4.0.6.RELEASE.jar
(955 KB at 5242.3 KB/sec)
[INFO] 
[INFO] --- maven-clean-plugin:2.5:clean (default-clean) @ indexer-examples-spring ---
[INFO] 
[INFO] --- maven-enforcer-plugin:1.3.1:enforce (enforce-bytecode-version) @ indexer-examples-spring
---
[INFO] 
[INFO] --- maven-enforcer-plugin:1.3.1:enforce (ban-known-bad-maven-versions) @ indexer-examples-spring
---
[INFO] 
[INFO] --- maven-remote-resources-plugin:1.5:process (default) @ indexer-examples-spring ---
[INFO] 
[INFO] --- maven-resources-plugin:2.6:resources (default-resources) @ indexer-examples-spring
---
[INFO] Using 'UTF-8' encoding to copy filtered resources.
[INFO] Copying 1 resource
[INFO] Copying 3 resources
[INFO] 
[INFO] --- maven-compiler-plugin:3.1:compile (default-compile) @ indexer-examples-spring ---
[INFO] Changes detected - recompiling the module!
[INFO] Compiling 8 source files to <https://builds.apache.org/job/maven-indexer/ws/indexer-examples/indexer-examples-spring/target/classes>
[INFO] 
[INFO] --- animal-sniffer-maven-plugin:1.11:check (check-java-1.7-compat) @ indexer-examples-spring
---
[INFO] Checking unresolved references to org.codehaus.mojo.signature:java17:1.0
[INFO] 
[INFO] --- maven-resources-plugin:2.6:testResources (default-testResources) @ indexer-examples-spring
---
[INFO] Using 'UTF-8' encoding to copy filtered resources.
[INFO] Copying 2 resources
[INFO] Copying 3 resources
[INFO] 
[INFO] --- maven-compiler-plugin:3.1:testCompile (default-testCompile) @ indexer-examples-spring
---
[INFO] Changes detected - recompiling the module!
[INFO] Compiling 3 source files to <https://builds.apache.org/job/maven-indexer/ws/indexer-examples/indexer-examples-spring/target/test-classes>
[INFO] 
[INFO] --- maven-surefire-plugin:2.17:test (default-test) @ indexer-examples-spring ---
[INFO] Tests are skipped.
[INFO] 
[INFO] --- apache-rat-plugin:0.10:check (rat-verify) @ indexer-examples-spring ---
[INFO] 51 implicit excludes (use -debug for more details).
[INFO] Exclude: README.md
[INFO] Exclude: .gitignore
[INFO] Exclude: NOTICE
[INFO] Exclude: .git/**
[INFO] Exclude: .idea/**
[INFO] Exclude: src/test/**/*.sha1
[INFO] Exclude: src/test/**/*.md5
[INFO] Exclude: src/test/**/*.xml
[INFO] Exclude: src/test/**/*.pom
[INFO] Exclude: src/test/**/*.asc
[INFO] Exclude: src/test/**/*.properties
[INFO] Exclude: src/test/**/*.swc
[INFO] Exclude: src/test/**/*.txt
[INFO] Exclude: src/test/**/*.filename
[INFO] Exclude: src/test/**/.placeholder
[INFO] 14 resources included (use -debug for more details)
[INFO] Rat check: Summary of files. Unapproved: 0 unknown: 0 generated: 0 approved: 14 licence.
[INFO] 
[INFO] --- maven-jar-plugin:2.4:jar (default-jar) @ indexer-examples-spring ---
[INFO] Building jar: <https://builds.apache.org/job/maven-indexer/ws/indexer-examples/indexer-examples-spring/target/indexer-examples-spring-6.0-SNAPSHOT.jar>
[INFO] 
[INFO] --- maven-site-plugin:3.3:attach-descriptor (attach-descriptor) @ indexer-examples-spring
---
[INFO] 
[INFO] --- maven-install-plugin:2.5.1:install (default-install) @ indexer-examples-spring
---
[INFO] Installing <https://builds.apache.org/job/maven-indexer/ws/indexer-examples/indexer-examples-spring/target/indexer-examples-spring-6.0-SNAPSHOT.jar>
to /jenkins/maven-repositories/0/org/apache/maven/indexer/indexer-examples-spring/6.0-SNAPSHOT/indexer-examples-spring-6.0-SNAPSHOT.jar
[INFO] Installing <https://builds.apache.org/job/maven-indexer/ws/indexer-examples/indexer-examples-spring/pom.xml>
to /jenkins/maven-repositories/0/org/apache/maven/indexer/indexer-examples-spring/6.0-SNAPSHOT/indexer-examples-spring-6.0-SNAPSHOT.pom
[INFO]                                                                         
[INFO] ------------------------------------------------------------------------
[INFO] Building Maven :: Indexer Examples 6.0-SNAPSHOT
[INFO] ------------------------------------------------------------------------
[INFO] 
[INFO] --- maven-clean-plugin:2.5:clean (default-clean) @ indexer-examples ---
[INFO] 
[INFO] --- maven-enforcer-plugin:1.3.1:enforce (enforce-bytecode-version) @ indexer-examples
---
[INFO] 
[INFO] --- maven-enforcer-plugin:1.3.1:enforce (ban-known-bad-maven-versions) @ indexer-examples
---
[INFO] 
[INFO] --- maven-remote-resources-plugin:1.5:process (default) @ indexer-examples ---
[INFO] 
[INFO] --- animal-sniffer-maven-plugin:1.11:check (check-java-1.7-compat) @ indexer-examples
---
[INFO] Checking unresolved references to org.codehaus.mojo.signature:java17:1.0
[INFO] 
[INFO] --- apache-rat-plugin:0.10:check (rat-verify) @ indexer-examples ---
[INFO] 53 implicit excludes (use -debug for more details).
[INFO] Exclude: README.md
[INFO] Exclude: .gitignore
[INFO] Exclude: NOTICE
[INFO] Exclude: .git/**
[INFO] Exclude: .idea/**
[INFO] Exclude: src/test/**/*.sha1
[INFO] Exclude: src/test/**/*.md5
[INFO] Exclude: src/test/**/*.xml
[INFO] Exclude: src/test/**/*.pom
[INFO] Exclude: src/test/**/*.asc
[INFO] Exclude: src/test/**/*.properties
[INFO] Exclude: src/test/**/*.swc
[INFO] Exclude: src/test/**/*.txt
[INFO] Exclude: src/test/**/*.filename
[INFO] Exclude: src/test/**/.placeholder
[INFO] 1 resources included (use -debug for more details)
[INFO] Rat check: Summary of files. Unapproved: 0 unknown: 0 generated: 0 approved: 1 licence.
[INFO] 
[INFO] --- maven-site-plugin:3.3:attach-descriptor (attach-descriptor) @ indexer-examples
---
[INFO] 
[INFO] --- maven-install-plugin:2.5.1:install (default-install) @ indexer-examples ---
[INFO] Installing <https://builds.apache.org/job/maven-indexer/ws/indexer-examples/pom.xml>
to /jenkins/maven-repositories/0/org/apache/maven/indexer/indexer-examples/6.0-SNAPSHOT/indexer-examples-6.0-SNAPSHOT.pom
[INFO] ------------------------------------------------------------------------
[INFO] Reactor Summary:
[INFO] 
[INFO] Maven-Indexer ..................................... SUCCESS [1:45.157s]
[INFO] Maven :: Indexer Core ............................. SUCCESS [2:17.979s]
[INFO] Maven :: Indexer CLI .............................. SUCCESS [50.750s]
[INFO] Maven :: Indexer Examples [Basic] ................. SUCCESS [12.152s]
[INFO] Maven :: Indexer Examples [Spring] ................ SUCCESS [12.679s]
[INFO] Maven :: Indexer Examples ......................... SUCCESS [6.065s]
[INFO] ------------------------------------------------------------------------
[INFO] BUILD SUCCESS
[INFO] ------------------------------------------------------------------------
[INFO] Total time: 5:53.709s
[INFO] Finished at: Thu Sep 11 22:20:28 UTC 2014
[INFO] Final Memory: 42M/322M
[INFO] ------------------------------------------------------------------------
Waiting for Jenkins to finish collecting data
[JENKINS] Archiving <https://builds.apache.org/job/maven-indexer/ws/indexer-examples/indexer-examples-basic/pom.xml>
to org.apache.maven.indexer/indexer-examples-basic/6.0-SNAPSHOT/indexer-examples-basic-6.0-SNAPSHOT.pom
[JENKINS] Archiving <https://builds.apache.org/job/maven-indexer/ws/indexer-examples/indexer-examples-basic/target/indexer-examples-basic-6.0-SNAPSHOT.jar>
to org.apache.maven.indexer/indexer-examples-basic/6.0-SNAPSHOT/indexer-examples-basic-6.0-SNAPSHOT.jar
Sending artifact delta relative to maven-indexer » Maven :: Indexer Examples [Basic] #220
Archived 2 artifacts
Archive block size is 32768
Received 0 blocks and 20575 bytes
Compression is 0.0%
Took 0.31 sec
[JENKINS] Archiving <https://builds.apache.org/job/maven-indexer/ws/pom.xml> to org.apache.maven.indexer/maven-indexer/6.0-SNAPSHOT/maven-indexer-6.0-SNAPSHOT.pom
[JENKINS] Archiving <https://builds.apache.org/job/maven-indexer/ws/target/maven-indexer-6.0-SNAPSHOT-site.xml>
to org.apache.maven.indexer/maven-indexer/6.0-SNAPSHOT/maven-indexer-6.0-SNAPSHOT-site.xml
Sending artifact delta relative to maven-indexer » Maven-Indexer #220
Archived 2 artifacts
Archive block size is 32768
Received 0 blocks and 20196 bytes
Compression is 0.0%
Took 0.39 sec
[JENKINS] Archiving <https://builds.apache.org/job/maven-indexer/ws/indexer-examples/pom.xml>
to org.apache.maven.indexer/indexer-examples/6.0-SNAPSHOT/indexer-examples-6.0-SNAPSHOT.pom
Sending artifact delta relative to maven-indexer » Maven :: Indexer Examples #220
Archived 1 artifacts
Archive block size is 32768
Received 0 blocks and 1660 bytes
Compression is 0.0%
Took 2.1 sec
[JENKINS] Archiving <https://builds.apache.org/job/maven-indexer/ws/indexer-examples/indexer-examples-spring/pom.xml>
to org.apache.maven.indexer/indexer-examples-spring/6.0-SNAPSHOT/indexer-examples-spring-6.0-SNAPSHOT.pom
[JENKINS] Archiving <https://builds.apache.org/job/maven-indexer/ws/indexer-examples/indexer-examples-spring/target/indexer-examples-spring-6.0-SNAPSHOT.jar>
to org.apache.maven.indexer/indexer-examples-spring/6.0-SNAPSHOT/indexer-examples-spring-6.0-SNAPSHOT.jar
Sending artifact delta relative to maven-indexer » Maven :: Indexer Examples [Spring] #220
Archived 2 artifacts
Archive block size is 32768
Received 0 blocks and 32921 bytes
Compression is 0.0%
Took 0.33 sec
[JENKINS] Archiving <https://builds.apache.org/job/maven-indexer/ws/indexer-core/pom.xml>
to org.apache.maven.indexer/indexer-core/6.0-SNAPSHOT/indexer-core-6.0-SNAPSHOT.pom
[JENKINS] Archiving <https://builds.apache.org/job/maven-indexer/ws/indexer-core/target/indexer-core-6.0-SNAPSHOT.jar>
to org.apache.maven.indexer/indexer-core/6.0-SNAPSHOT/indexer-core-6.0-SNAPSHOT.jar
Sending artifact delta relative to maven-indexer » Maven :: Indexer Core #220
Archived 2 artifacts
Archive block size is 32768
Received 0 blocks and 258023 bytes
Compression is 0.0%
Took 0.48 sec
[JENKINS] Archiving <https://builds.apache.org/job/maven-indexer/ws/indexer-cli/pom.xml>
to org.apache.maven.indexer/indexer-cli/6.0-SNAPSHOT/indexer-cli-6.0-SNAPSHOT.pom
[JENKINS] Archiving <https://builds.apache.org/job/maven-indexer/ws/indexer-cli/target/indexer-cli-6.0-SNAPSHOT.jar>
to org.apache.maven.indexer/indexer-cli/6.0-SNAPSHOT/indexer-cli-6.0-SNAPSHOT.jar
Sending artifact delta relative to maven-indexer » Maven :: Indexer CLI #220
Archived 2 artifacts
Archive block size is 32768
Received 10 blocks and 12001894 bytes
Compression is 2.7%
Took 17 sec
channel stopped
Maven RedeployPublisher use remote jenkins-ubuntu-1404-4gb-7e4 maven settings from : /home/jenkins/.m2/settings.xml
[INFO] Deployment in https://repository.apache.org/content/repositories/snapshots (id=apache.snapshots.https,uniqueVersion=true)
Deploying the main artifact indexer-cli-6.0-SNAPSHOT.jar
Downloading: https://repository.apache.org/content/repositories/snapshots/org/apache/maven/indexer/indexer-cli/6.0-SNAPSHOT/maven-metadata.xml
Downloaded: https://repository.apache.org/content/repositories/snapshots/org/apache/maven/indexer/indexer-cli/6.0-SNAPSHOT/maven-metadata.xml
(785 B at 0.3 KB/sec)
Uploading: https://repository.apache.org/content/repositories/snapshots/org/apache/maven/indexer/indexer-cli/6.0-SNAPSHOT/indexer-cli-6.0-20140911.222127-123.jar
Uploading: https://repository.apache.org/content/repositories/snapshots/org/apache/maven/indexer/indexer-cli/6.0-SNAPSHOT/indexer-cli-6.0-20140911.222127-123.pom
ERROR: Failed to deploy artifacts: Could not transfer artifact org.apache.maven.indexer:indexer-cli:jar:6.0-20140911.222127-123
from/to apache.snapshots.https (https://repository.apache.org/content/repositories/snapshots):
Failed to transfer file: https://repository.apache.org/content/repositories/snapshots/org/apache/maven/indexer/indexer-cli/6.0-SNAPSHOT/indexer-cli-6.0-20140911.222127-123.jar.
Return code is: 401, ReasonPhrase: Unauthorized.
org.apache.maven.artifact.deployer.ArtifactDeploymentException: Failed to deploy artifacts:
Could not transfer artifact org.apache.maven.indexer:indexer-cli:jar:6.0-20140911.222127-123
from/to apache.snapshots.https (https://repository.apache.org/content/repositories/snapshots):
Failed to transfer file: https://repository.apache.org/content/repositories/snapshots/org/apache/maven/indexer/indexer-cli/6.0-SNAPSHOT/indexer-cli-6.0-20140911.222127-123.jar.
Return code is: 401, ReasonPhrase: Unauthorized.
	at org.apache.maven.artifact.deployer.DefaultArtifactDeployer.deploy(DefaultArtifactDeployer.java:143)
	at hudson.maven.reporters.MavenArtifactRecord.deploy(MavenArtifactRecord.java:193)
	at hudson.maven.RedeployPublisher.perform(RedeployPublisher.java:176)
	at hudson.tasks.BuildStepMonitor$1.perform(BuildStepMonitor.java:20)
	at hudson.model.AbstractBuild$AbstractBuildExecution.perform(AbstractBuild.java:804)
	at hudson.model.AbstractBuild$AbstractBuildExecution.performAllBuildSteps(AbstractBuild.java:776)
	at hudson.maven.MavenModuleSetBuild$MavenModuleSetBuildExecution.post2(MavenModuleSetBuild.java:1040)
	at hudson.model.AbstractBuild$AbstractBuildExecution.post(AbstractBuild.java:725)
	at hudson.model.Run.execute(Run.java:1701)
	at hudson.maven.MavenModuleSetBuild.run(MavenModuleSetBuild.java:529)
	at hudson.model.ResourceController.execute(ResourceController.java:88)
	at hudson.model.Executor.run(Executor.java:231)
Caused by: org.eclipse.aether.deployment.DeploymentException: Failed to deploy artifacts:
Could not transfer artifact org.apache.maven.indexer:indexer-cli:jar:6.0-20140911.222127-123
from/to apache.snapshots.https (https://repository.apache.org/content/repositories/snapshots):
Failed to transfer file: https://repository.apache.org/content/repositories/snapshots/org/apache/maven/indexer/indexer-cli/6.0-SNAPSHOT/indexer-cli-6.0-20140911.222127-123.jar.
Return code is: 401, ReasonPhrase: Unauthorized.
	at org.eclipse.aether.internal.impl.DefaultDeployer.deploy(DefaultDeployer.java:341)
	at org.eclipse.aether.internal.impl.DefaultDeployer.deploy(DefaultDeployer.java:269)
	at org.eclipse.aether.internal.impl.DefaultRepositorySystem.deploy(DefaultRepositorySystem.java:413)
	at org.apache.maven.artifact.deployer.DefaultArtifactDeployer.deploy(DefaultArtifactDeployer.java:139)
	... 11 more
Caused by: org.eclipse.aether.transfer.ArtifactTransferException: Could not transfer artifact
org.apache.maven.indexer:indexer-cli:jar:6.0-20140911.222127-123 from/to apache.snapshots.https
(https://repository.apache.org/content/repositories/snapshots): Failed to transfer file: https://repository.apache.org/content/repositories/snapshots/org/apache/maven/indexer/indexer-cli/6.0-SNAPSHOT/indexer-cli-6.0-20140911.222127-123.jar.
Return code is: 401, ReasonPhrase: Unauthorized.
	at org.eclipse.aether.connector.wagon.WagonRepositoryConnector$6.wrap(WagonRepositoryConnector.java:1016)
	at org.eclipse.aether.connector.wagon.WagonRepositoryConnector$6.wrap(WagonRepositoryConnector.java:1004)
	at org.eclipse.aether.connector.wagon.WagonRepositoryConnector$PutTask.run(WagonRepositoryConnector.java:895)
	at org.eclipse.aether.connector.wagon.WagonRepositoryConnector.put(WagonRepositoryConnector.java:522)
	at org.eclipse.aether.internal.impl.DefaultDeployer.deploy(DefaultDeployer.java:335)
	... 14 more
Caused by: org.apache.maven.wagon.TransferFailedException: Failed to transfer file: https://repository.apache.org/content/repositories/snapshots/org/apache/maven/indexer/indexer-cli/6.0-SNAPSHOT/indexer-cli-6.0-20140911.222127-123.jar.
Return code is: 401, ReasonPhrase: Unauthorized.
	at org.apache.maven.wagon.shared.http4.AbstractHttpClientWagon.put(AbstractHttpClientWagon.java:626)
	at org.apache.maven.wagon.shared.http4.AbstractHttpClientWagon.put(AbstractHttpClientWagon.java:524)
	at org.apache.maven.wagon.shared.http4.AbstractHttpClientWagon.put(AbstractHttpClientWagon.java:505)
	at org.apache.maven.wagon.shared.http4.AbstractHttpClientWagon.put(AbstractHttpClientWagon.java:485)
	at org.eclipse.aether.connector.wagon.WagonRepositoryConnector$PutTask.run(WagonRepositoryConnector.java:871)
	... 16 more
[INFO] Deployment failed after 8.7 sec
Build step 'Deploy artifacts to Maven repository' changed build result to FAILURE

Mime
View raw message