maven-notifications mailing list archives

Site index · List index
Message view « Date » · « Thread »
Top « Date » · « Thread »
From Apache Jenkins Server <jenk...@builds.apache.org>
Subject Build failed in Jenkins: maven-plugins-ITs-m3-windows #694
Date Sun, 14 Sep 2014 02:22:36 GMT
See <https://builds.apache.org/job/maven-plugins-ITs-m3-windows/694/changes>

Changes:

[hboutemy] remove copy/paste since code is now inherited through MSHARED-347

------------------------------------------
[...truncated 11159 lines...]
[INFO] Installing F:\hudson\hudson-slave\workspace\maven-plugins-ITs-m3-windows\maven-docck-plugin\target\maven-docck-plugin-1.1-SNAPSHOT.jar
to F:\hudson\hudson-slave\workspace\maven-plugins-ITs-m3-windows\maven-scm-publish-plugin\target\local-repo\org\apache\maven\plugins\maven-docck-plugin\1.1-SNAPSHOT\maven-docck-plugin-1.1-SNAPSHOT.jar
[INFO] Installing F:\hudson\hudson-slave\workspace\maven-plugins-ITs-m3-windows\maven-docck-plugin\pom.xml
to F:\hudson\hudson-slave\workspace\maven-plugins-ITs-m3-windows\maven-scm-publish-plugin\target\local-repo\org\apache\maven\plugins\maven-docck-plugin\1.1-SNAPSHOT\maven-docck-plugin-1.1-SNAPSHOT.pom
[INFO] Installing F:\hudson\hudson-slave\workspace\maven-plugins-ITs-m3-windows\maven-ear-plugin\pom.xml
to F:\hudson\hudson-slave\workspace\maven-plugins-ITs-m3-windows\maven-scm-publish-plugin\target\local-repo\org\apache\maven\plugins\maven-ear-plugin\2.10-SNAPSHOT\maven-ear-plugin-2.10-SNAPSHOT.pom
[INFO] Installing F:\hudson\hudson-slave\workspace\maven-plugins-ITs-m3-windows\maven-ear-plugin\target\maven-ear-plugin-2.10-SNAPSHOT.jar
to F:\hudson\hudson-slave\workspace\maven-plugins-ITs-m3-windows\maven-scm-publish-plugin\target\local-repo\org\apache\maven\plugins\maven-ear-plugin\2.10-SNAPSHOT\maven-ear-plugin-2.10-SNAPSHOT.jar
[INFO] Installing F:\hudson\hudson-slave\workspace\maven-plugins-ITs-m3-windows\maven-ear-plugin\pom.xml
to F:\hudson\hudson-slave\workspace\maven-plugins-ITs-m3-windows\maven-scm-publish-plugin\target\local-repo\org\apache\maven\plugins\maven-ear-plugin\2.10-SNAPSHOT\maven-ear-plugin-2.10-SNAPSHOT.pom
[INFO] Installing F:\hudson\hudson-slave\workspace\maven-plugins-ITs-m3-windows\maven-ejb-plugin\pom.xml
to F:\hudson\hudson-slave\workspace\maven-plugins-ITs-m3-windows\maven-scm-publish-plugin\target\local-repo\org\apache\maven\plugins\maven-ejb-plugin\2.5-SNAPSHOT\maven-ejb-plugin-2.5-SNAPSHOT.pom
[INFO] Installing F:\hudson\hudson-slave\workspace\maven-plugins-ITs-m3-windows\maven-ejb-plugin\target\maven-ejb-plugin-2.5-SNAPSHOT.jar
to F:\hudson\hudson-slave\workspace\maven-plugins-ITs-m3-windows\maven-scm-publish-plugin\target\local-repo\org\apache\maven\plugins\maven-ejb-plugin\2.5-SNAPSHOT\maven-ejb-plugin-2.5-SNAPSHOT.jar
[INFO] Installing F:\hudson\hudson-slave\workspace\maven-plugins-ITs-m3-windows\maven-ejb-plugin\pom.xml
to F:\hudson\hudson-slave\workspace\maven-plugins-ITs-m3-windows\maven-scm-publish-plugin\target\local-repo\org\apache\maven\plugins\maven-ejb-plugin\2.5-SNAPSHOT\maven-ejb-plugin-2.5-SNAPSHOT.pom
[INFO] Installing F:\hudson\hudson-slave\workspace\maven-plugins-ITs-m3-windows\maven-help-plugin\pom.xml
to F:\hudson\hudson-slave\workspace\maven-plugins-ITs-m3-windows\maven-scm-publish-plugin\target\local-repo\org\apache\maven\plugins\maven-help-plugin\2.2.1-SNAPSHOT\maven-help-plugin-2.2.1-SNAPSHOT.pom
[INFO] Installing F:\hudson\hudson-slave\workspace\maven-plugins-ITs-m3-windows\maven-help-plugin\target\maven-help-plugin-2.2.1-SNAPSHOT.jar
to F:\hudson\hudson-slave\workspace\maven-plugins-ITs-m3-windows\maven-scm-publish-plugin\target\local-repo\org\apache\maven\plugins\maven-help-plugin\2.2.1-SNAPSHOT\maven-help-plugin-2.2.1-SNAPSHOT.jar
[INFO] Installing F:\hudson\hudson-slave\workspace\maven-plugins-ITs-m3-windows\maven-help-plugin\pom.xml
to F:\hudson\hudson-slave\workspace\maven-plugins-ITs-m3-windows\maven-scm-publish-plugin\target\local-repo\org\apache\maven\plugins\maven-help-plugin\2.2.1-SNAPSHOT\maven-help-plugin-2.2.1-SNAPSHOT.pom
[INFO] Installing F:\hudson\hudson-slave\workspace\maven-plugins-ITs-m3-windows\maven-install-plugin\pom.xml
to F:\hudson\hudson-slave\workspace\maven-plugins-ITs-m3-windows\maven-scm-publish-plugin\target\local-repo\org\apache\maven\plugins\maven-install-plugin\2.5.3-SNAPSHOT\maven-install-plugin-2.5.3-SNAPSHOT.pom
[INFO] Installing F:\hudson\hudson-slave\workspace\maven-plugins-ITs-m3-windows\maven-install-plugin\target\maven-install-plugin-2.5.3-SNAPSHOT.jar
to F:\hudson\hudson-slave\workspace\maven-plugins-ITs-m3-windows\maven-scm-publish-plugin\target\local-repo\org\apache\maven\plugins\maven-install-plugin\2.5.3-SNAPSHOT\maven-install-plugin-2.5.3-SNAPSHOT.jar
[INFO] Installing F:\hudson\hudson-slave\workspace\maven-plugins-ITs-m3-windows\maven-install-plugin\pom.xml
to F:\hudson\hudson-slave\workspace\maven-plugins-ITs-m3-windows\maven-scm-publish-plugin\target\local-repo\org\apache\maven\plugins\maven-install-plugin\2.5.3-SNAPSHOT\maven-install-plugin-2.5.3-SNAPSHOT.pom
[INFO] Installing F:\hudson\hudson-slave\workspace\maven-plugins-ITs-m3-windows\maven-jar-plugin\pom.xml
to F:\hudson\hudson-slave\workspace\maven-plugins-ITs-m3-windows\maven-scm-publish-plugin\target\local-repo\org\apache\maven\plugins\maven-jar-plugin\2.6-SNAPSHOT\maven-jar-plugin-2.6-SNAPSHOT.pom
[INFO] Installing F:\hudson\hudson-slave\workspace\maven-plugins-ITs-m3-windows\maven-jar-plugin\target\maven-jar-plugin-2.6-SNAPSHOT.jar
to F:\hudson\hudson-slave\workspace\maven-plugins-ITs-m3-windows\maven-scm-publish-plugin\target\local-repo\org\apache\maven\plugins\maven-jar-plugin\2.6-SNAPSHOT\maven-jar-plugin-2.6-SNAPSHOT.jar
[INFO] Installing F:\hudson\hudson-slave\workspace\maven-plugins-ITs-m3-windows\maven-jar-plugin\pom.xml
to F:\hudson\hudson-slave\workspace\maven-plugins-ITs-m3-windows\maven-scm-publish-plugin\target\local-repo\org\apache\maven\plugins\maven-jar-plugin\2.6-SNAPSHOT\maven-jar-plugin-2.6-SNAPSHOT.pom
[INFO] Installing F:\hudson\hudson-slave\workspace\maven-plugins-ITs-m3-windows\maven-jarsigner-plugin\pom.xml
to F:\hudson\hudson-slave\workspace\maven-plugins-ITs-m3-windows\maven-scm-publish-plugin\target\local-repo\org\apache\maven\plugins\maven-jarsigner-plugin\1.4-SNAPSHOT\maven-jarsigner-plugin-1.4-SNAPSHOT.pom
[INFO] Installing F:\hudson\hudson-slave\workspace\maven-plugins-ITs-m3-windows\maven-jarsigner-plugin\target\maven-jarsigner-plugin-1.4-SNAPSHOT.jar
to F:\hudson\hudson-slave\workspace\maven-plugins-ITs-m3-windows\maven-scm-publish-plugin\target\local-repo\org\apache\maven\plugins\maven-jarsigner-plugin\1.4-SNAPSHOT\maven-jarsigner-plugin-1.4-SNAPSHOT.jar
[INFO] Installing F:\hudson\hudson-slave\workspace\maven-plugins-ITs-m3-windows\maven-jarsigner-plugin\pom.xml
to F:\hudson\hudson-slave\workspace\maven-plugins-ITs-m3-windows\maven-scm-publish-plugin\target\local-repo\org\apache\maven\plugins\maven-jarsigner-plugin\1.4-SNAPSHOT\maven-jarsigner-plugin-1.4-SNAPSHOT.pom
[INFO] Installing F:\hudson\hudson-slave\workspace\maven-plugins-ITs-m3-windows\maven-javadoc-plugin\pom.xml
to F:\hudson\hudson-slave\workspace\maven-plugins-ITs-m3-windows\maven-scm-publish-plugin\target\local-repo\org\apache\maven\plugins\maven-javadoc-plugin\2.10-SNAPSHOT\maven-javadoc-plugin-2.10-SNAPSHOT.pom
[INFO] Installing F:\hudson\hudson-slave\workspace\maven-plugins-ITs-m3-windows\maven-javadoc-plugin\target\maven-javadoc-plugin-2.10-SNAPSHOT.jar
to F:\hudson\hudson-slave\workspace\maven-plugins-ITs-m3-windows\maven-scm-publish-plugin\target\local-repo\org\apache\maven\plugins\maven-javadoc-plugin\2.10-SNAPSHOT\maven-javadoc-plugin-2.10-SNAPSHOT.jar
[INFO] Installing F:\hudson\hudson-slave\workspace\maven-plugins-ITs-m3-windows\maven-javadoc-plugin\pom.xml
to F:\hudson\hudson-slave\workspace\maven-plugins-ITs-m3-windows\maven-scm-publish-plugin\target\local-repo\org\apache\maven\plugins\maven-javadoc-plugin\2.10-SNAPSHOT\maven-javadoc-plugin-2.10-SNAPSHOT.pom
[INFO] Installing F:\hudson\hudson-slave\workspace\maven-plugins-ITs-m3-windows\maven-linkcheck-plugin\pom.xml
to F:\hudson\hudson-slave\workspace\maven-plugins-ITs-m3-windows\maven-scm-publish-plugin\target\local-repo\org\apache\maven\plugins\maven-linkcheck-plugin\1.2-SNAPSHOT\maven-linkcheck-plugin-1.2-SNAPSHOT.pom
[INFO] Installing F:\hudson\hudson-slave\workspace\maven-plugins-ITs-m3-windows\maven-linkcheck-plugin\target\maven-linkcheck-plugin-1.2-SNAPSHOT.jar
to F:\hudson\hudson-slave\workspace\maven-plugins-ITs-m3-windows\maven-scm-publish-plugin\target\local-repo\org\apache\maven\plugins\maven-linkcheck-plugin\1.2-SNAPSHOT\maven-linkcheck-plugin-1.2-SNAPSHOT.jar
[INFO] Installing F:\hudson\hudson-slave\workspace\maven-plugins-ITs-m3-windows\maven-linkcheck-plugin\pom.xml
to F:\hudson\hudson-slave\workspace\maven-plugins-ITs-m3-windows\maven-scm-publish-plugin\target\local-repo\org\apache\maven\plugins\maven-linkcheck-plugin\1.2-SNAPSHOT\maven-linkcheck-plugin-1.2-SNAPSHOT.pom
[INFO] Installing F:\hudson\hudson-slave\workspace\maven-plugins-ITs-m3-windows\maven-patch-plugin\pom.xml
to F:\hudson\hudson-slave\workspace\maven-plugins-ITs-m3-windows\maven-scm-publish-plugin\target\local-repo\org\apache\maven\plugins\maven-patch-plugin\1.2-SNAPSHOT\maven-patch-plugin-1.2-SNAPSHOT.pom
[INFO] Installing F:\hudson\hudson-slave\workspace\maven-plugins-ITs-m3-windows\maven-patch-plugin\target\maven-patch-plugin-1.2-SNAPSHOT.jar
to F:\hudson\hudson-slave\workspace\maven-plugins-ITs-m3-windows\maven-scm-publish-plugin\target\local-repo\org\apache\maven\plugins\maven-patch-plugin\1.2-SNAPSHOT\maven-patch-plugin-1.2-SNAPSHOT.jar
[INFO] Installing F:\hudson\hudson-slave\workspace\maven-plugins-ITs-m3-windows\maven-patch-plugin\pom.xml
to F:\hudson\hudson-slave\workspace\maven-plugins-ITs-m3-windows\maven-scm-publish-plugin\target\local-repo\org\apache\maven\plugins\maven-patch-plugin\1.2-SNAPSHOT\maven-patch-plugin-1.2-SNAPSHOT.pom
[INFO] Installing F:\hudson\hudson-slave\workspace\maven-plugins-ITs-m3-windows\maven-pdf-plugin\pom.xml
to F:\hudson\hudson-slave\workspace\maven-plugins-ITs-m3-windows\maven-scm-publish-plugin\target\local-repo\org\apache\maven\plugins\maven-pdf-plugin\1.3-SNAPSHOT\maven-pdf-plugin-1.3-SNAPSHOT.pom
[INFO] Installing F:\hudson\hudson-slave\workspace\maven-plugins-ITs-m3-windows\maven-pdf-plugin\target\maven-pdf-plugin-1.3-SNAPSHOT.jar
to F:\hudson\hudson-slave\workspace\maven-plugins-ITs-m3-windows\maven-scm-publish-plugin\target\local-repo\org\apache\maven\plugins\maven-pdf-plugin\1.3-SNAPSHOT\maven-pdf-plugin-1.3-SNAPSHOT.jar
[INFO] Installing F:\hudson\hudson-slave\workspace\maven-plugins-ITs-m3-windows\maven-pdf-plugin\pom.xml
to F:\hudson\hudson-slave\workspace\maven-plugins-ITs-m3-windows\maven-scm-publish-plugin\target\local-repo\org\apache\maven\plugins\maven-pdf-plugin\1.3-SNAPSHOT\maven-pdf-plugin-1.3-SNAPSHOT.pom
[INFO] Installing F:\hudson\hudson-slave\workspace\maven-plugins-ITs-m3-windows\maven-rar-plugin\pom.xml
to F:\hudson\hudson-slave\workspace\maven-plugins-ITs-m3-windows\maven-scm-publish-plugin\target\local-repo\org\apache\maven\plugins\maven-rar-plugin\2.5-SNAPSHOT\maven-rar-plugin-2.5-SNAPSHOT.pom
[INFO] Installing F:\hudson\hudson-slave\workspace\maven-plugins-ITs-m3-windows\maven-rar-plugin\target\maven-rar-plugin-2.5-SNAPSHOT.jar
to F:\hudson\hudson-slave\workspace\maven-plugins-ITs-m3-windows\maven-scm-publish-plugin\target\local-repo\org\apache\maven\plugins\maven-rar-plugin\2.5-SNAPSHOT\maven-rar-plugin-2.5-SNAPSHOT.jar
[INFO] Installing F:\hudson\hudson-slave\workspace\maven-plugins-ITs-m3-windows\maven-rar-plugin\pom.xml
to F:\hudson\hudson-slave\workspace\maven-plugins-ITs-m3-windows\maven-scm-publish-plugin\target\local-repo\org\apache\maven\plugins\maven-rar-plugin\2.5-SNAPSHOT\maven-rar-plugin-2.5-SNAPSHOT.pom
[INFO] Installing F:\hudson\hudson-slave\workspace\maven-plugins-ITs-m3-windows\maven-repository-plugin\pom.xml
to F:\hudson\hudson-slave\workspace\maven-plugins-ITs-m3-windows\maven-scm-publish-plugin\target\local-repo\org\apache\maven\plugins\maven-repository-plugin\2.3.2-SNAPSHOT\maven-repository-plugin-2.3.2-SNAPSHOT.pom
[INFO] Installing F:\hudson\hudson-slave\workspace\maven-plugins-ITs-m3-windows\maven-repository-plugin\target\maven-repository-plugin-2.3.2-SNAPSHOT.jar
to F:\hudson\hudson-slave\workspace\maven-plugins-ITs-m3-windows\maven-scm-publish-plugin\target\local-repo\org\apache\maven\plugins\maven-repository-plugin\2.3.2-SNAPSHOT\maven-repository-plugin-2.3.2-SNAPSHOT.jar
[INFO] Installing F:\hudson\hudson-slave\workspace\maven-plugins-ITs-m3-windows\maven-repository-plugin\pom.xml
to F:\hudson\hudson-slave\workspace\maven-plugins-ITs-m3-windows\maven-scm-publish-plugin\target\local-repo\org\apache\maven\plugins\maven-repository-plugin\2.3.2-SNAPSHOT\maven-repository-plugin-2.3.2-SNAPSHOT.pom
[INFO] Installing F:\hudson\hudson-slave\workspace\maven-plugins-ITs-m3-windows\maven-resources-plugin\pom.xml
to F:\hudson\hudson-slave\workspace\maven-plugins-ITs-m3-windows\maven-scm-publish-plugin\target\local-repo\org\apache\maven\plugins\maven-resources-plugin\2.7-SNAPSHOT\maven-resources-plugin-2.7-SNAPSHOT.pom
[INFO] Installing F:\hudson\hudson-slave\workspace\maven-plugins-ITs-m3-windows\maven-resources-plugin\target\maven-resources-plugin-2.7-SNAPSHOT.jar
to F:\hudson\hudson-slave\workspace\maven-plugins-ITs-m3-windows\maven-scm-publish-plugin\target\local-repo\org\apache\maven\plugins\maven-resources-plugin\2.7-SNAPSHOT\maven-resources-plugin-2.7-SNAPSHOT.jar
[INFO] Installing F:\hudson\hudson-slave\workspace\maven-plugins-ITs-m3-windows\maven-resources-plugin\pom.xml
to F:\hudson\hudson-slave\workspace\maven-plugins-ITs-m3-windows\maven-scm-publish-plugin\target\local-repo\org\apache\maven\plugins\maven-resources-plugin\2.7-SNAPSHOT\maven-resources-plugin-2.7-SNAPSHOT.pom
[INFO] Installing F:\hudson\hudson-slave\workspace\maven-plugins-ITs-m3-windows\maven-resources-plugin\target\maven-resources-plugin-2.7-SNAPSHOT-tests.jar
to F:\hudson\hudson-slave\workspace\maven-plugins-ITs-m3-windows\maven-scm-publish-plugin\target\local-repo\org\apache\maven\plugins\maven-resources-plugin\2.7-SNAPSHOT\maven-resources-plugin-2.7-SNAPSHOT-tests.jar
[INFO] Installing F:\hudson\hudson-slave\workspace\maven-plugins-ITs-m3-windows\maven-site-plugin\dependency-reduced-pom.xml
to F:\hudson\hudson-slave\workspace\maven-plugins-ITs-m3-windows\maven-scm-publish-plugin\target\local-repo\org\apache\maven\plugins\maven-site-plugin\3.4.1-SNAPSHOT\maven-site-plugin-3.4.1-SNAPSHOT.pom
[INFO] Installing F:\hudson\hudson-slave\workspace\maven-plugins-ITs-m3-windows\maven-site-plugin\target\maven-site-plugin-3.4.1-SNAPSHOT.jar
to F:\hudson\hudson-slave\workspace\maven-plugins-ITs-m3-windows\maven-scm-publish-plugin\target\local-repo\org\apache\maven\plugins\maven-site-plugin\3.4.1-SNAPSHOT\maven-site-plugin-3.4.1-SNAPSHOT.jar
[INFO] Installing F:\hudson\hudson-slave\workspace\maven-plugins-ITs-m3-windows\maven-site-plugin\dependency-reduced-pom.xml
to F:\hudson\hudson-slave\workspace\maven-plugins-ITs-m3-windows\maven-scm-publish-plugin\target\local-repo\org\apache\maven\plugins\maven-site-plugin\3.4.1-SNAPSHOT\maven-site-plugin-3.4.1-SNAPSHOT.pom
[INFO] Installing F:\hudson\hudson-slave\workspace\maven-plugins-ITs-m3-windows\maven-source-plugin\pom.xml
to F:\hudson\hudson-slave\workspace\maven-plugins-ITs-m3-windows\maven-scm-publish-plugin\target\local-repo\org\apache\maven\plugins\maven-source-plugin\2.4-SNAPSHOT\maven-source-plugin-2.4-SNAPSHOT.pom
[INFO] Installing F:\hudson\hudson-slave\workspace\maven-plugins-ITs-m3-windows\maven-source-plugin\target\maven-source-plugin-2.4-SNAPSHOT.jar
to F:\hudson\hudson-slave\workspace\maven-plugins-ITs-m3-windows\maven-scm-publish-plugin\target\local-repo\org\apache\maven\plugins\maven-source-plugin\2.4-SNAPSHOT\maven-source-plugin-2.4-SNAPSHOT.jar
[INFO] Installing F:\hudson\hudson-slave\workspace\maven-plugins-ITs-m3-windows\maven-source-plugin\pom.xml
to F:\hudson\hudson-slave\workspace\maven-plugins-ITs-m3-windows\maven-scm-publish-plugin\target\local-repo\org\apache\maven\plugins\maven-source-plugin\2.4-SNAPSHOT\maven-source-plugin-2.4-SNAPSHOT.pom
[INFO] Installing F:\hudson\hudson-slave\workspace\maven-plugins-ITs-m3-windows\maven-stage-plugin\pom.xml
to F:\hudson\hudson-slave\workspace\maven-plugins-ITs-m3-windows\maven-scm-publish-plugin\target\local-repo\org\apache\maven\plugins\maven-stage-plugin\1.0-SNAPSHOT\maven-stage-plugin-1.0-SNAPSHOT.pom
[INFO] Installing F:\hudson\hudson-slave\workspace\maven-plugins-ITs-m3-windows\maven-stage-plugin\target\maven-stage-plugin-1.0-SNAPSHOT.jar
to F:\hudson\hudson-slave\workspace\maven-plugins-ITs-m3-windows\maven-scm-publish-plugin\target\local-repo\org\apache\maven\plugins\maven-stage-plugin\1.0-SNAPSHOT\maven-stage-plugin-1.0-SNAPSHOT.jar
[INFO] Installing F:\hudson\hudson-slave\workspace\maven-plugins-ITs-m3-windows\maven-stage-plugin\pom.xml
to F:\hudson\hudson-slave\workspace\maven-plugins-ITs-m3-windows\maven-scm-publish-plugin\target\local-repo\org\apache\maven\plugins\maven-stage-plugin\1.0-SNAPSHOT\maven-stage-plugin-1.0-SNAPSHOT.pom
[INFO] Installing F:\hudson\hudson-slave\workspace\maven-plugins-ITs-m3-windows\maven-toolchains-plugin\pom.xml
to F:\hudson\hudson-slave\workspace\maven-plugins-ITs-m3-windows\maven-scm-publish-plugin\target\local-repo\org\apache\maven\plugins\maven-toolchains-plugin\1.1-SNAPSHOT\maven-toolchains-plugin-1.1-SNAPSHOT.pom
[INFO] Installing F:\hudson\hudson-slave\workspace\maven-plugins-ITs-m3-windows\maven-toolchains-plugin\target\maven-toolchains-plugin-1.1-SNAPSHOT.jar
to F:\hudson\hudson-slave\workspace\maven-plugins-ITs-m3-windows\maven-scm-publish-plugin\target\local-repo\org\apache\maven\plugins\maven-toolchains-plugin\1.1-SNAPSHOT\maven-toolchains-plugin-1.1-SNAPSHOT.jar
[INFO] Installing F:\hudson\hudson-slave\workspace\maven-plugins-ITs-m3-windows\maven-toolchains-plugin\pom.xml
to F:\hudson\hudson-slave\workspace\maven-plugins-ITs-m3-windows\maven-scm-publish-plugin\target\local-repo\org\apache\maven\plugins\maven-toolchains-plugin\1.1-SNAPSHOT\maven-toolchains-plugin-1.1-SNAPSHOT.pom
[INFO] Installing F:\hudson\hudson-slave\workspace\maven-plugins-ITs-m3-windows\maven-verifier-plugin\pom.xml
to F:\hudson\hudson-slave\workspace\maven-plugins-ITs-m3-windows\maven-scm-publish-plugin\target\local-repo\org\apache\maven\plugins\maven-verifier-plugin\1.1-SNAPSHOT\maven-verifier-plugin-1.1-SNAPSHOT.pom
[INFO] Installing F:\hudson\hudson-slave\workspace\maven-plugins-ITs-m3-windows\maven-verifier-plugin\target\maven-verifier-plugin-1.1-SNAPSHOT.jar
to F:\hudson\hudson-slave\workspace\maven-plugins-ITs-m3-windows\maven-scm-publish-plugin\target\local-repo\org\apache\maven\plugins\maven-verifier-plugin\1.1-SNAPSHOT\maven-verifier-plugin-1.1-SNAPSHOT.jar
[INFO] Installing F:\hudson\hudson-slave\workspace\maven-plugins-ITs-m3-windows\maven-verifier-plugin\pom.xml
to F:\hudson\hudson-slave\workspace\maven-plugins-ITs-m3-windows\maven-scm-publish-plugin\target\local-repo\org\apache\maven\plugins\maven-verifier-plugin\1.1-SNAPSHOT\maven-verifier-plugin-1.1-SNAPSHOT.pom
[INFO] Installing F:\hudson\hudson-slave\workspace\maven-plugins-ITs-m3-windows\maven-war-plugin\pom.xml
to F:\hudson\hudson-slave\workspace\maven-plugins-ITs-m3-windows\maven-scm-publish-plugin\target\local-repo\org\apache\maven\plugins\maven-war-plugin\2.5-SNAPSHOT\maven-war-plugin-2.5-SNAPSHOT.pom
[INFO] Installing F:\hudson\hudson-slave\workspace\maven-plugins-ITs-m3-windows\maven-war-plugin\target\maven-war-plugin-2.5-SNAPSHOT.jar
to F:\hudson\hudson-slave\workspace\maven-plugins-ITs-m3-windows\maven-scm-publish-plugin\target\local-repo\org\apache\maven\plugins\maven-war-plugin\2.5-SNAPSHOT\maven-war-plugin-2.5-SNAPSHOT.jar
[INFO] Installing F:\hudson\hudson-slave\workspace\maven-plugins-ITs-m3-windows\maven-war-plugin\pom.xml
to F:\hudson\hudson-slave\workspace\maven-plugins-ITs-m3-windows\maven-scm-publish-plugin\target\local-repo\org\apache\maven\plugins\maven-war-plugin\2.5-SNAPSHOT\maven-war-plugin-2.5-SNAPSHOT.pom
[INFO] Installing F:\hudson\hudson-slave\workspace\maven-plugins-ITs-m3-windows\maven-invoker-plugin\pom.xml
to F:\hudson\hudson-slave\workspace\maven-plugins-ITs-m3-windows\maven-scm-publish-plugin\target\local-repo\org\apache\maven\plugins\maven-invoker-plugin\1.10-SNAPSHOT\maven-invoker-plugin-1.10-SNAPSHOT.pom
[INFO] Installing F:\hudson\hudson-slave\workspace\maven-plugins-ITs-m3-windows\maven-invoker-plugin\target\maven-invoker-plugin-1.10-SNAPSHOT.jar
to F:\hudson\hudson-slave\workspace\maven-plugins-ITs-m3-windows\maven-scm-publish-plugin\target\local-repo\org\apache\maven\plugins\maven-invoker-plugin\1.10-SNAPSHOT\maven-invoker-plugin-1.10-SNAPSHOT.jar
[INFO] Installing F:\hudson\hudson-slave\workspace\maven-plugins-ITs-m3-windows\maven-invoker-plugin\pom.xml
to F:\hudson\hudson-slave\workspace\maven-plugins-ITs-m3-windows\maven-scm-publish-plugin\target\local-repo\org\apache\maven\plugins\maven-invoker-plugin\1.10-SNAPSHOT\maven-invoker-plugin-1.10-SNAPSHOT.pom
[INFO] Installing F:\hudson\hudson-slave\workspace\maven-plugins-ITs-m3-windows\maven-project-info-reports-plugin\pom.xml
to F:\hudson\hudson-slave\workspace\maven-plugins-ITs-m3-windows\maven-scm-publish-plugin\target\local-repo\org\apache\maven\plugins\maven-project-info-reports-plugin\2.8-SNAPSHOT\maven-project-info-reports-plugin-2.8-SNAPSHOT.pom
[INFO] Installing F:\hudson\hudson-slave\workspace\maven-plugins-ITs-m3-windows\maven-project-info-reports-plugin\target\maven-project-info-reports-plugin-2.8-SNAPSHOT.jar
to F:\hudson\hudson-slave\workspace\maven-plugins-ITs-m3-windows\maven-scm-publish-plugin\target\local-repo\org\apache\maven\plugins\maven-project-info-reports-plugin\2.8-SNAPSHOT\maven-project-info-reports-plugin-2.8-SNAPSHOT.jar
[INFO] Installing F:\hudson\hudson-slave\workspace\maven-plugins-ITs-m3-windows\maven-project-info-reports-plugin\pom.xml
to F:\hudson\hudson-slave\workspace\maven-plugins-ITs-m3-windows\maven-scm-publish-plugin\target\local-repo\org\apache\maven\plugins\maven-project-info-reports-plugin\2.8-SNAPSHOT\maven-project-info-reports-plugin-2.8-SNAPSHOT.pom
[INFO] Installing F:\hudson\hudson-slave\workspace\maven-plugins-ITs-m3-windows\maven-remote-resources-plugin\pom.xml
to F:\hudson\hudson-slave\workspace\maven-plugins-ITs-m3-windows\maven-scm-publish-plugin\target\local-repo\org\apache\maven\plugins\maven-remote-resources-plugin\1.6-SNAPSHOT\maven-remote-resources-plugin-1.6-SNAPSHOT.pom
[INFO] Installing F:\hudson\hudson-slave\workspace\maven-plugins-ITs-m3-windows\maven-remote-resources-plugin\target\maven-remote-resources-plugin-1.6-SNAPSHOT.jar
to F:\hudson\hudson-slave\workspace\maven-plugins-ITs-m3-windows\maven-scm-publish-plugin\target\local-repo\org\apache\maven\plugins\maven-remote-resources-plugin\1.6-SNAPSHOT\maven-remote-resources-plugin-1.6-SNAPSHOT.jar
[INFO] Installing F:\hudson\hudson-slave\workspace\maven-plugins-ITs-m3-windows\maven-remote-resources-plugin\pom.xml
to F:\hudson\hudson-slave\workspace\maven-plugins-ITs-m3-windows\maven-scm-publish-plugin\target\local-repo\org\apache\maven\plugins\maven-remote-resources-plugin\1.6-SNAPSHOT\maven-remote-resources-plugin-1.6-SNAPSHOT.pom
[INFO] Installing F:\hudson\hudson-slave\workspace\maven-plugins-ITs-m3-windows\maven-shade-plugin\pom.xml
to F:\hudson\hudson-slave\workspace\maven-plugins-ITs-m3-windows\maven-scm-publish-plugin\target\local-repo\org\apache\maven\plugins\maven-shade-plugin\2.4-SNAPSHOT\maven-shade-plugin-2.4-SNAPSHOT.pom
[INFO] Installing F:\hudson\hudson-slave\workspace\maven-plugins-ITs-m3-windows\maven-shade-plugin\target\maven-shade-plugin-2.4-SNAPSHOT.jar
to F:\hudson\hudson-slave\workspace\maven-plugins-ITs-m3-windows\maven-scm-publish-plugin\target\local-repo\org\apache\maven\plugins\maven-shade-plugin\2.4-SNAPSHOT\maven-shade-plugin-2.4-SNAPSHOT.jar
[INFO] Installing F:\hudson\hudson-slave\workspace\maven-plugins-ITs-m3-windows\maven-shade-plugin\pom.xml
to F:\hudson\hudson-slave\workspace\maven-plugins-ITs-m3-windows\maven-scm-publish-plugin\target\local-repo\org\apache\maven\plugins\maven-shade-plugin\2.4-SNAPSHOT\maven-shade-plugin-2.4-SNAPSHOT.pom
[INFO] Installing F:\hudson\hudson-slave\workspace\maven-plugins-ITs-m3-windows\maven-shade-plugin\target\maven-shade-plugin-2.4-SNAPSHOT-tests.jar
to F:\hudson\hudson-slave\workspace\maven-plugins-ITs-m3-windows\maven-scm-publish-plugin\target\local-repo\org\apache\maven\plugins\maven-shade-plugin\2.4-SNAPSHOT\maven-shade-plugin-2.4-SNAPSHOT-tests.jar
[INFO] Installing F:\hudson\hudson-slave\workspace\maven-plugins-ITs-m3-windows\maven-scm-publish-plugin\pom.xml
to F:\hudson\hudson-slave\workspace\maven-plugins-ITs-m3-windows\maven-scm-publish-plugin\target\local-repo\org\apache\maven\plugins\maven-scm-publish-plugin\1.2-SNAPSHOT\maven-scm-publish-plugin-1.2-SNAPSHOT.pom
[INFO] Installing F:\hudson\hudson-slave\workspace\maven-plugins-ITs-m3-windows\maven-scm-publish-plugin\target\maven-scm-publish-plugin-1.2-SNAPSHOT.jar
to F:\hudson\hudson-slave\workspace\maven-plugins-ITs-m3-windows\maven-scm-publish-plugin\target\local-repo\org\apache\maven\plugins\maven-scm-publish-plugin\1.2-SNAPSHOT\maven-scm-publish-plugin-1.2-SNAPSHOT.jar
[INFO] 
[INFO] --- maven-invoker-plugin:1.8:integration-test (integration-test) @ maven-scm-publish-plugin
---
[INFO] Building: 003-lifecycle\pom.xml
[INFO] run script setup.bsh
[INFO] ..SUCCESS (10.2 s)
[INFO] Building: 004-publish-scm\pom.xml
[INFO] run script setup.bsh
[INFO] ..SUCCESS (27.5 s)
[INFO] Building: 005-site-lifecycle\pom.xml
[INFO] run script setup.bsh
[INFO] ..SUCCESS (14.8 s)
[INFO] Building: 006-site-multi-module\pom.xml
[INFO] run script setup.bsh
[INFO] ..SUCCESS (17.7 s)
[INFO] 
[INFO] --- maven-invoker-plugin:1.8:verify (integration-test) @ maven-scm-publish-plugin ---
[INFO] -------------------------------------------------
[INFO] Build Summary:
[INFO]   Passed: 4, Failed: 0, Errors: 0, Skipped: 0
[INFO] -------------------------------------------------
[INFO] 
[INFO] --- maven-install-plugin:2.5.1:install (default-install) @ maven-scm-publish-plugin
---
[INFO] Installing F:\hudson\hudson-slave\workspace\maven-plugins-ITs-m3-windows\maven-scm-publish-plugin\target\maven-scm-publish-plugin-1.2-SNAPSHOT.jar
to C:\Users\hudson\.m2\repository\org\apache\maven\plugins\maven-scm-publish-plugin\1.2-SNAPSHOT\maven-scm-publish-plugin-1.2-SNAPSHOT.jar
[INFO] Installing F:\hudson\hudson-slave\workspace\maven-plugins-ITs-m3-windows\maven-scm-publish-plugin\pom.xml
to C:\Users\hudson\.m2\repository\org\apache\maven\plugins\maven-scm-publish-plugin\1.2-SNAPSHOT\maven-scm-publish-plugin-1.2-SNAPSHOT.pom
[INFO]                                                                         
[INFO] ------------------------------------------------------------------------
[INFO] Building Apache Maven Plugins Aggregator 1-SNAPSHOT
[INFO] ------------------------------------------------------------------------
[INFO] 
[INFO] --- maven-clean-plugin:2.5:clean (default-clean) @ maven-plugins-aggregator ---
[INFO] Deleting <https://builds.apache.org/job/maven-plugins-ITs-m3-windows/ws/target>
[INFO] 
[INFO] --- maven-enforcer-plugin:1.3.1:enforce (enforce-bytecode-version) @ maven-plugins-aggregator
---
[INFO] 
[INFO] --- maven-enforcer-plugin:1.3.1:enforce (ban-known-bad-maven-versions) @ maven-plugins-aggregator
---
[INFO] 
[INFO] --- maven-remote-resources-plugin:1.5:process (default) @ maven-plugins-aggregator
---
[INFO] 
[INFO] --- maven-site-plugin:3.3:attach-descriptor (attach-descriptor) @ maven-plugins-aggregator
---
[INFO] 
[INFO] --- maven-install-plugin:2.5.1:install (default-install) @ maven-plugins-aggregator
---
[INFO] Installing <https://builds.apache.org/job/maven-plugins-ITs-m3-windows/ws/pom.xml>
to C:\Users\hudson\.m2\repository\org\apache\maven\plugins\maven-plugins-aggregator\1-SNAPSHOT\maven-plugins-aggregator-1-SNAPSHOT.pom
[INFO] ------------------------------------------------------------------------
[INFO] Reactor Summary:
[INFO] 
[INFO] Apache Maven Plugins .............................. SUCCESS [20.686s]
[INFO] Apache Maven ACR Plugin ........................... SUCCESS [42.616s]
[INFO] Apache Maven Ant Plugin ........................... SUCCESS [2:45.389s]
[INFO] Apache Maven AntRun Plugin ........................ SUCCESS [1:50.062s]
[INFO] Apache Maven Eclipse Plugin ....................... SUCCESS [12:50.116s]
[INFO] Apache Maven Assembly Plugin ...................... SUCCESS [14:31.695s]
[INFO] Apache Maven Changelog Plugin ..................... SUCCESS [1:15.663s]
[INFO] Apache Maven Changes Plugin ....................... SUCCESS [1:32.292s]
[INFO] Apache Maven Checkstyle Plugin .................... FAILURE [30.473s]
[INFO] Apache Maven Clean Plugin ......................... SUCCESS [26.633s]
[INFO] Apache Maven Compiler Plugin ...................... SUCCESS [2:18.348s]
[INFO] Apache Maven Dependency Plugin .................... SUCCESS [3:52.290s]
[INFO] Apache Maven Deploy Plugin ........................ SUCCESS [1:59.791s]
[INFO] Apache Maven DOAP Plugin .......................... SUCCESS [28.102s]
[INFO] Apache Maven Documentation Checker Plugin ......... SUCCESS [13.037s]
[INFO] Apache Maven EAR Plugin ........................... SUCCESS [6:19.584s]
[INFO] Apache Maven EJB Plugin ........................... SUCCESS [41.093s]
[INFO] Apache Maven Help Plugin .......................... SUCCESS [1:09.636s]
[INFO] Apache Maven Install Plugin ....................... SUCCESS [1:30.175s]
[INFO] Apache Maven JAR Plugin ........................... SUCCESS [1:44.687s]
[INFO] Apache Maven Jarsigner Plugin ..................... SUCCESS [59.437s]
[INFO] Apache Maven Javadoc Plugin ....................... SUCCESS [4:37.343s]
[INFO] Apache Maven Linkcheck Plugin ..................... SUCCESS [7.354s]
[INFO] Apache Maven Patch Plugin ......................... SUCCESS [7.727s]
[INFO] Apache Maven PDF Plugin ........................... SUCCESS [1:03.231s]
[INFO] Apache Maven RAR Plugin ........................... SUCCESS [20.148s]
[INFO] Apache Maven Repository Plugin .................... SUCCESS [1:07.503s]
[INFO] Apache Maven Resources Plugin ..................... SUCCESS [1:24.578s]
[INFO] Apache Maven Site Plugin .......................... SUCCESS [11:24.311s]
[INFO] Apache Maven Source Plugin ........................ SUCCESS [1:20.470s]
[INFO] Apache Maven Stage Plugin ......................... SUCCESS [12.536s]
[INFO] Apache Maven Toolchains Plugin .................... SUCCESS [5.120s]
[INFO] Apache Maven Verifier Plugin ...................... SUCCESS [26.233s]
[INFO] Apache Maven WAR Plugin ........................... SUCCESS [1:53.326s]
[INFO] Apache Maven Invoker Plugin ....................... SUCCESS [6:52.725s]
[INFO] Apache Maven Project Info Reports Plugin .......... SUCCESS [3:18.698s]
[INFO] Apache Maven Remote Resources Plugin .............. SUCCESS [1:39.153s]
[INFO] Apache Maven Shade Plugin ......................... SUCCESS [4:55.036s]
[INFO] Apache Maven SCM Publish Plugin ................... SUCCESS [1:36.194s]
[INFO] Apache Maven Plugins Aggregator ................... SUCCESS [0.069s]
[INFO] ------------------------------------------------------------------------
[INFO] BUILD FAILURE
[INFO] ------------------------------------------------------------------------
[INFO] Total time: 1:40:46.255s
[INFO] Finished at: Sun Sep 14 03:18:58 BST 2014
[INFO] Final Memory: 124M/396M
[INFO] ------------------------------------------------------------------------
[WARNING] The requested profile "apache.snapshots" could not be activated because it does
not exist.
[ERROR] Failed to execute goal org.apache.maven.plugins:maven-compiler-plugin:3.1:compile
(default-compile) on project maven-checkstyle-plugin: Compilation failure: Compilation failure:
[ERROR] F:\hudson\hudson-slave\workspace\maven-plugins-ITs-m3-windows\maven-checkstyle-plugin\src\main\java\org\apache\maven\plugin\checkstyle\AbstractCheckstyleReport.java:[460,54]
cannot find symbol
[ERROR] symbol  : variable project
[ERROR] location: class org.apache.maven.plugin.checkstyle.AbstractCheckstyleReport
[ERROR] F:\hudson\hudson-slave\workspace\maven-plugins-ITs-m3-windows\maven-checkstyle-plugin\src\main\java\org\apache\maven\plugin\checkstyle\AbstractCheckstyleReport.java:[463,46]
cannot find symbol
[ERROR] symbol  : variable project
[ERROR] location: class org.apache.maven.plugin.checkstyle.AbstractCheckstyleReport
[ERROR] F:\hudson\hudson-slave\workspace\maven-plugins-ITs-m3-windows\maven-checkstyle-plugin\src\main\java\org\apache\maven\plugin\checkstyle\AbstractCheckstyleReport.java:[485,55]
cannot find symbol
[ERROR] symbol  : variable project
[ERROR] location: class org.apache.maven.plugin.checkstyle.AbstractCheckstyleReport
[ERROR] F:\hudson\hudson-slave\workspace\maven-plugins-ITs-m3-windows\maven-checkstyle-plugin\src\main\java\org\apache\maven\plugin\checkstyle\AbstractCheckstyleReport.java:[485,90]
cannot find symbol
[ERROR] symbol  : variable outputDirectory
[ERROR] location: class org.apache.maven.plugin.checkstyle.AbstractCheckstyleReport
[ERROR] F:\hudson\hudson-slave\workspace\maven-plugins-ITs-m3-windows\maven-checkstyle-plugin\src\main\java\org\apache\maven\plugin\checkstyle\AbstractCheckstyleReport.java:[525,44]
cannot find symbol
[ERROR] symbol  : variable project
[ERROR] location: class org.apache.maven.plugin.checkstyle.AbstractCheckstyleReport
[ERROR] F:\hudson\hudson-slave\workspace\maven-plugins-ITs-m3-windows\maven-checkstyle-plugin\src\main\java\org\apache\maven\plugin\checkstyle\AbstractCheckstyleReport.java:[531,70]
cannot find symbol
[ERROR] symbol  : variable project
[ERROR] location: class org.apache.maven.plugin.checkstyle.AbstractCheckstyleReport
[ERROR] F:\hudson\hudson-slave\workspace\maven-plugins-ITs-m3-windows\maven-checkstyle-plugin\src\main\java\org\apache\maven\plugin\checkstyle\AbstractCheckstyleReport.java:[640,73]
cannot find symbol
[ERROR] symbol  : variable outputDirectory
[ERROR] location: class org.apache.maven.plugin.checkstyle.AbstractCheckstyleReport
[ERROR] F:\hudson\hudson-slave\workspace\maven-plugins-ITs-m3-windows\maven-checkstyle-plugin\src\main\java\org\apache\maven\plugin\checkstyle\AbstractCheckstyleReport.java:[656,37]
cannot find symbol
[ERROR] symbol  : variable project
[ERROR] location: class org.apache.maven.plugin.checkstyle.AbstractCheckstyleReport
[ERROR] F:\hudson\hudson-slave\workspace\maven-plugins-ITs-m3-windows\maven-checkstyle-plugin\src\main\java\org\apache\maven\plugin\checkstyle\AbstractCheckstyleReport.java:[657,54]
cannot find symbol
[ERROR] symbol  : variable project
[ERROR] location: class org.apache.maven.plugin.checkstyle.AbstractCheckstyleReport
[ERROR] F:\hudson\hudson-slave\workspace\maven-plugins-ITs-m3-windows\maven-checkstyle-plugin\src\main\java\org\apache\maven\plugin\checkstyle\AbstractCheckstyleReport.java:[659,24]
cannot find symbol
[ERROR] symbol  : variable project
[ERROR] location: class org.apache.maven.plugin.checkstyle.AbstractCheckstyleReport
[ERROR] F:\hudson\hudson-slave\workspace\maven-plugins-ITs-m3-windows\maven-checkstyle-plugin\src\main\java\org\apache\maven\plugin\checkstyle\AbstractCheckstyleReport.java:[666,15]
cannot find symbol
[ERROR] symbol  : variable project
[ERROR] location: class org.apache.maven.plugin.checkstyle.AbstractCheckstyleReport
[ERROR] F:\hudson\hudson-slave\workspace\maven-plugins-ITs-m3-windows\maven-checkstyle-plugin\src\main\java\org\apache\maven\plugin\checkstyle\AbstractCheckstyleReport.java:[666,78]
cannot find symbol
[ERROR] symbol  : variable project
[ERROR] location: class org.apache.maven.plugin.checkstyle.AbstractCheckstyleReport
[ERROR] F:\hudson\hudson-slave\workspace\maven-plugins-ITs-m3-windows\maven-checkstyle-plugin\src\main\java\org\apache\maven\plugin\checkstyle\AbstractCheckstyleReport.java:[668,42]
cannot find symbol
[ERROR] symbol  : variable project
[ERROR] location: class org.apache.maven.plugin.checkstyle.AbstractCheckstyleReport
[ERROR] F:\hudson\hudson-slave\workspace\maven-plugins-ITs-m3-windows\maven-checkstyle-plugin\src\main\java\org\apache\maven\plugin\checkstyle\AbstractCheckstyleReport.java:[676,62]
cannot find symbol
[ERROR] symbol  : variable project
[ERROR] location: class org.apache.maven.plugin.checkstyle.AbstractCheckstyleReport
[ERROR] F:\hudson\hudson-slave\workspace\maven-plugins-ITs-m3-windows\maven-checkstyle-plugin\src\main\java\org\apache\maven\plugin\checkstyle\AbstractCheckstyleReport.java:[741,55]
cannot find symbol
[ERROR] symbol  : variable project
[ERROR] location: class org.apache.maven.plugin.checkstyle.AbstractCheckstyleReport
[ERROR] F:\hudson\hudson-slave\workspace\maven-plugins-ITs-m3-windows\maven-checkstyle-plugin\src\main\java\org\apache\maven\plugin\checkstyle\AbstractCheckstyleReport.java:[762,59]
cannot find symbol
[ERROR] symbol  : variable project
[ERROR] location: class org.apache.maven.plugin.checkstyle.AbstractCheckstyleReport
[ERROR] F:\hudson\hudson-slave\workspace\maven-plugins-ITs-m3-windows\maven-checkstyle-plugin\src\main\java\org\apache\maven\plugin\checkstyle\CheckstyleAggregateReport.java:[41,7]
org.apache.maven.plugin.checkstyle.CheckstyleAggregateReport is not abstract and does not
override abstract method getOutputDirectory() in org.apache.maven.reporting.AbstractMavenReport
[ERROR] F:\hudson\hudson-slave\workspace\maven-plugins-ITs-m3-windows\maven-checkstyle-plugin\src\main\java\org\apache\maven\plugin\checkstyle\CheckstyleAggregateReport.java:[55,15]
cannot find symbol
[ERROR] symbol  : variable project
[ERROR] location: class org.apache.maven.plugin.checkstyle.CheckstyleAggregateReport
[ERROR] F:\hudson\hudson-slave\workspace\maven-plugins-ITs-m3-windows\maven-checkstyle-plugin\src\main\java\org\apache\maven\plugin\checkstyle\CheckstyleAggregateReport.java:[74,44]
cannot find symbol
[ERROR] symbol  : variable project
[ERROR] location: class org.apache.maven.plugin.checkstyle.CheckstyleAggregateReport
[ERROR] F:\hudson\hudson-slave\workspace\maven-plugins-ITs-m3-windows\maven-checkstyle-plugin\src\main\java\org\apache\maven\plugin\checkstyle\CheckstyleAggregateReport.java:[95,24]
cannot find symbol
[ERROR] symbol  : variable project
[ERROR] location: class org.apache.maven.plugin.checkstyle.CheckstyleAggregateReport
[ERROR] F:\hudson\hudson-slave\workspace\maven-plugins-ITs-m3-windows\maven-checkstyle-plugin\src\main\java\org\apache\maven\plugin\checkstyle\CheckstyleReport.java:[49,7]
org.apache.maven.plugin.checkstyle.CheckstyleReport is not abstract and does not override
abstract method getOutputDirectory() in org.apache.maven.reporting.AbstractMavenReport
[ERROR] F:\hudson\hudson-slave\workspace\maven-plugins-ITs-m3-windows\maven-checkstyle-plugin\src\main\java\org\apache\maven\plugin\checkstyle\CheckstyleReport.java:[149,15]
cannot find symbol
[ERROR] symbol  : variable project
[ERROR] location: class org.apache.maven.plugin.checkstyle.CheckstyleReport
[ERROR] F:\hudson\hudson-slave\workspace\maven-plugins-ITs-m3-windows\maven-checkstyle-plugin\src\main\java\org\apache\maven\plugin\checkstyle\CheckstyleReport.java:[174,44]
cannot find symbol
[ERROR] symbol  : variable project
[ERROR] location: class org.apache.maven.plugin.checkstyle.CheckstyleReport
[ERROR] F:\hudson\hudson-slave\workspace\maven-plugins-ITs-m3-windows\maven-checkstyle-plugin\src\main\java\org\apache\maven\plugin\checkstyle\CheckstyleReport.java:[266,47]
cannot find symbol
[ERROR] symbol  : variable project
[ERROR] location: class org.apache.maven.plugin.checkstyle.CheckstyleReport
[ERROR] -> [Help 1]
[ERROR] 
[ERROR] To see the full stack trace of the errors, re-run Maven with the -e switch.
[ERROR] Re-run Maven using the -X switch to enable full debug logging.
[ERROR] 
[ERROR] For more information about the errors and possible solutions, please read the following
articles:
[ERROR] [Help 1] http://cwiki.apache.org/confluence/display/MAVEN/MojoFailureException
[ERROR] 
[ERROR] After correcting the problems, you can resume the build with the command
[ERROR]   mvn <goals> -rf :maven-checkstyle-plugin
Build step 'Invoke top-level Maven targets' marked build as failure
Recording test results

Mime
View raw message