maven-notifications mailing list archives

Site index · List index
Message view « Date » · « Thread »
Top « Date » · « Thread »
From Apache Jenkins Server <jenk...@builds.apache.org>
Subject Build failed in Jenkins: dist-tool-plugin #602
Date Mon, 29 Sep 2014 09:51:49 GMT
See <https://builds.apache.org/job/dist-tool-plugin/602/>

------------------------------------------
Started by timer
Building remotely on H11 (Ubuntu ubuntu) in workspace <https://builds.apache.org/job/dist-tool-plugin/ws/>
Updating http://svn.apache.org/repos/asf/maven/sandbox/trunk/dist-tools/dist-tool-plugin at
revision '2014-09-29T09:51:40.279 +0000'
U         src/main/java/org/apache/maven/dist/tools/DistCheckSourceReleaseMojo.java
U         src/main/java/org/apache/maven/dist/tools/DummyFailureMojo.java
U         src/main/java/org/apache/maven/dist/tools/AbstractDistCheckMojo.java
U         src/main/java/org/apache/maven/dist/tools/DistCheckIndexPageMojo.java
U         src/main/resources/dist-tool.conf
U         src/site/markdown/index.md
U         src/site/markdown/todo.md
U         src/it/check-site/invoker.properties
U         src/it/check-source-release-report/invoker.properties
U         src/it/check-site-report/invoker.properties
U         src/it/check-source-release/invoker.properties
U         pom.xml
At revision 1628146
no change for http://svn.apache.org/repos/asf/maven/sandbox/trunk/dist-tools/dist-tool-plugin
since the previous build
Parsing POMs
ERROR: Failed to parse POMs
java.io.IOException: remote file operation failed: <https://builds.apache.org/job/dist-tool-plugin/ws/>
at hudson.remoting.Channel@6daa7da2:H11
	at hudson.FilePath.act(FilePath.java:910)
	at hudson.FilePath.act(FilePath.java:887)
	at hudson.maven.MavenModuleSetBuild$MavenModuleSetBuildExecution.parsePoms(MavenModuleSetBuild.java:953)
	at hudson.maven.MavenModuleSetBuild$MavenModuleSetBuildExecution.doRun(MavenModuleSetBuild.java:681)
	at hudson.model.AbstractBuild$AbstractBuildExecution.run(AbstractBuild.java:585)
	at hudson.model.Run.execute(Run.java:1676)
	at hudson.maven.MavenModuleSetBuild.run(MavenModuleSetBuild.java:529)
	at hudson.model.ResourceController.execute(ResourceController.java:88)
	at hudson.model.Executor.run(Executor.java:231)
Caused by: hudson.remoting.ProxyException: hudson.maven.MavenModuleSetBuild$MavenExecutionException:
org.apache.maven.project.ProjectBuildingException: Some problems were encountered while processing
the POMs:
[FATAL] Non-resolvable parent POM: Could not find artifact org.apache.maven:maven-parent:pom:25-SNAPSHOT
and 'parent.relativePath' points at wrong local POM @ line 17, column 11

	at hudson.maven.MavenModuleSetBuild$PomParser.invoke(MavenModuleSetBuild.java:1357)
	at hudson.maven.MavenModuleSetBuild$PomParser.invoke(MavenModuleSetBuild.java:1091)
	at hudson.FilePath$FileCallableWrapper.call(FilePath.java:2462)
	at hudson.remoting.UserRequest.perform(UserRequest.java:118)
	at hudson.remoting.UserRequest.perform(UserRequest.java:48)
	at hudson.remoting.Request$2.run(Request.java:328)
	at hudson.remoting.InterceptingExecutorService$1.call(InterceptingExecutorService.java:72)
	at java.util.concurrent.FutureTask.run(FutureTask.java:262)
	at java.util.concurrent.ThreadPoolExecutor.runWorker(ThreadPoolExecutor.java:1145)
	at java.util.concurrent.ThreadPoolExecutor$Worker.run(ThreadPoolExecutor.java:615)
	at java.lang.Thread.run(Thread.java:745)
Caused by: hudson.remoting.ProxyException: org.apache.maven.project.ProjectBuildingException:
Some problems were encountered while processing the POMs:
[FATAL] Non-resolvable parent POM: Could not find artifact org.apache.maven:maven-parent:pom:25-SNAPSHOT
and 'parent.relativePath' points at wrong local POM @ line 17, column 11

	at org.apache.maven.project.DefaultProjectBuilder.build(DefaultProjectBuilder.java:364)
	at hudson.maven.MavenEmbedder.buildProjects(MavenEmbedder.java:361)
	at hudson.maven.MavenEmbedder.readProjects(MavenEmbedder.java:331)
	at hudson.maven.MavenModuleSetBuild$PomParser.invoke(MavenModuleSetBuild.java:1294)
	... 10 more

Mime
View raw message