maven-notifications mailing list archives

Site index · List index
Message view « Date » · « Thread »
Top « Date » · « Thread »
From Apache Jenkins Server <jenk...@builds.apache.org>
Subject Build failed in Jenkins: maven-indexer #169
Date Tue, 19 Aug 2014 17:04:26 GMT
See <https://builds.apache.org/job/maven-indexer/169/changes>

Changes:

[hboutemy] fixed typo in information message

------------------------------------------
[...truncated 1165 lines...]
[INFO] 
[INFO] --- maven-site-plugin:3.3:attach-descriptor (attach-descriptor) @ indexer-cli ---
[INFO] 
[INFO] --- maven-shade-plugin:1.7.1:shade (jdk15) @ indexer-cli ---
[INFO] Including org.apache.maven.indexer:indexer-core:jar:6.0-SNAPSHOT in the shaded jar.
[INFO] Including org.slf4j:slf4j-api:jar:1.7.5 in the shaded jar.
[INFO] Including com.google.guava:guava:jar:16.0.1 in the shaded jar.
[INFO] Including javax.inject:javax.inject:jar:1 in the shaded jar.
[INFO] Including javax.annotation:javax.annotation-api:jar:1.2 in the shaded jar.
[INFO] Including com.google.code.findbugs:jsr305:jar:2.0.3 in the shaded jar.
[INFO] Including org.apache.lucene:lucene-core:jar:4.8.1 in the shaded jar.
[INFO] Including org.apache.lucene:lucene-queryparser:jar:4.8.1 in the shaded jar.
[INFO] Including org.apache.lucene:lucene-queries:jar:4.8.1 in the shaded jar.
[INFO] Including org.apache.lucene:lucene-sandbox:jar:4.8.1 in the shaded jar.
[INFO] Including org.apache.lucene:lucene-analyzers-common:jar:4.8.1 in the shaded jar.
[INFO] Including org.apache.lucene:lucene-highlighter:jar:4.8.1 in the shaded jar.
[INFO] Including org.apache.lucene:lucene-memory:jar:4.8.1 in the shaded jar.
[INFO] Including org.eclipse.aether:aether-api:jar:1.0.0.v20140518 in the shaded jar.
[INFO] Including org.eclipse.aether:aether-util:jar:1.0.0.v20140518 in the shaded jar.
[INFO] Including org.apache.maven:maven-model:jar:3.0.5 in the shaded jar.
[INFO] Including org.eclipse.sisu:org.eclipse.sisu.inject:jar:0.2.1 in the shaded jar.
[INFO] Including org.sonatype.sisu:sisu-guice:jar:3.2.2 in the shaded jar.
[INFO] Including aopalliance:aopalliance:jar:1.0 in the shaded jar.
[INFO] Including org.eclipse.sisu:org.eclipse.sisu.plexus:jar:0.2.1 in the shaded jar.
[INFO] Including javax.enterprise:cdi-api:jar:1.0 in the shaded jar.
[INFO] Including javax.annotation:jsr250-api:jar:1.0 in the shaded jar.
[INFO] Including org.codehaus.plexus:plexus-component-annotations:jar:1.5.5 in the shaded
jar.
[INFO] Including org.codehaus.plexus:plexus-classworlds:jar:2.4 in the shaded jar.
[INFO] Including org.codehaus.plexus:plexus-utils:jar:2.1 in the shaded jar.
[INFO] Including org.codehaus.plexus:plexus-cli:jar:1.6 in the shaded jar.
[INFO] Including commons-cli:commons-cli:jar:1.2 in the shaded jar.
[INFO] Including de.schlichtherle.truezip:truezip-file:jar:7.6.6 in the shaded jar.
[INFO] Including de.schlichtherle.truezip:truezip-driver-file:jar:7.6.6 in the shaded jar.
[INFO] Including de.schlichtherle.truezip:truezip-kernel:jar:7.6.6 in the shaded jar.
[INFO] Including de.schlichtherle.truezip:truezip-driver-zip:jar:7.6.6 in the shaded jar.
[INFO] Including org.apache.commons:commons-compress:jar:1.4.1 in the shaded jar.
[INFO] Including org.bouncycastle:bcprov-jdk16:jar:1.46 in the shaded jar.
[WARNING] We have a duplicate javax/annotation/Generated.class in /home/jenkins/jenkins-slave/maven-repositories/0/javax/annotation/jsr250-api/1.0/jsr250-api-1.0.jar
[WARNING] We have a duplicate javax/annotation/PostConstruct.class in /home/jenkins/jenkins-slave/maven-repositories/0/javax/annotation/jsr250-api/1.0/jsr250-api-1.0.jar
[WARNING] We have a duplicate javax/annotation/PreDestroy.class in /home/jenkins/jenkins-slave/maven-repositories/0/javax/annotation/jsr250-api/1.0/jsr250-api-1.0.jar
[WARNING] We have a duplicate javax/annotation/Resource$AuthenticationType.class in /home/jenkins/jenkins-slave/maven-repositories/0/javax/annotation/jsr250-api/1.0/jsr250-api-1.0.jar
[WARNING] We have a duplicate javax/annotation/Resource.class in /home/jenkins/jenkins-slave/maven-repositories/0/javax/annotation/jsr250-api/1.0/jsr250-api-1.0.jar
[WARNING] We have a duplicate javax/annotation/Resources.class in /home/jenkins/jenkins-slave/maven-repositories/0/javax/annotation/jsr250-api/1.0/jsr250-api-1.0.jar
[WARNING] We have a duplicate javax/annotation/security/DeclareRoles.class in /home/jenkins/jenkins-slave/maven-repositories/0/javax/annotation/jsr250-api/1.0/jsr250-api-1.0.jar
[WARNING] We have a duplicate javax/annotation/security/DenyAll.class in /home/jenkins/jenkins-slave/maven-repositories/0/javax/annotation/jsr250-api/1.0/jsr250-api-1.0.jar
[WARNING] We have a duplicate javax/annotation/security/PermitAll.class in /home/jenkins/jenkins-slave/maven-repositories/0/javax/annotation/jsr250-api/1.0/jsr250-api-1.0.jar
[WARNING] We have a duplicate javax/annotation/security/RolesAllowed.class in /home/jenkins/jenkins-slave/maven-repositories/0/javax/annotation/jsr250-api/1.0/jsr250-api-1.0.jar
[WARNING] We have a duplicate javax/annotation/security/RunAs.class in /home/jenkins/jenkins-slave/maven-repositories/0/javax/annotation/jsr250-api/1.0/jsr250-api-1.0.jar
[INFO] Replacing original artifact with shaded artifact.
[INFO] Replacing <https://builds.apache.org/job/maven-indexer/ws/indexer-cli/target/indexer-cli-6.0-SNAPSHOT.jar>
with <https://builds.apache.org/job/maven-indexer/ws/indexer-cli/target/indexer-cli-6.0-SNAPSHOT-shaded.jar>
[INFO] 
[INFO] --- maven-failsafe-plugin:2.17:integration-test (default) @ indexer-cli ---
[INFO] Failsafe report directory: <https://builds.apache.org/job/maven-indexer/ws/indexer-cli/target/failsafe-reports>

-------------------------------------------------------
 T E S T S
-------------------------------------------------------
Running org.apache.maven.index.cli.NexusIndexerCliIT
Tests run: 7, Failures: 0, Errors: 0, Skipped: 0, Time elapsed: 48.924 sec - in org.apache.maven.index.cli.NexusIndexerCliIT

Results :

Tests run: 7, Failures: 0, Errors: 0, Skipped: 0

[JENKINS] Recording test results
[INFO] 
[INFO] --- maven-failsafe-plugin:2.17:verify (default) @ indexer-cli ---
[INFO] Failsafe report directory: <https://builds.apache.org/job/maven-indexer/ws/indexer-cli/target/failsafe-reports>
[JENKINS] Recording test results[INFO] 
[INFO] --- maven-install-plugin:2.5.1:install (default-install) @ indexer-cli ---
[INFO] Installing <https://builds.apache.org/job/maven-indexer/ws/indexer-cli/target/indexer-cli-6.0-SNAPSHOT.jar>
to /home/jenkins/jenkins-slave/maven-repositories/0/org/apache/maven/indexer/indexer-cli/6.0-SNAPSHOT/indexer-cli-6.0-SNAPSHOT.jar

[INFO] Installing <https://builds.apache.org/job/maven-indexer/ws/indexer-cli/pom.xml>
to /home/jenkins/jenkins-slave/maven-repositories/0/org/apache/maven/indexer/indexer-cli/6.0-SNAPSHOT/indexer-cli-6.0-SNAPSHOT.pom
[INFO]                                                                         
[INFO] ------------------------------------------------------------------------
[INFO] Building Maven :: Indexer Examples 6.0-SNAPSHOT
[INFO] ------------------------------------------------------------------------
[INFO] 
[INFO] --- maven-clean-plugin:2.5:clean (default-clean) @ indexer-examples ---
[INFO] Deleting <https://builds.apache.org/job/maven-indexer/ws/indexer-examples/target>
[INFO] 
[INFO] --- maven-enforcer-plugin:1.3.1:enforce (enforce-bytecode-version) @ indexer-examples
---
[INFO] 
[INFO] --- maven-enforcer-plugin:1.3.1:enforce (ban-known-bad-maven-versions) @ indexer-examples
---
[INFO] 
[INFO] --- maven-remote-resources-plugin:1.5:process (default) @ indexer-examples ---
[INFO] 
[INFO] --- maven-resources-plugin:2.6:resources (default-resources) @ indexer-examples ---
[INFO] Using 'UTF-8' encoding to copy filtered resources.
[INFO] skip non existing resourceDirectory <https://builds.apache.org/job/maven-indexer/ws/indexer-examples/src/main/resources>
[INFO] Copying 3 resources
[INFO] 
[INFO] --- maven-compiler-plugin:3.1:compile (default-compile) @ indexer-examples ---
[INFO] Changes detected - recompiling the module!
[INFO] Compiling 1 source file to <https://builds.apache.org/job/maven-indexer/ws/indexer-examples/target/classes>
[INFO] 
[INFO] --- animal-sniffer-maven-plugin:1.11:check (check-java-1.7-compat) @ indexer-examples
---
[INFO] Checking unresolved references to org.codehaus.mojo.signature:java17:1.0
[INFO] 
[INFO] --- maven-resources-plugin:2.6:testResources (default-testResources) @ indexer-examples
---
[INFO] Using 'UTF-8' encoding to copy filtered resources.
[INFO] skip non existing resourceDirectory <https://builds.apache.org/job/maven-indexer/ws/indexer-examples/src/test/resources>
[INFO] Copying 3 resources
[INFO] 
[INFO] --- maven-compiler-plugin:3.1:testCompile (default-testCompile) @ indexer-examples
---
[INFO] Changes detected - recompiling the module!
[INFO] Compiling 1 source file to <https://builds.apache.org/job/maven-indexer/ws/indexer-examples/target/test-classes>
[INFO] 
[INFO] --- maven-surefire-plugin:2.17:test (default-test) @ indexer-examples ---
[INFO] Tests are skipped.
[INFO] 
[INFO] --- apache-rat-plugin:0.10:check (rat-verify) @ indexer-examples ---
[INFO] 51 implicit excludes (use -debug for more details).
[INFO] Exclude: README.md
[INFO] Exclude: .gitignore
[INFO] Exclude: NOTICE
[INFO] Exclude: .git/**
[INFO] Exclude: .idea/**
[INFO] Exclude: src/test/**/*.sha1
[INFO] Exclude: src/test/**/*.md5
[INFO] Exclude: src/test/**/*.xml
[INFO] Exclude: src/test/**/*.pom
[INFO] Exclude: src/test/**/*.asc
[INFO] Exclude: src/test/**/*.properties
[INFO] Exclude: src/test/**/*.swc
[INFO] Exclude: src/test/**/*.txt
[INFO] Exclude: src/test/**/*.filename
[INFO] Exclude: src/test/**/.placeholder
[INFO] 4 resources included (use -debug for more details)
[INFO] Rat check: Summary of files. Unapproved: 0 unknown: 0 generated: 0 approved: 4 licence.
[INFO] 
[INFO] --- maven-jar-plugin:2.4:jar (default-jar) @ indexer-examples ---
[INFO] Building jar: <https://builds.apache.org/job/maven-indexer/ws/indexer-examples/target/indexer-examples-6.0-SNAPSHOT.jar>
[INFO] 
[INFO] --- maven-site-plugin:3.3:attach-descriptor (attach-descriptor) @ indexer-examples
---
[INFO] 
[INFO] --- maven-install-plugin:2.5.1:install (default-install) @ indexer-examples ---
[INFO] Installing <https://builds.apache.org/job/maven-indexer/ws/indexer-examples/target/indexer-examples-6.0-SNAPSHOT.jar>
to /home/jenkins/jenkins-slave/maven-repositories/0/org/apache/maven/indexer/indexer-examples/6.0-SNAPSHOT/indexer-examples-6.0-SNAPSHOT.jar
[INFO] Installing <https://builds.apache.org/job/maven-indexer/ws/indexer-examples/pom.xml>
to /home/jenkins/jenkins-slave/maven-repositories/0/org/apache/maven/indexer/indexer-examples/6.0-SNAPSHOT/indexer-examples-6.0-SNAPSHOT.pom
[INFO] ------------------------------------------------------------------------
[INFO] Reactor Summary:
[INFO] 
[INFO] Maven-Indexer ..................................... SUCCESS [39.307s]
[INFO] Maven :: Indexer Core ............................. SUCCESS [3:11.994s]
[INFO] Maven :: Indexer CLI .............................. SUCCESS [1:23.333s]
[INFO] Maven :: Indexer Examples ......................... SUCCESS [6.153s]
[INFO] ------------------------------------------------------------------------
[INFO] BUILD SUCCESS
[INFO] ------------------------------------------------------------------------
[INFO] Total time: 5:28.901s
[INFO] Finished at: Tue Aug 19 17:02:37 UTC 2014
[INFO] Final Memory: 31M/398M
[INFO] ------------------------------------------------------------------------
Waiting for Jenkins to finish collecting data
[JENKINS] Archiving <https://builds.apache.org/job/maven-indexer/ws/pom.xml> to org.apache.maven.indexer/maven-indexer/6.0-SNAPSHOT/maven-indexer-6.0-SNAPSHOT.pom
[JENKINS] Archiving <https://builds.apache.org/job/maven-indexer/ws/target/maven-indexer-6.0-SNAPSHOT-site.xml>
to org.apache.maven.indexer/maven-indexer/6.0-SNAPSHOT/maven-indexer-6.0-SNAPSHOT-site.xml
Sending artifact delta relative to maven-indexer ? Maven-Indexer #168
Archived 2 artifacts
Archive block size is 32768
Received 0 blocks and 19023 bytes
Compression is 0.0%
Took 0.14 sec
[JENKINS] Archiving <https://builds.apache.org/job/maven-indexer/ws/indexer-examples/pom.xml>
to org.apache.maven.indexer/indexer-examples/6.0-SNAPSHOT/indexer-examples-6.0-SNAPSHOT.pom
[JENKINS] Archiving <https://builds.apache.org/job/maven-indexer/ws/indexer-examples/target/indexer-examples-6.0-SNAPSHOT.jar>
to org.apache.maven.indexer/indexer-examples/6.0-SNAPSHOT/indexer-examples-6.0-SNAPSHOT.jar
Sending artifact delta relative to maven-indexer ? Maven :: Indexer Examples #168
Archived 2 artifacts
Archive block size is 32768
Received 0 blocks and 20289 bytes
Compression is 0.0%
Took 0.13 sec
[JENKINS] Archiving <https://builds.apache.org/job/maven-indexer/ws/indexer-core/pom.xml>
to org.apache.maven.indexer/indexer-core/6.0-SNAPSHOT/indexer-core-6.0-SNAPSHOT.pom
[JENKINS] Archiving <https://builds.apache.org/job/maven-indexer/ws/indexer-core/target/indexer-core-6.0-SNAPSHOT.jar>
to org.apache.maven.indexer/indexer-core/6.0-SNAPSHOT/indexer-core-6.0-SNAPSHOT.jar
Sending artifact delta relative to maven-indexer ? Maven :: Indexer Core #168
Archived 2 artifacts
Archive block size is 32768
Received 0 blocks and 263620 bytes
Compression is 0.0%
Took 0.24 sec
[JENKINS] Archiving <https://builds.apache.org/job/maven-indexer/ws/indexer-cli/pom.xml>
to org.apache.maven.indexer/indexer-cli/6.0-SNAPSHOT/indexer-cli-6.0-SNAPSHOT.pom
[JENKINS] Archiving <https://builds.apache.org/job/maven-indexer/ws/indexer-cli/target/indexer-cli-6.0-SNAPSHOT.jar>
to org.apache.maven.indexer/indexer-cli/6.0-SNAPSHOT/indexer-cli-6.0-SNAPSHOT.jar
Sending artifact delta relative to maven-indexer ? Maven :: Indexer CLI #168
Archived 2 artifacts
Archive block size is 32768
Received 9 blocks and 12040219 bytes
Compression is 2.4%
Took 11 sec
Sending e-mails to: notifications@maven.apache.org
channel stopped
Maven RedeployPublisher use remote ubuntu-4 maven settings from : /home/jenkins/.m2/settings.xml
[INFO] Deployment in https://repository.apache.org/content/repositories/snapshots (id=apache.snapshots.https,uniqueVersion=true)
Deploying the main artifact indexer-cli-6.0-SNAPSHOT.jar
Downloading: https://repository.apache.org/content/repositories/snapshots/org/apache/maven/indexer/indexer-cli/6.0-SNAPSHOT/maven-metadata.xml
ERROR: Failed to retrieve remote metadata org.apache.maven.indexer:indexer-cli:6.0-SNAPSHOT/maven-metadata.xml:
Could not transfer metadata org.apache.maven.indexer:indexer-cli:6.0-SNAPSHOT/maven-metadata.xml
from/to apache.snapshots.https (https://repository.apache.org/content/repositories/snapshots):
No route to host
org.apache.maven.artifact.deployer.ArtifactDeploymentException: Failed to retrieve remote
metadata org.apache.maven.indexer:indexer-cli:6.0-SNAPSHOT/maven-metadata.xml: Could not transfer
metadata org.apache.maven.indexer:indexer-cli:6.0-SNAPSHOT/maven-metadata.xml from/to apache.snapshots.https
(https://repository.apache.org/content/repositories/snapshots): No route to host
	at org.apache.maven.artifact.deployer.DefaultArtifactDeployer.deploy(DefaultArtifactDeployer.java:143)
	at hudson.maven.reporters.MavenArtifactRecord.deploy(MavenArtifactRecord.java:193)
	at hudson.maven.RedeployPublisher.perform(RedeployPublisher.java:176)
	at hudson.tasks.BuildStepMonitor$1.perform(BuildStepMonitor.java:20)
	at hudson.model.AbstractBuild$AbstractBuildExecution.perform(AbstractBuild.java:804)
	at hudson.model.AbstractBuild$AbstractBuildExecution.performAllBuildSteps(AbstractBuild.java:776)
	at hudson.maven.MavenModuleSetBuild$MavenModuleSetBuildExecution.post2(MavenModuleSetBuild.java:1040)
	at hudson.model.AbstractBuild$AbstractBuildExecution.post(AbstractBuild.java:725)
	at hudson.model.Run.execute(Run.java:1701)
	at hudson.maven.MavenModuleSetBuild.run(MavenModuleSetBuild.java:529)
	at hudson.model.ResourceController.execute(ResourceController.java:88)
	at hudson.model.Executor.run(Executor.java:231)
Caused by: org.eclipse.aether.deployment.DeploymentException: Failed to retrieve remote metadata
org.apache.maven.indexer:indexer-cli:6.0-SNAPSHOT/maven-metadata.xml: Could not transfer metadata
org.apache.maven.indexer:indexer-cli:6.0-SNAPSHOT/maven-metadata.xml from/to apache.snapshots.https
(https://repository.apache.org/content/repositories/snapshots): No route to host
	at org.eclipse.aether.internal.impl.DefaultDeployer.upload(DefaultDeployer.java:470)
	at org.eclipse.aether.internal.impl.DefaultDeployer.deploy(DefaultDeployer.java:314)
	at org.eclipse.aether.internal.impl.DefaultDeployer.deploy(DefaultDeployer.java:269)
	at org.eclipse.aether.internal.impl.DefaultRepositorySystem.deploy(DefaultRepositorySystem.java:413)
	at org.apache.maven.artifact.deployer.DefaultArtifactDeployer.deploy(DefaultArtifactDeployer.java:139)
	... 11 more
Caused by: org.eclipse.aether.transfer.MetadataTransferException: Could not transfer metadata
org.apache.maven.indexer:indexer-cli:6.0-SNAPSHOT/maven-metadata.xml from/to apache.snapshots.https
(https://repository.apache.org/content/repositories/snapshots): No route to host
	at org.eclipse.aether.connector.wagon.WagonRepositoryConnector$5.wrap(WagonRepositoryConnector.java:995)
	at org.eclipse.aether.connector.wagon.WagonRepositoryConnector$5.wrap(WagonRepositoryConnector.java:983)
	at org.eclipse.aether.connector.wagon.WagonRepositoryConnector$GetTask.run(WagonRepositoryConnector.java:725)
	at org.eclipse.aether.util.concurrency.RunnableErrorForwarder$1.run(RunnableErrorForwarder.java:67)
	at java.util.concurrent.ThreadPoolExecutor.runWorker(ThreadPoolExecutor.java:1145)
	at java.util.concurrent.ThreadPoolExecutor$Worker.run(ThreadPoolExecutor.java:615)
	at java.lang.Thread.run(Thread.java:745)
Caused by: org.apache.maven.wagon.TransferFailedException: No route to host
	at org.apache.maven.wagon.shared.http4.AbstractHttpClientWagon.fillInputData(AbstractHttpClientWagon.java:892)
	at org.apache.maven.wagon.StreamWagon.getInputStream(StreamWagon.java:116)
	at org.apache.maven.wagon.StreamWagon.getIfNewer(StreamWagon.java:88)
	at org.apache.maven.wagon.StreamWagon.get(StreamWagon.java:61)
	at org.eclipse.aether.connector.wagon.WagonRepositoryConnector$GetTask.run(WagonRepositoryConnector.java:660)
	... 4 more
Caused by: java.net.NoRouteToHostException: No route to host
	at java.net.PlainSocketImpl.socketConnect(Native Method)
	at java.net.AbstractPlainSocketImpl.doConnect(AbstractPlainSocketImpl.java:339)
	at java.net.AbstractPlainSocketImpl.connectToAddress(AbstractPlainSocketImpl.java:200)
	at java.net.AbstractPlainSocketImpl.connect(AbstractPlainSocketImpl.java:182)
	at java.net.SocksSocketImpl.connect(SocksSocketImpl.java:392)
	at java.net.Socket.connect(Socket.java:579)
	at sun.security.ssl.SSLSocketImpl.connect(SSLSocketImpl.java:618)
	at org.apache.http.conn.ssl.SSLSocketFactory.connectSocket(SSLSocketFactory.java:414)
	at org.apache.maven.wagon.shared.http4.ConfigurableSSLSocketFactoryDecorator.connectSocket(ConfigurableSSLSocketFactoryDecorator.java:64)
	at org.apache.http.impl.conn.DefaultClientConnectionOperator.openConnection(DefaultClientConnectionOperator.java:180)
	at org.apache.http.impl.conn.ManagedClientConnectionImpl.open(ManagedClientConnectionImpl.java:294)
	at org.apache.http.impl.client.DefaultRequestDirector.tryConnect(DefaultRequestDirector.java:643)
	at org.apache.http.impl.client.DefaultRequestDirector.execute(DefaultRequestDirector.java:479)
	at org.apache.http.impl.client.AbstractHttpClient.execute(AbstractHttpClient.java:906)
	at org.apache.http.impl.client.AbstractHttpClient.execute(AbstractHttpClient.java:805)
	at org.apache.maven.wagon.shared.http4.AbstractHttpClientWagon.execute(AbstractHttpClientWagon.java:746)
	at org.apache.maven.wagon.shared.http4.AbstractHttpClientWagon.fillInputData(AbstractHttpClientWagon.java:886)
	... 8 more
[INFO] Deployment failed after 12 sec
Build step 'Deploy artifacts to Maven repository' changed build result to FAILURE

Mime
View raw message