maven-notifications mailing list archives

Site index · List index
Message view « Date » · « Thread »
Top « Date » · « Thread »
From Apache Jenkins Server <jenk...@builds.apache.org>
Subject Build failed in Jenkins: maven-indexer #114
Date Sun, 13 Jul 2014 09:45:43 GMT
See <https://builds.apache.org/job/maven-indexer/114/>

------------------------------------------
[...truncated 751 lines...]
test :: org.apache.directory.server:apacheds-schema-archetype:1.0.2:null:maven-archetype
test :: commons-logging:commons-logging:1.0.4:null:jar
test :: commons-logging:commons-logging:1.0.4:sources:jar
test :: commons-logging:commons-logging:1.0.4:javadoc:jar
test :: commons-logging:commons-logging:1.0.3:null:jar
test :: commons-logging:commons-logging:1.0.3:javadoc:jar
test :: commons-logging:commons-logging:1.0.2:null:jar
test :: commons-logging:commons-logging:1.0.2:javadoc:jar
test :: ch.marcus-schulte.maven:hivedoc-plugin:1.0.0:null:maven-plugin
### TOTAL:24 (response said 24)
### Searched for field urn:maven#version (with 2 registered index fields) using query "1.0"
(QC create LQL "v:1.0")
test :: proptest:proptest-archetype:1.0:null:maven-archetype
test :: org.apache.maven.plugins:maven-core-it-plugin:1.0:null:maven-plugin
test :: org.apache.maven.plugins:maven-core-it-plugin:1.0:sources:jar
test :: org.apache.maven.plugins:maven-core-it-plugin:1.0:javadoc:jar
test :: missingpom:missingpom:1.0:null:jar
test :: commons-logging:commons-logging:1.0:null:jar
test :: commons-logging:commons-logging:1.0:javadoc:jar
test :: commons-cli:commons-cli:1.0:null:jar
test :: commons-cli:commons-cli:1.0:sources:jar
test :: brokenjar:brokenjar:1.0:null:jar
### TOTAL:10 (response said 10)
[main] INFO org.apache.maven.index.creator.MavenArchetypeArtifactInfoIndexCreator - Failed
to parse Maven artifact <https://builds.apache.org/job/maven-indexer/ws/indexer-core/src/test/repo/brokenjar/brokenjar/1.0/brokenjar-1.0.jar>
due to error in opening zip file
[main] INFO org.apache.maven.index.creator.MavenArchetypeArtifactInfoIndexCreator - Failed
to parse Maven artifact <https://builds.apache.org/job/maven-indexer/ws/indexer-core/src/test/repo/brokenjar/brokenjar/1.0/brokenjar-1.0.jar>
due to error in opening zip file
[main] INFO org.apache.maven.index.creator.MavenArchetypeArtifactInfoIndexCreator - Failed
to parse Maven artifact <https://builds.apache.org/job/maven-indexer/ws/indexer-core/src/test/repo/brokenjar/brokenjar/1.0/brokenjar-1.0.jar>
due to error in opening zip file
Tests run: 13, Failures: 0, Errors: 0, Skipped: 0, Time elapsed: 2.046 sec - in org.apache.maven.index.NexusIndexerTest
Running org.apache.maven.index.Nexus3293TimestampSnapshotTest
Tests run: 3, Failures: 0, Errors: 0, Skipped: 0, Time elapsed: 0.188 sec - in org.apache.maven.index.Nexus3293TimestampSnapshotTest
Running org.apache.maven.index.Nexus3881NexusIndexerTest
Tests run: 2, Failures: 0, Errors: 0, Skipped: 0, Time elapsed: 0.154 sec - in org.apache.maven.index.Nexus3881NexusIndexerTest
Running org.apache.maven.index.FullIndexNexusIndexerTest
[main] INFO org.apache.maven.index.creator.MavenArchetypeArtifactInfoIndexCreator - Failed
to parse Maven artifact <https://builds.apache.org/job/maven-indexer/ws/indexer-core/src/test/repo/brokenjar/brokenjar/1.0/brokenjar-1.0.jar>
due to error in opening zip file
[main] INFO org.apache.maven.index.creator.MavenArchetypeArtifactInfoIndexCreator - Failed
to parse Maven artifact <https://builds.apache.org/job/maven-indexer/ws/indexer-core/src/test/repo/brokenjar/brokenjar/1.0/brokenjar-1.0.jar>
due to error in opening zip file
[main] INFO org.apache.maven.index.creator.MavenArchetypeArtifactInfoIndexCreator - Failed
to parse Maven artifact <https://builds.apache.org/job/maven-indexer/ws/indexer-core/src/test/repo/brokenjar/brokenjar/1.0/brokenjar-1.0.jar>
due to error in opening zip file
[main] INFO org.apache.maven.index.creator.MavenArchetypeArtifactInfoIndexCreator - Failed
to parse Maven artifact <https://builds.apache.org/job/maven-indexer/ws/indexer-core/src/test/repo/brokenjar/brokenjar/1.0/brokenjar-1.0.jar>
due to error in opening zip file
[main] INFO org.apache.maven.index.creator.MavenArchetypeArtifactInfoIndexCreator - Failed
to parse Maven artifact <https://builds.apache.org/job/maven-indexer/ws/indexer-core/src/test/repo/brokenjar/brokenjar/1.0/brokenjar-1.0.jar>
due to error in opening zip file
[main] INFO org.apache.maven.index.creator.MavenArchetypeArtifactInfoIndexCreator - Failed
to parse Maven artifact <https://builds.apache.org/job/maven-indexer/ws/indexer-core/src/test/repo/brokenjar/brokenjar/1.0/brokenjar-1.0.jar>
due to error in opening zip file
[main] INFO org.apache.maven.index.creator.MavenArchetypeArtifactInfoIndexCreator - Failed
to parse Maven artifact <https://builds.apache.org/job/maven-indexer/ws/indexer-core/src/test/repo/brokenjar/brokenjar/1.0/brokenjar-1.0.jar>
due to error in opening zip file
[main] INFO org.apache.maven.index.creator.MavenArchetypeArtifactInfoIndexCreator - Failed
to parse Maven artifact <https://builds.apache.org/job/maven-indexer/ws/indexer-core/src/test/repo/brokenjar/brokenjar/1.0/brokenjar-1.0.jar>
due to error in opening zip file
[main] INFO org.apache.maven.index.creator.MavenArchetypeArtifactInfoIndexCreator - Failed
to parse Maven artifact <https://builds.apache.org/job/maven-indexer/ws/indexer-core/src/test/repo/brokenjar/brokenjar/1.0/brokenjar-1.0.jar>
due to error in opening zip file
[main] INFO org.apache.maven.index.creator.MavenArchetypeArtifactInfoIndexCreator - Failed
to parse Maven artifact <https://builds.apache.org/job/maven-indexer/ws/indexer-core/src/test/repo/brokenjar/brokenjar/1.0/brokenjar-1.0.jar>
due to error in opening zip file
[main] INFO org.apache.maven.index.creator.MavenArchetypeArtifactInfoIndexCreator - Failed
to parse Maven artifact <https://builds.apache.org/job/maven-indexer/ws/indexer-core/src/test/repo/brokenjar/brokenjar/1.0/brokenjar-1.0.jar>
due to error in opening zip file
[main] INFO org.apache.maven.index.creator.MavenArchetypeArtifactInfoIndexCreator - Failed
to parse Maven artifact <https://builds.apache.org/job/maven-indexer/ws/indexer-core/src/test/repo/brokenjar/brokenjar/1.0/brokenjar-1.0.jar>
due to error in opening zip file
[main] INFO org.apache.maven.index.creator.MavenArchetypeArtifactInfoIndexCreator - Failed
to parse Maven artifact <https://builds.apache.org/job/maven-indexer/ws/indexer-core/src/test/repo/brokenjar/brokenjar/1.0/brokenjar-1.0.jar>
due to error in opening zip file
[main] INFO org.apache.maven.index.creator.MavenArchetypeArtifactInfoIndexCreator - Failed
to parse Maven artifact <https://builds.apache.org/job/maven-indexer/ws/indexer-core/src/test/repo/brokenjar/brokenjar/1.0/brokenjar-1.0.jar>
due to error in opening zip file
[main] INFO org.apache.maven.index.creator.MavenArchetypeArtifactInfoIndexCreator - Failed
to parse Maven artifact <https://builds.apache.org/job/maven-indexer/ws/indexer-core/src/test/repo/brokenjar/brokenjar/1.0/brokenjar-1.0.jar>
due to error in opening zip file
[main] INFO org.apache.maven.index.creator.MavenArchetypeArtifactInfoIndexCreator - Failed
to parse Maven artifact <https://builds.apache.org/job/maven-indexer/ws/indexer-core/src/test/repo/brokenjar/brokenjar/1.0/brokenjar-1.0.jar>
due to error in opening zip file
[main] INFO org.apache.maven.index.creator.MavenArchetypeArtifactInfoIndexCreator - Failed
to parse Maven artifact <https://builds.apache.org/job/maven-indexer/ws/indexer-core/src/test/repo/brokenjar/brokenjar/1.0/brokenjar-1.0.jar>
due to error in opening zip file
[main] INFO org.apache.maven.index.creator.MavenArchetypeArtifactInfoIndexCreator - Failed
to parse Maven artifact <https://builds.apache.org/job/maven-indexer/ws/indexer-core/src/test/repo/brokenjar/brokenjar/1.0/brokenjar-1.0.jar>
due to error in opening zip file
[main] INFO org.apache.maven.index.creator.MavenArchetypeArtifactInfoIndexCreator - Failed
to parse Maven artifact <https://builds.apache.org/job/maven-indexer/ws/indexer-core/src/test/repo/brokenjar/brokenjar/1.0/brokenjar-1.0.jar>
due to error in opening zip file
[main] INFO org.apache.maven.index.creator.MavenArchetypeArtifactInfoIndexCreator - Failed
to parse Maven artifact <https://builds.apache.org/job/maven-indexer/ws/indexer-core/src/test/repo/brokenjar/brokenjar/1.0/brokenjar-1.0.jar>
due to error in opening zip file
[main] INFO org.apache.maven.index.creator.MavenArchetypeArtifactInfoIndexCreator - Failed
to parse Maven artifact <https://builds.apache.org/job/maven-indexer/ws/indexer-core/src/test/repo/brokenjar/brokenjar/1.0/brokenjar-1.0.jar>
due to error in opening zip file
Tests run: 21, Failures: 0, Errors: 0, Skipped: 0, Time elapsed: 4.61 sec - in org.apache.maven.index.FullIndexNexusIndexerTest
Running org.apache.maven.index.Nexus645NexusIndexerTest
Tests run: 2, Failures: 0, Errors: 0, Skipped: 0, Time elapsed: 0.143 sec - in org.apache.maven.index.Nexus645NexusIndexerTest
Running org.apache.maven.index.Nexus4674GavPathReindexTest
Tests run: 3, Failures: 0, Errors: 0, Skipped: 0, Time elapsed: 0.385 sec - in org.apache.maven.index.Nexus4674GavPathReindexTest
Running org.apache.maven.index.Nexus658NexusIndexerTest
Tests run: 2, Failures: 0, Errors: 0, Skipped: 0, Time elapsed: 0.147 sec - in org.apache.maven.index.Nexus658NexusIndexerTest
Running org.apache.maven.index.Nexus1911IncrementalTest
[main] INFO org.apache.maven.index.packer.DefaultIndexPacker - Unable to read properties file,
will force index regeneration
[main] INFO org.apache.maven.index.packer.DefaultIndexPacker - Unable to read properties file,
will force index regeneration
[main] INFO org.apache.maven.index.packer.DefaultIndexPacker - Unable to read properties file,
will force index regeneration
[main] INFO org.apache.maven.index.packer.DefaultIndexPacker - Unable to read properties file,
will force index regeneration
[main] INFO org.apache.maven.index.packer.DefaultIndexPacker - Unable to read properties file,
will force index regeneration
Tests run: 6, Failures: 0, Errors: 0, Skipped: 0, Time elapsed: 1.602 sec - in org.apache.maven.index.Nexus1911IncrementalTest
Running org.apache.maven.index.context.NexusAnalyzerTest
Tests run: 1, Failures: 0, Errors: 0, Skipped: 0, Time elapsed: 0 sec - in org.apache.maven.index.context.NexusAnalyzerTest
Running org.apache.maven.index.updater.IndexDataTest
[main] INFO org.apache.maven.index.creator.MavenArchetypeArtifactInfoIndexCreator - Failed
to parse Maven artifact <https://builds.apache.org/job/maven-indexer/ws/indexer-core/src/test/repo/brokenjar/brokenjar/1.0/brokenjar-1.0.jar>
due to error in opening zip file
[main] INFO org.apache.maven.index.creator.MavenArchetypeArtifactInfoIndexCreator - Failed
to parse Maven artifact <https://builds.apache.org/job/maven-indexer/ws/indexer-core/src/test/repo/brokenjar/brokenjar/1.0/brokenjar-1.0.jar>
due to error in opening zip file
[main] INFO org.apache.maven.index.creator.MavenArchetypeArtifactInfoIndexCreator - Failed
to parse Maven artifact <https://builds.apache.org/job/maven-indexer/ws/indexer-core/src/test/repo/brokenjar/brokenjar/1.0/brokenjar-1.0.jar>
due to error in opening zip file
[main] INFO org.apache.maven.index.creator.MavenArchetypeArtifactInfoIndexCreator - Failed
to parse Maven artifact <https://builds.apache.org/job/maven-indexer/ws/indexer-core/src/test/repo/brokenjar/brokenjar/1.0/brokenjar-1.0.jar>
due to error in opening zip file
[main] INFO org.apache.maven.index.creator.MavenArchetypeArtifactInfoIndexCreator - Failed
to parse Maven artifact <https://builds.apache.org/job/maven-indexer/ws/indexer-core/src/test/repo/brokenjar/brokenjar/1.0/brokenjar-1.0.jar>
due to error in opening zip file
[main] INFO org.apache.maven.index.creator.MavenArchetypeArtifactInfoIndexCreator - Failed
to parse Maven artifact <https://builds.apache.org/job/maven-indexer/ws/indexer-core/src/test/repo/brokenjar/brokenjar/1.0/brokenjar-1.0.jar>
due to error in opening zip file
[main] INFO org.apache.maven.index.creator.MavenArchetypeArtifactInfoIndexCreator - Failed
to parse Maven artifact <https://builds.apache.org/job/maven-indexer/ws/indexer-core/src/test/repo/brokenjar/brokenjar/1.0/brokenjar-1.0.jar>
due to error in opening zip file
[main] INFO org.apache.maven.index.creator.MavenArchetypeArtifactInfoIndexCreator - Failed
to parse Maven artifact <https://builds.apache.org/job/maven-indexer/ws/indexer-core/src/test/repo/brokenjar/brokenjar/1.0/brokenjar-1.0.jar>
due to error in opening zip file
[main] INFO org.apache.maven.index.creator.MavenArchetypeArtifactInfoIndexCreator - Failed
to parse Maven artifact <https://builds.apache.org/job/maven-indexer/ws/indexer-core/src/test/repo/brokenjar/brokenjar/1.0/brokenjar-1.0.jar>
due to error in opening zip file
[main] INFO org.apache.maven.index.creator.MavenArchetypeArtifactInfoIndexCreator - Failed
to parse Maven artifact <https://builds.apache.org/job/maven-indexer/ws/indexer-core/src/test/repo/brokenjar/brokenjar/1.0/brokenjar-1.0.jar>
due to error in opening zip file
[main] INFO org.apache.maven.index.creator.MavenArchetypeArtifactInfoIndexCreator - Failed
to parse Maven artifact <https://builds.apache.org/job/maven-indexer/ws/indexer-core/src/test/repo/brokenjar/brokenjar/1.0/brokenjar-1.0.jar>
due to error in opening zip file
Tests run: 11, Failures: 0, Errors: 0, Skipped: 0, Time elapsed: 1.657 sec - in org.apache.maven.index.updater.IndexDataTest
Running org.apache.maven.index.updater.DownloadRemoteIndexerManagerTest
[main] INFO org.mortbay.log - Logging to org.slf4j.impl.SimpleLogger(org.mortbay.log) via
org.mortbay.log.Slf4jLog
[main] INFO org.mortbay.log - jetty-6.1.19
[main] INFO org.mortbay.log - Started SocketConnector@0.0.0.0:55415
[main] INFO org.mortbay.log - jetty-6.1.19
[main] INFO org.mortbay.log - Started SocketConnector@0.0.0.0:45803
Tests run: 2, Failures: 0, Errors: 0, Skipped: 0, Time elapsed: 0.893 sec - in org.apache.maven.index.updater.DownloadRemoteIndexerManagerTest
Running org.apache.maven.index.updater.LocalIndexCacheTest
[main] INFO org.apache.maven.index.packer.DefaultIndexPacker - Unable to read properties file,
will force index regeneration
[main] INFO org.apache.maven.index.packer.DefaultIndexPacker - Unable to read properties file,
will force index regeneration
[main] INFO org.apache.maven.index.packer.DefaultIndexPacker - Unable to read properties file,
will force index regeneration
[main] ERROR org.apache.maven.index.updater.DefaultIndexUpdater - Fallback to *.zip also failed:
java.io.IOException
[main] INFO org.apache.maven.index.packer.DefaultIndexPacker - Unable to read properties file,
will force index regeneration
[main] INFO org.apache.maven.index.packer.DefaultIndexPacker - Unable to read properties file,
will force index regeneration
[main] INFO org.apache.maven.index.packer.DefaultIndexPacker - Unable to read properties file,
will force index regeneration
Tests run: 7, Failures: 0, Errors: 0, Skipped: 0, Time elapsed: 1.232 sec - in org.apache.maven.index.updater.LocalIndexCacheTest
Running org.apache.maven.index.updater.DefaultIndexUpdaterTest
Tests run: 13, Failures: 0, Errors: 0, Skipped: 0, Time elapsed: 0.934 sec - in org.apache.maven.index.updater.DefaultIndexUpdaterTest
Running org.apache.maven.index.packer.NEXUS4149TransferFormatTest
[main] INFO org.apache.maven.index.packer.DefaultIndexPacker - Unable to read properties file,
will force index regeneration
Tests run: 3, Failures: 0, Errors: 0, Skipped: 0, Time elapsed: 0.901 sec - in org.apache.maven.index.packer.NEXUS4149TransferFormatTest
Running org.apache.maven.index.Nexus3233NexusIndexerTest
Tests run: 2, Failures: 0, Errors: 0, Skipped: 0, Time elapsed: 0.158 sec - in org.apache.maven.index.Nexus3233NexusIndexerTest
Running org.apache.maven.index.Nexus1911IncrementalMergedCtxTest
[main] INFO org.apache.maven.index.packer.DefaultIndexPacker - Unable to read properties file,
will force index regeneration
[main] INFO org.apache.maven.index.packer.DefaultIndexPacker - Unable to read properties file,
will force index regeneration
[main] INFO org.apache.maven.index.packer.DefaultIndexPacker - Unable to read properties file,
will force index regeneration
[main] INFO org.apache.maven.index.packer.DefaultIndexPacker - Unable to read properties file,
will force index regeneration
[main] INFO org.apache.maven.index.packer.DefaultIndexPacker - Unable to read properties file,
will force index regeneration
Tests run: 6, Failures: 0, Errors: 0, Skipped: 0, Time elapsed: 1.584 sec - in org.apache.maven.index.Nexus1911IncrementalMergedCtxTest
Running org.apache.maven.index.treeview.IndexTreeViewTest
Tests run: 6, Failures: 0, Errors: 0, Skipped: 0, Time elapsed: 0.611 sec - in org.apache.maven.index.treeview.IndexTreeViewTest
Running org.apache.maven.index.ConcurrentUseWithMergedContextPublishingTest
[main] INFO org.apache.maven.index.creator.MavenArchetypeArtifactInfoIndexCreator - Failed
to parse Maven artifact <https://builds.apache.org/job/maven-indexer/ws/indexer-core/src/test/repo/brokenjar/brokenjar/1.0/brokenjar-1.0.jar>
due to error in opening zip file
[main] INFO org.apache.maven.index.creator.MavenArchetypeArtifactInfoIndexCreator - Failed
to parse Maven artifact <https://builds.apache.org/job/maven-indexer/ws/indexer-core/src/test/repo/brokenjar/brokenjar/1.0/brokenjar-1.0.jar>
due to error in opening zip file
[Thread-46] INFO org.apache.maven.index.packer.DefaultIndexPacker - Unable to read properties
file, will force index regeneration
[Thread-50] INFO org.apache.maven.index.packer.DefaultIndexPacker - Unable to read properties
file, will force index regeneration
[Thread-53] INFO org.apache.maven.index.packer.DefaultIndexPacker - Unable to read properties
file, will force index regeneration
[Thread-52] INFO org.apache.maven.index.packer.DefaultIndexPacker - Unable to read properties
file, will force index regeneration
[Thread-54] INFO org.apache.maven.index.packer.DefaultIndexPacker - Unable to read properties
file, will force index regeneration
[Thread-51] INFO org.apache.maven.index.packer.DefaultIndexPacker - Unable to read properties
file, will force index regeneration
[Thread-55] INFO org.apache.maven.index.packer.DefaultIndexPacker - Unable to read properties
file, will force index regeneration
[Thread-48] INFO org.apache.maven.index.packer.DefaultIndexPacker - Unable to read properties
file, will force index regeneration
[Thread-47] INFO org.apache.maven.index.packer.DefaultIndexPacker - Unable to read properties
file, will force index regeneration
[Thread-49] INFO org.apache.maven.index.packer.DefaultIndexPacker - Unable to read properties
file, will force index regeneration
Killed

Results :

Tests run: 161, Failures: 0, Errors: 0, Skipped: 1

[JENKINS] Recording test results
[INFO]                                                                         
[INFO] ------------------------------------------------------------------------
[INFO] Skipping Maven :: Indexer CLI
[INFO] This project has been banned from the build due to previous failures.
[INFO] ------------------------------------------------------------------------
[INFO]                                                                         
[INFO] ------------------------------------------------------------------------
[INFO] Skipping Maven :: Indexer Examples
[INFO] This project has been banned from the build due to previous failures.
[INFO] ------------------------------------------------------------------------
[INFO] ------------------------------------------------------------------------
[INFO] Reactor Summary:
[INFO] 
[INFO] Maven-Indexer ..................................... SUCCESS [30.176s]
[INFO] Maven :: Indexer Core ............................. FAILURE [1:04.519s]
[INFO] Maven :: Indexer CLI .............................. SKIPPED
[INFO] Maven :: Indexer Examples ......................... SKIPPED
[INFO] ------------------------------------------------------------------------
[INFO] BUILD FAILURE
[INFO] ------------------------------------------------------------------------
[INFO] Total time: 1:40.443s
[INFO] Finished at: Sun Jul 13 09:45:07 UTC 2014
[INFO] Final Memory: 28M/329M
[INFO] ------------------------------------------------------------------------
Waiting for Jenkins to finish collecting data[ERROR] Failed to execute goal org.apache.maven.plugins:maven-surefire-plugin:2.17:test
(default-test) on project indexer-core: Execution default-test of goal org.apache.maven.plugins:maven-surefire-plugin:2.17:test
failed: The forked VM terminated without properly saying goodbye. VM crash or System.exit
called?
[ERROR] Command was /bin/sh -c cd <https://builds.apache.org/job/maven-indexer/ws/indexer-core>
&& /home/jenkins/tools/java/jdk1.7.0_25-32/jre/bin/java -jar <https://builds.apache.org/job/maven-indexer/ws/indexer-core/target/surefire/surefirebooter1522144484112562634.jar>
<https://builds.apache.org/job/maven-indexer/ws/indexer-core/target/surefire/surefire9196111221520368641tmp>
<https://builds.apache.org/job/maven-indexer/ws/indexer-core/target/surefire/surefire_06205134472207346604tmp>
[ERROR] -> [Help 1]
org.apache.maven.lifecycle.LifecycleExecutionException: Failed to execute goal org.apache.maven.plugins:maven-surefire-plugin:2.17:test
(default-test) on project indexer-core: Execution default-test of goal org.apache.maven.plugins:maven-surefire-plugin:2.17:test
failed: The forked VM terminated without properly saying goodbye. VM crash or System.exit
called?
Command was /bin/sh -c cd <https://builds.apache.org/job/maven-indexer/ws/indexer-core>
&& /home/jenkins/tools/java/jdk1.7.0_25-32/jre/bin/java -jar <https://builds.apache.org/job/maven-indexer/ws/indexer-core/target/surefire/surefirebooter1522144484112562634.jar>
<https://builds.apache.org/job/maven-indexer/ws/indexer-core/target/surefire/surefire9196111221520368641tmp>
<https://builds.apache.org/job/maven-indexer/ws/indexer-core/target/surefire/surefire_06205134472207346604tmp>
	at org.apache.maven.lifecycle.internal.MojoExecutor.execute(MojoExecutor.java:225)
	at org.apache.maven.lifecycle.internal.MojoExecutor.execute(MojoExecutor.java:153)
	at org.apache.maven.lifecycle.internal.MojoExecutor.execute(MojoExecutor.java:145)
	at org.apache.maven.lifecycle.internal.LifecycleModuleBuilder.buildProject(LifecycleModuleBuilder.java:84)
	at org.apache.maven.lifecycle.internal.LifecycleModuleBuilder.buildProject(LifecycleModuleBuilder.java:59)
	at org.apache.maven.lifecycle.internal.LifecycleStarter.singleThreadedBuild(LifecycleStarter.java:183)
	at org.apache.maven.lifecycle.internal.LifecycleStarter.execute(LifecycleStarter.java:161)
	at org.apache.maven.DefaultMaven.doExecute(DefaultMaven.java:320)
	at org.apache.maven.DefaultMaven.execute(DefaultMaven.java:156)
	at org.jvnet.hudson.maven3.launcher.Maven3Launcher.main(Maven3Launcher.java:117)
	at sun.reflect.NativeMethodAccessorImpl.invoke0(Native Method)
	at sun.reflect.NativeMethodAccessorImpl.invoke(NativeMethodAccessorImpl.java:57)
	at sun.reflect.DelegatingMethodAccessorImpl.invoke(DelegatingMethodAccessorImpl.java:43)
	at java.lang.reflect.Method.invoke(Method.java:606)
	at org.codehaus.plexus.classworlds.launcher.Launcher.launchStandard(Launcher.java:329)
	at org.codehaus.plexus.classworlds.launcher.Launcher.launch(Launcher.java:239)
	at org.jvnet.hudson.maven3.agent.Maven3Main.launch(Maven3Main.java:178)
	at sun.reflect.NativeMethodAccessorImpl.invoke0(Native Method)
	at sun.reflect.NativeMethodAccessorImpl.invoke(NativeMethodAccessorImpl.java:57)
	at sun.reflect.DelegatingMethodAccessorImpl.invoke(DelegatingMethodAccessorImpl.java:43)
	at java.lang.reflect.Method.invoke(Method.java:606)
	at hudson.maven.Maven3Builder.call(Maven3Builder.java:134)
	at hudson.maven.Maven3Builder.call(Maven3Builder.java:69)
	at hudson.remoting.UserRequest.perform(UserRequest.java:118)
	at hudson.remoting.UserRequest.perform(UserRequest.java:48)
	at hudson.remoting.Request$2.run(Request.java:328)
	at hudson.remoting.InterceptingExecutorService$1.call(InterceptingExecutorService.java:72)
	at java.util.concurrent.FutureTask$Sync.innerRun(FutureTask.java:334)
	at java.util.concurrent.FutureTask.run(FutureTask.java:166)
	at java.util.concurrent.ThreadPoolExecutor.runWorker(ThreadPoolExecutor.java:1145)
	at java.util.concurrent.ThreadPoolExecutor$Worker.run(ThreadPoolExecutor.java:615)
	at java.lang.Thread.run(Thread.java:724)
Caused by: org.apache.maven.plugin.PluginExecutionException: Execution default-test of goal
org.apache.maven.plugins:maven-surefire-plugin:2.17:test failed: The forked VM terminated
without properly saying goodbye. VM crash or System.exit called?
Command was /bin/sh -c cd <https://builds.apache.org/job/maven-indexer/ws/indexer-core>
&& /home/jenkins/tools/java/jdk1.7.0_25-32/jre/bin/java -jar <https://builds.apache.org/job/maven-indexer/ws/indexer-core/target/surefire/surefirebooter1522144484112562634.jar>
<https://builds.apache.org/job/maven-indexer/ws/indexer-core/target/surefire/surefire9196111221520368641tmp>
<https://builds.apache.org/job/maven-indexer/ws/indexer-core/target/surefire/surefire_06205134472207346604tmp>
	at org.apache.maven.plugin.DefaultBuildPluginManager.executeMojo(DefaultBuildPluginManager.java:110)
	at org.apache.maven.lifecycle.internal.MojoExecutor.execute(MojoExecutor.java:209)
	... 31 more
Caused by: java.lang.RuntimeException: The forked VM terminated without properly saying goodbye.
VM crash or System.exit called?
Command was /bin/sh -c cd <https://builds.apache.org/job/maven-indexer/ws/indexer-core>
&& /home/jenkins/tools/java/jdk1.7.0_25-32/jre/bin/java -jar <https://builds.apache.org/job/maven-indexer/ws/indexer-core/target/surefire/surefirebooter1522144484112562634.jar>
<https://builds.apache.org/job/maven-indexer/ws/indexer-core/target/surefire/surefire9196111221520368641tmp>
<https://builds.apache.org/job/maven-indexer/ws/indexer-core/target/surefire/surefire_06205134472207346604tmp>
	at org.apache.maven.plugin.surefire.booterclient.ForkStarter.fork(ForkStarter.java:485)
	at org.apache.maven.plugin.surefire.booterclient.ForkStarter.fork(ForkStarter.java:352)
	at org.apache.maven.plugin.surefire.booterclient.ForkStarter.run(ForkStarter.java:158)
	at org.apache.maven.plugin.surefire.AbstractSurefireMojo.executeProvider(AbstractSurefireMojo.java:967)
	at org.apache.maven.plugin.surefire.AbstractSurefireMojo.executeAfterPreconditionsChecked(AbstractSurefireMojo.java:831)
	at org.apache.maven.plugin.surefire.AbstractSurefireMojo.execute(AbstractSurefireMojo.java:729)
	at org.apache.maven.plugin.DefaultBuildPluginManager.executeMojo(DefaultBuildPluginManager.java:101)
	... 32 more
[ERROR] 
[ERROR] Re-run Maven using the -X switch to enable full debug logging.
[ERROR] 
[ERROR] For more information about the errors and possible solutions, please read the following
articles:
[ERROR] [Help 1] http://cwiki.apache.org/confluence/display/MAVEN/PluginExecutionException
[ERROR] 
[ERROR] After correcting the problems, you can resume the build with the command
[ERROR]   mvn <goals> -rf :indexer-core

[JENKINS] Archiving <https://builds.apache.org/job/maven-indexer/ws/pom.xml> to org.apache.maven.indexer/maven-indexer/6.0-SNAPSHOT/maven-indexer-6.0-SNAPSHOT.pom
[JENKINS] Archiving <https://builds.apache.org/job/maven-indexer/ws/target/maven-indexer-6.0-SNAPSHOT-site.xml>
to org.apache.maven.indexer/maven-indexer/6.0-SNAPSHOT/maven-indexer-6.0-SNAPSHOT-site.xml
Sending artifact delta relative to maven-indexer ? Maven-Indexer #113
Archived 2 artifacts
Archive block size is 32768
Received 0 blocks and 19023 bytes
Compression is 0.0%
Took 1.3 sec
[JENKINS] Archiving <https://builds.apache.org/job/maven-indexer/ws/indexer-examples/pom.xml>
to org.apache.maven.indexer/indexer-examples/6.0-SNAPSHOT/indexer-examples-6.0-SNAPSHOT.pom
Sending artifact delta relative to maven-indexer ? Maven :: Indexer Examples #113
Archived 1 artifacts
Archive block size is 32768
Received 0 blocks and 3740 bytes
Compression is 0.0%
Took 0.1 sec
[JENKINS] Archiving <https://builds.apache.org/job/maven-indexer/ws/indexer-core/pom.xml>
to org.apache.maven.indexer/indexer-core/6.0-SNAPSHOT/indexer-core-6.0-SNAPSHOT.pom
Sending artifact delta relative to maven-indexer ? Maven :: Indexer Core #113
Archived 1 artifacts
Archive block size is 32768
Received 0 blocks and 6674 bytes
Compression is 0.0%
Took 0.1 sec
[JENKINS] Archiving <https://builds.apache.org/job/maven-indexer/ws/indexer-cli/pom.xml>
to org.apache.maven.indexer/indexer-cli/6.0-SNAPSHOT/indexer-cli-6.0-SNAPSHOT.pom
Sending artifact delta relative to maven-indexer ? Maven :: Indexer CLI #113
Archived 1 artifacts
Archive block size is 32768
Received 0 blocks and 6546 bytes
Compression is 0.0%
Took 0.23 sec
Sending e-mails to: notifications@maven.apache.org
channel stopped

Mime
View raw message