maven-notifications mailing list archives

Site index · List index
Message view « Date » · « Thread »
Top « Date » · « Thread »
From Apache Jenkins Server <jenk...@builds.apache.org>
Subject Build failed in Jenkins: maven-enforcer #126
Date Wed, 02 Jul 2014 08:30:57 GMT
See <https://builds.apache.org/job/maven-enforcer/126/>

------------------------------------------
[...truncated 589 lines...]
[INFO] artifact org.apache.maven.enforcer.enforcer:2.0-SNAPSHOT: checking for updates from
central
[INFO] artifact org.apache.maven.enforcer.enforcer-api:2.0-SNAPSHOT: checking for updates
from central
[INFO] artifact org.apache.maven.enforcer.enforcer-rules:2.0-SNAPSHOT: checking for updates
from central
[INFO] ..SUCCESS (4.5 s)
[INFO] Building: require-no-repositories_failure/pom.xml
[INFO] run script verify.groovy
[INFO] ..SUCCESS (3.5 s)
[INFO] Building: require-upper-bound-dependencies-managed_failure/pom.xml
[INFO] run script verify.groovy
[INFO] ..SUCCESS (2.4 s)
[INFO] Building: dependencies_converge/pom.xml
[INFO] ..SUCCESS (2.3 s)
[INFO] Building: require-release-dependencies/pom.xml
[INFO] ..SUCCESS (2.2 s)
[INFO] Building: evaluate-beanshell/pom.xml
[INFO] ..SUCCESS (2.6 s)
[INFO] Building: require-no-repositories/pom.xml
[INFO] ..SUCCESS (2.6 s)
[INFO] Building: require-plugin-versions-projectGAVexpressions/pom.xml
[INFO] ..SUCCESS (2.5 s)
[INFO] Building: multimodule/pom.xml
[INFO] ..SUCCESS (2.5 s)
[INFO] Building: ban-transitive-dependencies/pom.xml
[INFO] ..SUCCESS (2.5 s)
[INFO] Building: always-fail-warn/pom.xml
[INFO] run script verify.groovy
[INFO] ..SUCCESS (2.0 s)
[INFO] Building: require-upper-bound-deps_failure/pom.xml
[INFO] run script verify.groovy
[INFO] ..SUCCESS (2.4 s)
[INFO] Building: require-maven-version/pom.xml
[INFO] ..SUCCESS (1.9 s)
[INFO] Building: require-upper-bound-deps_success/pom.xml
[INFO] ..SUCCESS (1.9 s)
[INFO] Building: require-release-dependencies-excludes_failure/pom.xml
[INFO] snapshot org.apache.maven.plugins.enforcer.its:menforcer85_api:1.0-SNAPSHOT: checking
for updates from Nexus
[INFO] artifact org.apache.maven.plugins.enforcer.its.menforcer85_api:1.0-SNAPSHOT: checking
for updates from central
[INFO] ..SUCCESS (2.6 s)
[INFO] Building: banned-dependencies-wildcards/pom.xml
[INFO] ..SUCCESS (2.3 s)
[INFO] Building: require-property/pom.xml
[INFO] ..SUCCESS (2.4 s)
[INFO] Building: require-release-version/pom.xml
[INFO] ..SUCCESS (2.5 s)
[INFO] Building: ban-distribution-management-multi-module-except-site/pom.xml
[INFO] run script verify.groovy
[INFO] ..SUCCESS (3.2 s)
[INFO] Building: require-active-profile/pom.xml
[INFO] ..SUCCESS (2.5 s)
[INFO] Building: ban-transitive-dependencies-fail/pom.xml
[INFO] run script verify.groovy
[INFO] ..SUCCESS (2.3 s)
[INFO] Building: require-plugin-versions-plugin-with-extensions/pom.xml
[INFO] ..SUCCESS (3.2 s)
[INFO] Building: require-files-exist/pom.xml
[INFO] ..SUCCESS (2.6 s)
[INFO] Building: require-same-versions_success/pom.xml
[INFO] ..SUCCESS (2.9 s)
[INFO] Building: always-pass/pom.xml
[INFO] ..SUCCESS (2.3 s)
[INFO] Building: require-files-size/pom.xml
[INFO] ..SUCCESS (2.5 s)
[INFO] Building: require-java-version/pom.xml
[INFO] ..SUCCESS (2.4 s)
[INFO] Building: require-upper-bound-dependencies-unique_success/pom.xml
[INFO] snapshot org.apache.maven.plugins.enforcer.its:menforcer134_project:1.0-SNAPSHOT: checking
for updates from Nexus
[INFO] artifact org.apache.maven.plugins.enforcer.its.menforcer134_project:1.0-SNAPSHOT: checking
for updates from central
[INFO] snapshot org.apache.maven.plugins.enforcer.its:menforcer134_modelbuilder:1.0-SNAPSHOT:
checking for updates from Nexus
[INFO] artifact org.apache.maven.plugins.enforcer.its.menforcer134_modelbuilder:1.0-SNAPSHOT:
checking for updates from central
Downloading: http://repo.maven.apache.org/maven2/org/apache/maven/plugins/enforcer/its/menforcer134_model/1.0-20130423.044324-5,638/menforcer134_model-1.0-20130423.044324-5,638.pom
Downloading: http://repo.maven.apache.org/maven2/org/apache/maven/plugins/enforcer/its/menforcer134_model/1.0-20130423.044324-5,638/menforcer134_model-1.0-20130423.044324-5,638.pom
[INFO] snapshot org.apache.maven.plugins.enforcer.its:menforcer134_model:1.0-SNAPSHOT: checking
for updates from Nexus
[INFO] artifact org.apache.maven.plugins.enforcer.its.menforcer134_model:1.0-SNAPSHOT: checking
for updates from central
Downloading: http://repo.maven.apache.org/maven2/org/apache/maven/plugins/enforcer/its/menforcer134_model/1.0-20130423.042904-7,222/menforcer134_model-1.0-20130423.042904-7,222.pom
Downloading: http://repo.maven.apache.org/maven2/org/apache/maven/plugins/enforcer/its/menforcer134_model/1.0-20130423.042904-7,222/menforcer134_model-1.0-20130423.042904-7,222.pom
[INFO] ..SUCCESS (3.2 s)
[INFO] Building: banned-plugins/pom.xml
[INFO] ..SUCCESS (2.2 s)
[INFO] Building: require-plugin-versions-custom-packaging/pom.xml
[INFO] ..SUCCESS (3.5 s)
[INFO] Building: require-upper-bound-dependencies-managed_success/pom.xml
[INFO] ..SUCCESS (2.3 s)
[INFO] Building: dependencies_not_converging_test_scope/pom.xml
[INFO] ..SUCCESS (2.5 s)
[INFO] Building: require-release-dependencies-excludes/pom.xml
[INFO] ..SUCCESS (2.5 s)
[INFO] Building: builds_a_pom_noop/pom.xml
[INFO] ..SUCCESS (2.1 s)
[INFO] Building: banned-dependencies/pom.xml
[INFO] ..SUCCESS (2.5 s)
[INFO] Building: resolve_collect_dependencies/pom.xml
[INFO] run script verify.groovy
[INFO] ..SUCCESS (4.4 s)
[INFO] Building: never-fail-on-recommendations/pom.xml
[INFO] run script verify.groovy
[INFO] ..SUCCESS (5.2 s)
[INFO] Building: require-plugin-versions-plugin-with-integration-test-lifecycle/pom.xml
[INFO] ..SUCCESS (7.7 s)
[INFO] Building: require-plugin-versions/pom.xml
[INFO] ..SUCCESS (2.6 s)
[INFO] Building: require-plugin-versions-expressions/pom.xml
[INFO] ..SUCCESS (2.7 s)
[INFO] Building: require-files-dont-exist/pom.xml
[INFO] ..SUCCESS (2.6 s)
[INFO] Building: ban-distribution-management/pom.xml
[INFO] run script verify.groovy
[INFO] ..SUCCESS (2.4 s)
[INFO] Building: ban-pom-dependency-version/pom.xml
[INFO] run script verify.groovy
[INFO] ..SUCCESS (2.3 s)
[INFO] Building: always-fail/pom.xml
[INFO] ..SUCCESS (2.4 s)
[INFO] Building: require-active-profile-from-settings/pom.xml
[INFO] ..SUCCESS (2.7 s)
[INFO] Building: require-same-versions_failure/pom.xml
[INFO] ..SUCCESS (2.3 s)
[INFO] Building: require-upper-bound-dependencies-unique_failure/pom.xml
Downloading: http://repo.maven.apache.org/maven2/org/apache/maven/plugins/enforcer/its/menforcer134_model/1.0-20130423.044324-5,638/menforcer134_model-1.0-20130423.044324-5,638.pom
Downloading: http://repo.maven.apache.org/maven2/org/apache/maven/plugins/enforcer/its/menforcer134_model/1.0-20130423.044324-5,638/menforcer134_model-1.0-20130423.044324-5,638.pom
Downloading: http://repo.maven.apache.org/maven2/org/apache/maven/plugins/enforcer/its/menforcer134_model/1.0-20130423.042904-7,222/menforcer134_model-1.0-20130423.042904-7,222.pom
Downloading: http://repo.maven.apache.org/maven2/org/apache/maven/plugins/enforcer/its/menforcer134_model/1.0-20130423.042904-7,222/menforcer134_model-1.0-20130423.042904-7,222.pom
[INFO] run script verify.groovy
[INFO] ..SUCCESS (2.5 s)
[INFO] Building: ban-distribution-management-multi-module-build/pom.xml
[INFO] run script verify.groovy
[INFO] ..SUCCESS (2.5 s)
[INFO] Building: require-active-profile-all/pom.xml
[INFO] ..SUCCESS (2.3 s)
[INFO] -------------------------------------------------
[INFO] Build Summary:
[INFO]   Passed: 49, Failed: 0, Errors: 0, Skipped: 0
[INFO] -------------------------------------------------
[INFO] 
[INFO] --- mrm-maven-plugin:1.0-beta-1:stop (default) @ maven-enforcer-plugin ---
[INFO] Stopping Mock Repository Manager on http://localhost:45020
[INFO] Mock Repository Manager http://localhost:45020 is stopped.
[INFO] 
[INFO] --- maven-install-plugin:2.5.1:install (default-install) @ maven-enforcer-plugin ---
[INFO] Installing <https://builds.apache.org/job/maven-enforcer/ws/maven-enforcer-plugin/target/maven-enforcer-plugin-2.0-SNAPSHOT.jar>
to /home/jenkins/jenkins-slave/maven-repositories/0/org/apache/maven/plugins/maven-enforcer-plugin/2.0-SNAPSHOT/maven-enforcer-plugin-2.0-SNAPSHOT.jar
[INFO] Installing <https://builds.apache.org/job/maven-enforcer/ws/maven-enforcer-plugin/pom.xml>
to /home/jenkins/jenkins-slave/maven-repositories/0/org/apache/maven/plugins/maven-enforcer-plugin/2.0-SNAPSHOT/maven-enforcer-plugin-2.0-SNAPSHOT.pom
[INFO] ------------------------------------------------------------------------
[INFO] Reactor Summary:
[INFO] 
[INFO] Apache Maven Enforcer ............................. SUCCESS [20.831s]
[INFO] Apache Maven Enforcer API ......................... SUCCESS [8.676s]
[INFO] Apache Maven Enforcer Rules ....................... SUCCESS [21.195s]
[INFO] Apache Maven Enforcer Plugin ...................... SUCCESS [2:38.665s]
[INFO] ------------------------------------------------------------------------
[INFO] BUILD SUCCESS
[INFO] ------------------------------------------------------------------------
[INFO] Total time: 3:34.391s
[INFO] Finished at: Wed Jul 02 08:29:45 UTC 2014
[INFO] Final Memory: 26M/96M
[INFO] ------------------------------------------------------------------------
Waiting for Jenkins to finish collecting data
[JENKINS] Archiving <https://builds.apache.org/job/maven-enforcer/ws/enforcer-rules/pom.xml>
to org.apache.maven.enforcer/enforcer-rules/2.0-SNAPSHOT/enforcer-rules-2.0-SNAPSHOT.pom
[JENKINS] Archiving <https://builds.apache.org/job/maven-enforcer/ws/enforcer-rules/target/enforcer-rules-2.0-SNAPSHOT.jar>
to org.apache.maven.enforcer/enforcer-rules/2.0-SNAPSHOT/enforcer-rules-2.0-SNAPSHOT.jar
[JENKINS] Archiving <https://builds.apache.org/job/maven-enforcer/ws/enforcer-rules/target/enforcer-rules-2.0-SNAPSHOT-tests.jar>
to org.apache.maven.enforcer/enforcer-rules/2.0-SNAPSHOT/enforcer-rules-2.0-SNAPSHOT-tests.jar
Sending artifact delta relative to maven-enforcer ? Apache Maven Enforcer Rules #125
Archived 3 artifacts
Archive block size is 32768
Received 0 blocks and 198464 bytes
Compression is 0.0%
Took 5.7 sec
[JENKINS] Archiving <https://builds.apache.org/job/maven-enforcer/ws/enforcer-api/pom.xml>
to org.apache.maven.enforcer/enforcer-api/2.0-SNAPSHOT/enforcer-api-2.0-SNAPSHOT.pom
[JENKINS] Archiving <https://builds.apache.org/job/maven-enforcer/ws/enforcer-api/target/enforcer-api-2.0-SNAPSHOT.jar>
to org.apache.maven.enforcer/enforcer-api/2.0-SNAPSHOT/enforcer-api-2.0-SNAPSHOT.jar
Sending artifact delta relative to maven-enforcer ? Apache Maven Enforcer API #125
Archived 2 artifacts
Archive block size is 32768
Received 0 blocks and 13657 bytes
Compression is 0.0%
Took 0.12 sec
[JENKINS] Archiving <https://builds.apache.org/job/maven-enforcer/ws/pom.xml> to org.apache.maven.enforcer/enforcer/2.0-SNAPSHOT/enforcer-2.0-SNAPSHOT.pom
[JENKINS] Archiving <https://builds.apache.org/job/maven-enforcer/ws/target/enforcer-2.0-SNAPSHOT-site.xml>
to org.apache.maven.enforcer/enforcer/2.0-SNAPSHOT/enforcer-2.0-SNAPSHOT-site.xml
Sending artifact delta relative to maven-enforcer ? Apache Maven Enforcer #125
Archived 2 artifacts
Archive block size is 32768
Received 0 blocks and 12967 bytes
Compression is 0.0%
Took 69 ms
[JENKINS] Archiving <https://builds.apache.org/job/maven-enforcer/ws/maven-enforcer-plugin/pom.xml>
to org.apache.maven.plugins/maven-enforcer-plugin/2.0-SNAPSHOT/maven-enforcer-plugin-2.0-SNAPSHOT.pom
[JENKINS] Archiving <https://builds.apache.org/job/maven-enforcer/ws/maven-enforcer-plugin/target/maven-enforcer-plugin-2.0-SNAPSHOT.jar>
to org.apache.maven.plugins/maven-enforcer-plugin/2.0-SNAPSHOT/maven-enforcer-plugin-2.0-SNAPSHOT.jar
Sending artifact delta relative to maven-enforcer ? Apache Maven Enforcer Plugin #125
Archived 2 artifacts
Archive block size is 32768
Received 0 blocks and 37444 bytes
Compression is 0.0%
Took 81 ms
channel stopped
Maven RedeployPublisher use remote ubuntu3 maven settings from : /home/jenkins/.m2/settings.xml
[INFO] Deployment in https://repository.apache.org/content/repositories/snapshots (id=apache.snapshots.https,uniqueVersion=true)
Deploying the main artifact enforcer-2.0-SNAPSHOT.pom
Downloading: https://repository.apache.org/content/repositories/snapshots/org/apache/maven/enforcer/enforcer/2.0-SNAPSHOT/maven-metadata.xml
Downloaded: https://repository.apache.org/content/repositories/snapshots/org/apache/maven/enforcer/enforcer/2.0-SNAPSHOT/maven-metadata.xml
(818 B at 0.1 KB/sec)
Uploading: https://repository.apache.org/content/repositories/snapshots/org/apache/maven/enforcer/enforcer/2.0-SNAPSHOT/enforcer-2.0-20140702.083009-82.pom
Uploaded: https://repository.apache.org/content/repositories/snapshots/org/apache/maven/enforcer/enforcer/2.0-SNAPSHOT/enforcer-2.0-20140702.083009-82.pom
(11 KB at 171.1 KB/sec)
Downloading: https://repository.apache.org/content/repositories/snapshots/org/apache/maven/enforcer/enforcer/maven-metadata.xml
Downloaded: https://repository.apache.org/content/repositories/snapshots/org/apache/maven/enforcer/enforcer/maven-metadata.xml
(428 B at 1.1 KB/sec)
Uploading: https://repository.apache.org/content/repositories/snapshots/org/apache/maven/enforcer/enforcer/2.0-SNAPSHOT/maven-metadata.xml
Uploaded: https://repository.apache.org/content/repositories/snapshots/org/apache/maven/enforcer/enforcer/2.0-SNAPSHOT/maven-metadata.xml
(818 B at 3.4 KB/sec)
Uploading: https://repository.apache.org/content/repositories/snapshots/org/apache/maven/enforcer/enforcer/maven-metadata.xml
Uploaded: https://repository.apache.org/content/repositories/snapshots/org/apache/maven/enforcer/enforcer/maven-metadata.xml
(428 B at 0.1 KB/sec)
Deploying the main artifact enforcer-2.0-SNAPSHOT-site.xml
Uploading: https://repository.apache.org/content/repositories/snapshots/org/apache/maven/enforcer/enforcer/2.0-SNAPSHOT/enforcer-2.0-20140702.083009-82-site.xml
Uploaded: https://repository.apache.org/content/repositories/snapshots/org/apache/maven/enforcer/enforcer/2.0-SNAPSHOT/enforcer-2.0-20140702.083009-82-site.xml
(2 KB at 0.1 KB/sec)
Uploading: https://repository.apache.org/content/repositories/snapshots/org/apache/maven/enforcer/enforcer/2.0-SNAPSHOT/maven-metadata.xml
Uploaded: https://repository.apache.org/content/repositories/snapshots/org/apache/maven/enforcer/enforcer/2.0-SNAPSHOT/maven-metadata.xml
(818 B at 15.1 KB/sec)
[INFO] Deployment in https://repository.apache.org/content/repositories/snapshots (id=apache.snapshots.https,uniqueVersion=true)
Deploying the main artifact enforcer-api-2.0-SNAPSHOT.jar
Downloading: https://repository.apache.org/content/repositories/snapshots/org/apache/maven/enforcer/enforcer-api/2.0-SNAPSHOT/maven-metadata.xml
Downloaded: https://repository.apache.org/content/repositories/snapshots/org/apache/maven/enforcer/enforcer-api/2.0-SNAPSHOT/maven-metadata.xml
(784 B at 0.1 KB/sec)
Uploading: https://repository.apache.org/content/repositories/snapshots/org/apache/maven/enforcer/enforcer-api/2.0-SNAPSHOT/enforcer-api-2.0-20140702.083051-82.jar
Uploading: https://repository.apache.org/content/repositories/snapshots/org/apache/maven/enforcer/enforcer-api/2.0-SNAPSHOT/enforcer-api-2.0-20140702.083051-82.pom
ERROR: Failed to deploy artifacts: Could not transfer artifact org.apache.maven.enforcer:enforcer-api:jar:2.0-20140702.083051-82
from/to apache.snapshots.https (https://repository.apache.org/content/repositories/snapshots):
Failed to transfer file: https://repository.apache.org/content/repositories/snapshots/org/apache/maven/enforcer/enforcer-api/2.0-SNAPSHOT/enforcer-api-2.0-20140702.083051-82.jar.
Return code is: 503, ReasonPhrase: Service Temporarily Unavailable.
org.apache.maven.artifact.deployer.ArtifactDeploymentException: Failed to deploy artifacts:
Could not transfer artifact org.apache.maven.enforcer:enforcer-api:jar:2.0-20140702.083051-82
from/to apache.snapshots.https (https://repository.apache.org/content/repositories/snapshots):
Failed to transfer file: https://repository.apache.org/content/repositories/snapshots/org/apache/maven/enforcer/enforcer-api/2.0-SNAPSHOT/enforcer-api-2.0-20140702.083051-82.jar.
Return code is: 503, ReasonPhrase: Service Temporarily Unavailable.
	at org.apache.maven.artifact.deployer.DefaultArtifactDeployer.deploy(DefaultArtifactDeployer.java:143)
	at hudson.maven.reporters.MavenArtifactRecord.deploy(MavenArtifactRecord.java:193)
	at hudson.maven.RedeployPublisher.perform(RedeployPublisher.java:176)
	at hudson.tasks.BuildStepMonitor$1.perform(BuildStepMonitor.java:20)
	at hudson.model.AbstractBuild$AbstractBuildExecution.perform(AbstractBuild.java:804)
	at hudson.model.AbstractBuild$AbstractBuildExecution.performAllBuildSteps(AbstractBuild.java:776)
	at hudson.maven.MavenModuleSetBuild$MavenModuleSetBuildExecution.post2(MavenModuleSetBuild.java:1040)
	at hudson.model.AbstractBuild$AbstractBuildExecution.post(AbstractBuild.java:725)
	at hudson.model.Run.execute(Run.java:1701)
	at hudson.maven.MavenModuleSetBuild.run(MavenModuleSetBuild.java:529)
	at hudson.model.ResourceController.execute(ResourceController.java:88)
	at hudson.model.Executor.run(Executor.java:231)
Caused by: org.eclipse.aether.deployment.DeploymentException: Failed to deploy artifacts:
Could not transfer artifact org.apache.maven.enforcer:enforcer-api:jar:2.0-20140702.083051-82
from/to apache.snapshots.https (https://repository.apache.org/content/repositories/snapshots):
Failed to transfer file: https://repository.apache.org/content/repositories/snapshots/org/apache/maven/enforcer/enforcer-api/2.0-SNAPSHOT/enforcer-api-2.0-20140702.083051-82.jar.
Return code is: 503, ReasonPhrase: Service Temporarily Unavailable.
	at org.eclipse.aether.internal.impl.DefaultDeployer.deploy(DefaultDeployer.java:341)
	at org.eclipse.aether.internal.impl.DefaultDeployer.deploy(DefaultDeployer.java:269)
	at org.eclipse.aether.internal.impl.DefaultRepositorySystem.deploy(DefaultRepositorySystem.java:413)
	at org.apache.maven.artifact.deployer.DefaultArtifactDeployer.deploy(DefaultArtifactDeployer.java:139)
	... 11 more
Caused by: org.eclipse.aether.transfer.ArtifactTransferException: Could not transfer artifact
org.apache.maven.enforcer:enforcer-api:jar:2.0-20140702.083051-82 from/to apache.snapshots.https
(https://repository.apache.org/content/repositories/snapshots): Failed to transfer file: https://repository.apache.org/content/repositories/snapshots/org/apache/maven/enforcer/enforcer-api/2.0-SNAPSHOT/enforcer-api-2.0-20140702.083051-82.jar.
Return code is: 503, ReasonPhrase: Service Temporarily Unavailable.
	at org.eclipse.aether.connector.wagon.WagonRepositoryConnector$6.wrap(WagonRepositoryConnector.java:1016)
	at org.eclipse.aether.connector.wagon.WagonRepositoryConnector$6.wrap(WagonRepositoryConnector.java:1004)
	at org.eclipse.aether.connector.wagon.WagonRepositoryConnector$PutTask.run(WagonRepositoryConnector.java:895)
	at org.eclipse.aether.connector.wagon.WagonRepositoryConnector.put(WagonRepositoryConnector.java:522)
	at org.eclipse.aether.internal.impl.DefaultDeployer.deploy(DefaultDeployer.java:335)
	... 14 more
Caused by: org.apache.maven.wagon.TransferFailedException: Failed to transfer file: https://repository.apache.org/content/repositories/snapshots/org/apache/maven/enforcer/enforcer-api/2.0-SNAPSHOT/enforcer-api-2.0-20140702.083051-82.jar.
Return code is: 503, ReasonPhrase: Service Temporarily Unavailable.
	at org.apache.maven.wagon.shared.http4.AbstractHttpClientWagon.put(AbstractHttpClientWagon.java:626)
	at org.apache.maven.wagon.shared.http4.AbstractHttpClientWagon.put(AbstractHttpClientWagon.java:524)
	at org.apache.maven.wagon.shared.http4.AbstractHttpClientWagon.put(AbstractHttpClientWagon.java:505)
	at org.apache.maven.wagon.shared.http4.AbstractHttpClientWagon.put(AbstractHttpClientWagon.java:485)
	at org.eclipse.aether.connector.wagon.WagonRepositoryConnector$PutTask.run(WagonRepositoryConnector.java:871)
	... 16 more
[INFO] Deployment failed after 48 sec
Build step 'Deploy artifacts to Maven repository' changed build result to FAILURE

Mime
View raw message