maven-notifications mailing list archives

Site index · List index
Message view « Date » · « Thread »
Top « Date » · « Thread »
From Apache Jenkins Server <jenk...@builds.apache.org>
Subject Build failed in Jenkins: maven-plugin-tools #189
Date Sat, 08 Mar 2014 17:02:48 GMT
See <https://builds.apache.org/job/maven-plugin-tools/189/changes>

Changes:

[hboutemy] [MPLUGIN-261] sort goals in generated plugin.xml

------------------------------------------
[...truncated 389 lines...]
[INFO] Maven Plugin Tool for Ant ......................... SKIPPED
[INFO] Maven Plugin Tool for Beanshell ................... SKIPPED
[INFO] Maven Plugin Plugin ............................... SKIPPED
[INFO] ------------------------------------------------------------------------
[INFO] BUILD FAILURE
[INFO] ------------------------------------------------------------------------
[INFO] Total time: 26.389s
[INFO] Finished at: Sat Mar 08 17:02:43 UTC 2014
[INFO] Final Memory: 23M/210M
[INFO] ------------------------------------------------------------------------
[ERROR] Failed to execute goal org.apache.maven.plugins:maven-compiler-plugin:2.5:testCompile
(default-testCompile) on project maven-script-ant: Compilation failure
[ERROR] error: error reading /home/jenkins/jenkins-slave/maven-repositories/1/junit/junit/3.8.2/junit-3.8.2.jar;
error in opening zip file
Waiting for Jenkins to finish collecting data[ERROR] -> [Help 1]
org.apache.maven.lifecycle.LifecycleExecutionException: Failed to execute goal org.apache.maven.plugins:maven-compiler-plugin:2.5:testCompile
(default-testCompile) on project maven-script-ant: Compilation failure
error: error reading /home/jenkins/jenkins-slave/maven-repositories/1/junit/junit/3.8.2/junit-3.8.2.jar;
error in opening zip file

	at org.apache.maven.lifecycle.internal.MojoExecutor.execute(MojoExecutor.java:213)
	at org.apache.maven.lifecycle.internal.MojoExecutor.execute(MojoExecutor.java:153)
	at org.apache.maven.lifecycle.internal.MojoExecutor.execute(MojoExecutor.java:145)
	at org.apache.maven.lifecycle.internal.LifecycleModuleBuilder.buildProject(LifecycleModuleBuilder.java:84)
	at org.apache.maven.lifecycle.internal.LifecycleModuleBuilder.buildProject(LifecycleModuleBuilder.java:59)
	at org.apache.maven.lifecycle.internal.LifecycleStarter.singleThreadedBuild(LifecycleStarter.java:183)
	at org.apache.maven.lifecycle.internal.LifecycleStarter.execute(LifecycleStarter.java:161)
	at org.apache.maven.DefaultMaven.doExecute(DefaultMaven.java:320)
	at org.apache.maven.DefaultMaven.execute(DefaultMaven.java:156)
	at org.jvnet.hudson.maven3.launcher.Maven3Launcher.main(Maven3Launcher.java:117)
	at sun.reflect.NativeMethodAccessorImpl.invoke0(Native Method)
	at sun.reflect.NativeMethodAccessorImpl.invoke(NativeMethodAccessorImpl.java:39)
	at sun.reflect.DelegatingMethodAccessorImpl.invoke(DelegatingMethodAccessorImpl.java:25)
	at java.lang.reflect.Method.invoke(Method.java:597)
	at org.codehaus.plexus.classworlds.launcher.Launcher.launchStandard(Launcher.java:329)
	at org.codehaus.plexus.classworlds.launcher.Launcher.launch(Launcher.java:239)
	at org.jvnet.hudson.maven3.agent.Maven3Main.launch(Maven3Main.java:178)
	at sun.reflect.NativeMethodAccessorImpl.invoke0(Native Method)
	at sun.reflect.NativeMethodAccessorImpl.invoke(NativeMethodAccessorImpl.java:39)
	at sun.reflect.DelegatingMethodAccessorImpl.invoke(DelegatingMethodAccessorImpl.java:25)
	at java.lang.reflect.Method.invoke(Method.java:597)
	at hudson.maven.Maven3Builder.call(Maven3Builder.java:134)
	at hudson.maven.Maven3Builder.call(Maven3Builder.java:69)
	at hudson.remoting.UserRequest.perform(UserRequest.java:118)
	at hudson.remoting.UserRequest.perform(UserRequest.java:48)
	at hudson.remoting.Request$2.run(Request.java:328)
	at hudson.remoting.InterceptingExecutorService$1.call(InterceptingExecutorService.java:72)
	at java.util.concurrent.FutureTask$Sync.innerRun(FutureTask.java:303)
	at java.util.concurrent.FutureTask.run(FutureTask.java:138)
	at java.util.concurrent.ThreadPoolExecutor$Worker.runTask(ThreadPoolExecutor.java:895)
	at java.util.concurrent.ThreadPoolExecutor$Worker.run(ThreadPoolExecutor.java:918)
	at java.lang.Thread.run(Thread.java:662)
Caused by: org.apache.maven.plugin.CompilationFailureException: Compilation failure
error: error reading /home/jenkins/jenkins-slave/maven-repositories/1/junit/junit/3.8.2/junit-3.8.2.jar;
error in opening zip file

	at org.apache.maven.plugin.AbstractCompilerMojo.execute(AbstractCompilerMojo.java:729)
	at org.apache.maven.plugin.TestCompilerMojo.execute(TestCompilerMojo.java:161)
	at org.apache.maven.plugin.DefaultBuildPluginManager.executeMojo(DefaultBuildPluginManager.java:101)
	at org.apache.maven.lifecycle.internal.MojoExecutor.execute(MojoExecutor.java:209)
	... 31 more
[ERROR] Failed to execute goal org.apache.maven.plugins:maven-compiler-plugin:2.5:testCompile
(default-testCompile) on project maven-plugin-tools-api: Compilation failure: Compilation
failure:
[ERROR] error: error reading /home/jenkins/jenkins-slave/maven-repositories/1/junit/junit/3.8.2/junit-3.8.2.jar;
cannot read zip file
[ERROR] <https://builds.apache.org/job/maven-plugin-tools/ws/maven-plugin-tools-api/src/test/java/org/apache/maven/tools/plugin/util/TestUtils.java>:[22,22]
package junit.framework does not exist
[ERROR] <https://builds.apache.org/job/maven-plugin-tools/ws/maven-plugin-tools-api/src/test/java/org/apache/maven/tools/plugin/util/TestUtils.java>:[32,12]
cannot find symbol
[ERROR] symbol: class TestCase
[ERROR] extends TestCase
[ERROR] <https://builds.apache.org/job/maven-plugin-tools/ws/maven-plugin-tools-api/src/test/java/org/apache/maven/tools/plugin/scanner/DefaultMojoScannerTest.java>:[22,22]
package junit.framework does not exist
[ERROR] <https://builds.apache.org/job/maven-plugin-tools/ws/maven-plugin-tools-api/src/test/java/org/apache/maven/tools/plugin/scanner/DefaultMojoScannerTest.java>:[47,12]
cannot find symbol
[ERROR] symbol: class TestCase
[ERROR] extends TestCase
[ERROR] <https://builds.apache.org/job/maven-plugin-tools/ws/maven-plugin-tools-api/src/test/java/org/apache/maven/tools/plugin/util/PluginUtilsTest.java>:[28,7]
cannot access junit.framework.TestCase
[ERROR] class file for junit.framework.TestCase not found
[ERROR] public class PluginUtilsTest
[ERROR] <https://builds.apache.org/job/maven-plugin-tools/ws/maven-plugin-tools-api/src/test/java/org/apache/maven/tools/plugin/util/TestUtils.java>:[37,27]
cannot find symbol
[ERROR] symbol  : method getClass()
[ERROR] location: class org.apache.maven.tools.plugin.util.TestUtils
[ERROR] <https://builds.apache.org/job/maven-plugin-tools/ws/maven-plugin-tools-api/src/test/java/org/apache/maven/tools/plugin/util/TestUtils.java>:[43,8]
cannot find symbol
[ERROR] symbol  : method assertEquals(java.lang.String,java.lang.String)

[ERROR] location: class org.apache.maven.tools.plugin.util.TestUtils
[ERROR] <https://builds.apache.org/job/maven-plugin-tools/ws/maven-plugin-tools-api/src/test/java/org/apache/maven/tools/plugin/scanner/DefaultMojoScannerTest.java>:[126,12]
cannot find symbol
[ERROR] symbol  : method fail(java.lang.String)
[ERROR] location: class org.apache.maven.tools.plugin.scanner.DefaultMojoScannerTest
[JENKINS] Archiving <https://builds.apache.org/job/maven-plugin-tools/ws/maven-plugin-tools-api/pom.xml>
to org.apache.maven.plugin-tools/maven-plugin-tools-api/3.3-SNAPSHOT/maven-plugin-tools-api-3.3-SNAPSHOT.pom
[ERROR] <https://builds.apache.org/job/maven-plugin-tools/ws/maven-plugin-tools-api/src/test/java/org/apache/maven/tools/plugin/scanner/DefaultMojoScannerTest.java>:[149,12]
cannot find symbol
[ERROR] symbol  : method fail(java.lang.String)
[ERROR] location: class org.apache.maven.tools.plugin.scanner.DefaultMojoScannerTest
[ERROR] <https://builds.apache.org/job/maven-plugin-tools/ws/maven-plugin-tools-api/src/test/java/org/apache/maven/tools/plugin/scanner/DefaultMojoScannerTest.java>:[190,12]
cannot find symbol
[ERROR] symbol  : method assertEquals(org.apache.maven.plugin.descriptor.PluginDescriptor,org.apache.maven.plugin.descriptor.PluginDescriptor)
[ERROR] location: class org.apache.maven.tools.plugin.scanner.DefaultMojoScannerTest
[ERROR] <https://builds.apache.org/job/maven-plugin-tools/ws/maven-plugin-tools-api/src/test/java/org/apache/maven/tools/plugin/scanner/DefaultMojoScannerTest.java>:[191,12]
cannot find symbol
[ERROR] symbol  : method assertTrue(java.lang.String,boolean)
[ERROR] location: class org.apache.maven.tools.plugin.scanner.DefaultMojoScannerTest
[ERROR] <https://builds.apache.org/job/maven-plugin-tools/ws/maven-plugin-tools-api/src/test/java/org/apache/maven/tools/plugin/scanner/DefaultMojoScannerTest.java>:[195,8]
cannot find symbol
[ERROR] symbol  : method assertTrue(java.lang.String,boolean)
[ERROR] location: class org.apache.maven.tools.plugin.scanner.DefaultMojoScannerTest
[ERROR] <https://builds.apache.org/job/maven-plugin-tools/ws/maven-plugin-tools-api/src/test/java/org/apache/maven/tools/plugin/util/PluginUtilsTest.java>:[33,8]
cannot find symbol
[ERROR] symbol  : method assertEquals(java.lang.String,java.lang.String)
[ERROR] location: class org.apache.maven.tools.plugin.util.PluginUtilsTest
[ERROR] <https://builds.apache.org/job/maven-plugin-tools/ws/maven-plugin-tools-api/src/test/java/org/apache/maven/tools/plugin/util/PluginUtilsTest.java>:[34,8]
cannot find symbol
[ERROR] symbol  : method assertEquals(java.lang.String,java.lang.String)
[ERROR] location: class org.apache.maven.tools.plugin.util.PluginUtilsTest
[ERROR] <https://builds.apache.org/job/maven-plugin-tools/ws/maven-plugin-tools-api/src/test/java/org/apache/maven/tools/plugin/util/PluginUtilsTest.java>:[35,8]
cannot find symbol
[ERROR] symbol  : method assertEquals(java.lang.String,java.lang.String)
[ERROR] location: class org.apache.maven.tools.plugin.util.PluginUtilsTest
[ERROR] <https://builds.apache.org/job/maven-plugin-tools/ws/maven-plugin-tools-api/src/test/java/org/apache/maven/tools/plugin/util/PluginUtilsTest.java>:[36,8]
cannot find symbol
[ERROR] symbol  : method assertEquals(java.lang.String,java.lang.String)
[ERROR] location: class org.apache.maven.tools.plugin.util.PluginUtilsTest
[ERROR] <https://builds.apache.org/job/maven-plugin-tools/ws/maven-plugin-tools-api/src/test/java/org/apache/maven/tools/plugin/util/PluginUtilsTest.java>:[37,8]
cannot find symbol
[ERROR] symbol  : method assertEquals(java.lang.String,java.lang.String)
[ERROR] location: class org.apache.maven.tools.plugin.util.PluginUtilsTest
[ERROR] <https://builds.apache.org/job/maven-plugin-tools/ws/maven-plugin-tools-api/src/test/java/org/apache/maven/tools/plugin/util/PluginUtilsTest.java>:[38,8]
cannot find symbol
[ERROR] symbol  : method assertEquals(java.lang.String,java.lang.String)
[ERROR] location: class org.apache.maven.tools.plugin.util.PluginUtilsTest
[ERROR] <https://builds.apache.org/job/maven-plugin-tools/ws/maven-plugin-tools-api/src/test/java/org/apache/maven/tools/plugin/util/PluginUtilsTest.java>:[50,8]
cannot find symbol
[ERROR] symbol  : method assertEquals(int,int)
[ERROR] location: class org.apache.maven.tools.plugin.util.PluginUtilsTest
[ERROR] <https://builds.apache.org/job/maven-plugin-tools/ws/maven-plugin-tools-api/src/test/java/org/apache/maven/tools/plugin/util/PluginUtilsTest.java>:[63,8]
cannot find symbol
[ERROR] symbol  : method assertEquals(int,int)
[ERROR] location: class org.apache.maven.tools.plugin.util.PluginUtilsTest
[ERROR] -> [Help 1]
org.apache.maven.lifecycle.LifecycleExecutionException: Failed to execute goal org.apache.maven.plugins:maven-compiler-plugin:2.5:testCompile
(default-testCompile) on project maven-plugin-tools-api: Compilation failure
	at org.apache.maven.lifecycle.internal.MojoExecutor.execute(MojoExecutor.java:213)
	at org.apache.maven.lifecycle.internal.MojoExecutor.execute(MojoExecutor.java:153)
	at org.apache.maven.lifecycle.internal.MojoExecutor.execute(MojoExecutor.java:145)
	at org.apache.maven.lifecycle.internal.LifecycleModuleBuilder.buildProject(LifecycleModuleBuilder.java:84)
	at org.apache.maven.lifecycle.internal.LifecycleModuleBuilder.buildProject(LifecycleModuleBuilder.java:59)
	at org.apache.maven.lifecycle.internal.LifecycleStarter.singleThreadedBuild(LifecycleStarter.java:183)
	at org.apache.maven.lifecycle.internal.LifecycleStarter.execute(LifecycleStarter.java:161)
	at org.apache.maven.DefaultMaven.doExecute(DefaultMaven.java:320)
	at org.apache.maven.DefaultMaven.execute(DefaultMaven.java:156)
	at org.jvnet.hudson.maven3.launcher.Maven3Launcher.main(Maven3Launcher.java:117)
	at sun.reflect.NativeMethodAccessorImpl.invoke0(Native Method)
	at sun.reflect.NativeMethodAccessorImpl.invoke(NativeMethodAccessorImpl.java:39)
	at sun.reflect.DelegatingMethodAccessorImpl.invoke(DelegatingMethodAccessorImpl.java:25)
	at java.lang.reflect.Method.invoke(Method.java:597)
	at org.codehaus.plexus.classworlds.launcher.Launcher.launchStandard(Launcher.java:329)
	at org.codehaus.plexus.classworlds.launcher.Launcher.launch(Launcher.java:239)
	at org.jvnet.hudson.maven3.agent.Maven3Main.launch(Maven3Main.java:178)
	at sun.reflect.NativeMethodAccessorImpl.invoke0(Native Method)
	at sun.reflect.NativeMethodAccessorImpl.invoke(NativeMethodAccessorImpl.java:39)
	at sun.reflect.DelegatingMethodAccessorImpl.invoke(DelegatingMethodAccessorImpl.java:25)
	at java.lang.reflect.Method.invoke(Method.java:597)
	at hudson.maven.Maven3Builder.call(Maven3Builder.java:134)
	at hudson.maven.Maven3Builder.call(Maven3Builder.java:69)
	at hudson.remoting.UserRequest.perform(UserRequest.java:118)
	at hudson.remoting.UserRequest.perform(UserRequest.java:48)
	at hudson.remoting.Request$2.run(Request.java:328)
	at hudson.remoting.InterceptingExecutorService$1.call(InterceptingExecutorService.java:72)
	at java.util.concurrent.FutureTask$Sync.innerRun(FutureTask.java:303)
	at java.util.concurrent.FutureTask.run(FutureTask.java:138)
	at java.util.concurrent.ThreadPoolExecutor$Worker.runTask(ThreadPoolExecutor.java:895)
	at java.util.concurrent.ThreadPoolExecutor$Worker.run(ThreadPoolExecutor.java:918)
	at java.lang.Thread.run(Thread.java:662)
Caused by: org.apache.maven.plugin.CompilationFailureException: Compilation failure
	at org.apache.maven.plugin.AbstractCompilerMojo.execute(AbstractCompilerMojo.java:729)
	at org.apache.maven.plugin.TestCompilerMojo.execute(TestCompilerMojo.java:161)
	at org.apache.maven.plugin.DefaultBuildPluginManager.executeMojo(DefaultBuildPluginManager.java:101)
	at org.apache.maven.lifecycle.internal.MojoExecutor.execute(MojoExecutor.java:209)
	... 31 more
[ERROR] Failed to execute goal org.apache.maven.plugins:maven-compiler-plugin:2.5:testCompile
(default-testCompile) on project maven-plugin-tools-model: Compilation failure: Compilation
failure:
[ERROR] error: error reading /home/jenkins/jenkins-slave/maven-repositories/1/junit/junit/3.8.2/junit-3.8.2.jar;
cannot read zip file
[ERROR] <https://builds.apache.org/job/maven-plugin-tools/ws/maven-plugin-tools-model/src/test/java/org/apache/maven/plugin/tools/model/PluginMetadataParserTest.java>:[29,22]
package junit.framework does not exist
[ERROR] <https://builds.apache.org/job/maven-plugin-tools/ws/maven-plugin-tools-model/src/test/java/org/apache/maven/plugin/tools/model/PluginMetadataParserTest.java>:[32,12]
cannot find symbol
[ERROR] symbol: class TestCase
[ERROR] extends TestCase
[ERROR] <https://builds.apache.org/job/maven-plugin-tools/ws/maven-plugin-tools-model/src/test/java/org/apache/maven/plugin/tools/model/PluginMetadataParserTest.java>:[41,8]
cannot find symbol
[ERROR] symbol  : method assertEquals(int,int)
[ERROR] location: class org.apache.maven.plugin.tools.model.PluginMetadataParserTest
[ERROR] <https://builds.apache.org/job/maven-plugin-tools/ws/maven-plugin-tools-model/src/test/java/org/apache/maven/plugin/tools/model/PluginMetadataParserTest.java>:[44,8]
cannot find symbol
[ERROR] symbol  : method assertTrue(boolean)
[ERROR] location: class org.apache.maven.plugin.tools.model.PluginMetadataParserTest
[ERROR] <https://builds.apache.org/job/maven-plugin-tools/ws/maven-plugin-tools-model/src/test/java/org/apache/maven/plugin/tools/model/PluginMetadataParserTest.java>:[45,8]
cannot find symbol
[ERROR] symbol  : method assertEquals(java.lang.String,java.lang.String)
[ERROR] location: class org.apache.maven.plugin.tools.model.PluginMetadataParserTest
[ERROR] <https://builds.apache.org/job/maven-plugin-tools/ws/maven-plugin-tools-model/src/test/java/org/apache/maven/plugin/tools/model/PluginMetadataParserTest.java>:[54,8]
cannot find symbol
[ERROR] symbol  : method assertEquals(int,int)
[ERROR] location: class org.apache.maven.plugin.tools.model.PluginMetadataParserTest
[ERROR] <https://builds.apache.org/job/maven-plugin-tools/ws/maven-plugin-tools-model/src/test/java/org/apache/maven/plugin/tools/model/PluginMetadataParserTest.java>:[57,8]
cannot find symbol
[ERROR] symbol  : method assertTrue(boolean)
[ERROR] location: class org.apache.maven.plugin.tools.model.PluginMetadataParserTest
[ERROR] <https://builds.apache.org/job/maven-plugin-tools/ws/maven-plugin-tools-model/src/test/java/org/apache/maven/plugin/tools/model/PluginMetadataParserTest.java>:[58,8]
cannot find symbol
[ERROR] symbol  : method assertEquals(java.lang.String,java.lang.String)
[ERROR] location: class org.apache.maven.plugin.tools.model.PluginMetadataParserTest
[ERROR] <https://builds.apache.org/job/maven-plugin-tools/ws/maven-plugin-tools-model/src/test/java/org/apache/maven/plugin/tools/model/PluginMetadataParserTest.java>:[66,12]
cannot find symbol
[ERROR] symbol  : method fail(java.lang.String)
[ERROR] location: class org.apache.maven.plugin.tools.model.PluginMetadataParserTest
[ERROR] -> [Help 1]
org.apache.maven.lifecycle.LifecycleExecutionException: Failed to execute goal org.apache.maven.plugins:maven-compiler-plugin:2.5:testCompile
(default-testCompile) on project maven-plugin-tools-model: Compilation failure
	at org.apache.maven.lifecycle.internal.MojoExecutor.execute(MojoExecutor.java:213)
	at org.apache.maven.lifecycle.internal.MojoExecutor.execute(MojoExecutor.java:153)
	at org.apache.maven.lifecycle.internal.MojoExecutor.execute(MojoExecutor.java:145)
	at org.apache.maven.lifecycle.internal.LifecycleModuleBuilder.buildProject(LifecycleModuleBuilder.java:84)
	at org.apache.maven.lifecycle.internal.LifecycleModuleBuilder.buildProject(LifecycleModuleBuilder.java:59)
	at org.apache.maven.lifecycle.internal.LifecycleStarter.singleThreadedBuild(LifecycleStarter.java:183)
	at org.apache.maven.lifecycle.internal.LifecycleStarter.execute(LifecycleStarter.java:161)
	at org.apache.maven.DefaultMaven.doExecute(DefaultMaven.java:320)
	at org.apache.maven.DefaultMaven.execute(DefaultMaven.java:156)
	at org.jvnet.hudson.maven3.launcher.Maven3Launcher.main(Maven3Launcher.java:117)
	at sun.reflect.NativeMethodAccessorImpl.invoke0(Native Method)
	at sun.reflect.NativeMethodAccessorImpl.invoke(NativeMethodAccessorImpl.java:39)
	at sun.reflect.DelegatingMethodAccessorImpl.invoke(DelegatingMethodAccessorImpl.java:25)
	at java.lang.reflect.Method.invoke(Method.java:597)
	at org.codehaus.plexus.classworlds.launcher.Launcher.launchStandard(Launcher.java:329)
	at org.codehaus.plexus.classworlds.launcher.Launcher.launch(Launcher.java:239)
	at org.jvnet.hudson.maven3.agent.Maven3Main.launch(Maven3Main.java:178)
	at sun.reflect.NativeMethodAccessorImpl.invoke0(Native Method)
	at sun.reflect.NativeMethodAccessorImpl.invoke(NativeMethodAccessorImpl.java:39)
	at sun.reflect.DelegatingMethodAccessorImpl.invoke(DelegatingMethodAccessorImpl.java:25)
	at java.lang.reflect.Method.invoke(Method.java:597)
	at hudson.maven.Maven3Builder.call(Maven3Builder.java:134)
	at hudson.maven.Maven3Builder.call(Maven3Builder.java:69)
	at hudson.remoting.UserRequest.perform(UserRequest.java:118)
	at hudson.remoting.UserRequest.perform(UserRequest.java:48)
	at hudson.remoting.Request$2.run(Request.java:328)
	at hudson.remoting.InterceptingExecutorService$1.call(InterceptingExecutorService.java:72)
	at java.util.concurrent.FutureTask$Sync.innerRun(FutureTask.java:303)
	at java.util.concurrent.FutureTask.run(FutureTask.java:138)
	at java.util.concurrent.ThreadPoolExecutor$Worker.runTask(ThreadPoolExecutor.java:895)
	at java.util.concurrent.ThreadPoolExecutor$Worker.run(ThreadPoolExecutor.java:918)
	at java.lang.Thread.run(Thread.java:662)
Caused by: org.apache.maven.plugin.CompilationFailureException: Compilation failure
	at org.apache.maven.plugin.AbstractCompilerMojo.execute(AbstractCompilerMojo.java:729)
	at org.apache.maven.plugin.TestCompilerMojo.execute(TestCompilerMojo.java:161)
	at org.apache.maven.plugin.DefaultBuildPluginManager.executeMojo(DefaultBuildPluginManager.java:101)
	at org.apache.maven.lifecycle.internal.MojoExecutor.execute(MojoExecutor.java:209)
	... 31 more
[ERROR] 
[ERROR] Re-run Maven using the -X switch to enable full debug logging.
[ERROR] 
[ERROR] For more information about the errors and possible solutions, please read the following
articles:
[ERROR] [Help 1] http://cwiki.apache.org/confluence/display/MAVEN/MojoFailureException
[ERROR] 
[ERROR] After correcting the problems, you can resume the build with the command
[ERROR]   mvn <goals> -rf :maven-script-ant
[JENKINS] Archiving <https://builds.apache.org/job/maven-plugin-tools/ws/maven-plugin-tools-generators/pom.xml>
to org.apache.maven.plugin-tools/maven-plugin-tools-generators/3.3-SNAPSHOT/maven-plugin-tools-generators-3.3-SNAPSHOT.pom
[JENKINS] Archiving <https://builds.apache.org/job/maven-plugin-tools/ws/maven-plugin-annotations/pom.xml>
to org.apache.maven.plugin-tools/maven-plugin-annotations/3.3-SNAPSHOT/maven-plugin-annotations-3.3-SNAPSHOT.pom
[JENKINS] Archiving <https://builds.apache.org/job/maven-plugin-tools/ws/maven-plugin-annotations/target/maven-plugin-annotations-3.3-SNAPSHOT.jar>
to org.apache.maven.plugin-tools/maven-plugin-annotations/3.3-SNAPSHOT/maven-plugin-annotations-3.3-SNAPSHOT.jar
[JENKINS] Archiving <https://builds.apache.org/job/maven-plugin-tools/ws/maven-script/pom.xml>
to org.apache.maven.plugin-tools/maven-script/3.3-SNAPSHOT/maven-script-3.3-SNAPSHOT.pom
[JENKINS] Archiving <https://builds.apache.org/job/maven-plugin-tools/ws/maven-script/target/maven-script-3.3-SNAPSHOT-site.xml>
to org.apache.maven.plugin-tools/maven-script/3.3-SNAPSHOT/maven-script-3.3-SNAPSHOT-site.xml
[JENKINS] Archiving <https://builds.apache.org/job/maven-plugin-tools/ws/maven-plugin-plugin/pom.xml>
to org.apache.maven.plugins/maven-plugin-plugin/3.3-SNAPSHOT/maven-plugin-plugin-3.3-SNAPSHOT.pom
[JENKINS] Archiving <https://builds.apache.org/job/maven-plugin-tools/ws/pom.xml> to
org.apache.maven.plugin-tools/maven-plugin-tools/3.3-SNAPSHOT/maven-plugin-tools-3.3-SNAPSHOT.pom
[JENKINS] Archiving <https://builds.apache.org/job/maven-plugin-tools/ws/target/maven-plugin-tools-3.3-SNAPSHOT-site.xml>
to org.apache.maven.plugin-tools/maven-plugin-tools/3.3-SNAPSHOT/maven-plugin-tools-3.3-SNAPSHOT-site.xml
[JENKINS] Archiving <https://builds.apache.org/job/maven-plugin-tools/ws/maven-plugin-tools-model/pom.xml>
to org.apache.maven.plugin-tools/maven-plugin-tools-model/3.3-SNAPSHOT/maven-plugin-tools-model-3.3-SNAPSHOT.pom
[JENKINS] Archiving <https://builds.apache.org/job/maven-plugin-tools/ws/maven-plugin-tools-ant/pom.xml>
to org.apache.maven.plugin-tools/maven-plugin-tools-ant/3.3-SNAPSHOT/maven-plugin-tools-ant-3.3-SNAPSHOT.pom
[JENKINS] Archiving <https://builds.apache.org/job/maven-plugin-tools/ws/maven-plugin-tools-annotations/pom.xml>
to org.apache.maven.plugin-tools/maven-plugin-tools-annotations/3.3-SNAPSHOT/maven-plugin-tools-annotations-3.3-SNAPSHOT.pom
[JENKINS] Archiving <https://builds.apache.org/job/maven-plugin-tools/ws/maven-script/maven-script-ant/pom.xml>
to org.apache.maven.plugin-tools/maven-script-ant/3.3-SNAPSHOT/maven-script-ant-3.3-SNAPSHOT.pom
[JENKINS] Archiving <https://builds.apache.org/job/maven-plugin-tools/ws/maven-plugin-tools-beanshell/pom.xml>
to org.apache.maven.plugin-tools/maven-plugin-tools-beanshell/3.3-SNAPSHOT/maven-plugin-tools-beanshell-3.3-SNAPSHOT.pom
[JENKINS] Archiving <https://builds.apache.org/job/maven-plugin-tools/ws/maven-plugin-tools-java/pom.xml>
to org.apache.maven.plugin-tools/maven-plugin-tools-java/3.3-SNAPSHOT/maven-plugin-tools-java-3.3-SNAPSHOT.pom
[JENKINS] Archiving <https://builds.apache.org/job/maven-plugin-tools/ws/maven-script/maven-script-beanshell/pom.xml>
to org.apache.maven.plugin-tools/maven-script-beanshell/3.3-SNAPSHOT/maven-script-beanshell-3.3-SNAPSHOT.pom
[JENKINS] Archiving <https://builds.apache.org/job/maven-plugin-tools/ws/maven-script/maven-script-beanshell/target/maven-script-beanshell-3.3-SNAPSHOT.jar>
to org.apache.maven.plugin-tools/maven-script-beanshell/3.3-SNAPSHOT/maven-script-beanshell-3.3-SNAPSHOT.jar
[JENKINS] Archiving <https://builds.apache.org/job/maven-plugin-tools/ws/maven-plugin-tools-javadoc/pom.xml>
to org.apache.maven.plugin-tools/maven-plugin-tools-javadoc/3.3-SNAPSHOT/maven-plugin-tools-javadoc-3.3-SNAPSHOT.pom
channel stopped

Mime
View raw message