maven-notifications mailing list archives

Site index · List index
Message view « Date » · « Thread »
Top « Date » · « Thread »
From Apache Jenkins Server <jenk...@builds.apache.org>
Subject Build failed in Jenkins: maven-plugins-ITs-m3.0.4 #489
Date Fri, 07 Mar 2014 18:29:39 GMT
See <https://builds.apache.org/job/maven-plugins-ITs-m3.0.4/489/changes>

Changes:

[dennisl] [MCHECKSTYLE-222] Resource-only project is not checked

[dennisl] Refactoring: move common parameters to super class.

------------------------------------------
[...truncated 10725 lines...]
[INFO] Mojo extractor for language: bsh found 0 mojo descriptors.
[INFO] Applying mojo extractor for language: java-annotations
[INFO] Mojo extractor for language: java-annotations found 0 mojo descriptors.
[INFO] 
[INFO] --- maven-plugin-plugin:3.2:descriptor (default-descriptor) @ maven-scm-publish-plugin
---
[INFO] Using 'UTF-8' encoding to read mojo metadata.
[INFO] Applying mojo extractor for language: java
[INFO] Mojo extractor for language: java found 1 mojo descriptors.
[INFO] Applying mojo extractor for language: bsh
[INFO] Mojo extractor for language: bsh found 0 mojo descriptors.
[INFO] Applying mojo extractor for language: java-annotations
[INFO] Mojo extractor for language: java-annotations found 0 mojo descriptors.
[INFO] 
[INFO] --- maven-remote-resources-plugin:1.4:process (default) @ maven-scm-publish-plugin
---
[INFO] 
[INFO] --- maven-resources-plugin:2.6:resources (default-resources) @ maven-scm-publish-plugin
---
[INFO] Using 'UTF-8' encoding to copy filtered resources.
[INFO] Copying 2 resources
[INFO] Copying 3 resources
[INFO] 
[INFO] --- maven-compiler-plugin:3.0:compile (default-compile) @ maven-scm-publish-plugin
---
[INFO] Changes detected - recompiling the module!
[INFO] Compiling 4 source files to <https://builds.apache.org/job/maven-plugins-ITs-m3.0.4/ws/maven-scm-publish-plugin/target/classes>
[INFO] 
[INFO] --- maven-plugin-plugin:3.2:descriptor (mojo-descriptor) @ maven-scm-publish-plugin
---
[INFO] Using 'UTF-8' encoding to read mojo metadata.
[INFO] Applying mojo extractor for language: java
[INFO] Mojo extractor for language: java found 1 mojo descriptors.
[INFO] Applying mojo extractor for language: bsh
[INFO] Mojo extractor for language: bsh found 0 mojo descriptors.
[INFO] Applying mojo extractor for language: java-annotations
[INFO] Mojo extractor for language: java-annotations found 2 mojo descriptors.
[INFO] 
[INFO] --- maven-resources-plugin:2.6:testResources (default-testResources) @ maven-scm-publish-plugin
---
[INFO] Using 'UTF-8' encoding to copy filtered resources.
[INFO] skip non existing resourceDirectory <https://builds.apache.org/job/maven-plugins-ITs-m3.0.4/ws/maven-scm-publish-plugin/src/test/resources>
[INFO] Copying 3 resources
[INFO] 
[INFO] --- maven-compiler-plugin:3.0:testCompile (default-testCompile) @ maven-scm-publish-plugin
---
[INFO] No sources to compile
[INFO] 
[INFO] --- maven-surefire-plugin:2.12.4:test (default-test) @ maven-scm-publish-plugin ---
[INFO] 
[INFO] --- maven-jar-plugin:2.4:jar (default-jar) @ maven-scm-publish-plugin ---
[INFO] Building jar: <https://builds.apache.org/job/maven-plugins-ITs-m3.0.4/ws/maven-scm-publish-plugin/target/maven-scm-publish-plugin-1.1-SNAPSHOT.jar>
[INFO] 
[INFO] --- maven-plugin-plugin:3.2:addPluginArtifactMetadata (default-addPluginArtifactMetadata)
@ maven-scm-publish-plugin ---
[INFO] 
[INFO] --- maven-invoker-plugin:1.7:install (integration-test) @ maven-scm-publish-plugin
---
[INFO] Installing <https://builds.apache.org/job/maven-plugins-ITs-m3.0.4/ws/maven-scm-publish-plugin/pom.xml>
to <https://builds.apache.org/job/maven-plugins-ITs-m3.0.4/ws/maven-scm-publish-plugin/target/local-repo/org/apache/maven/plugins/maven-scm-publish-plugin/1.1-SNAPSHOT/maven-scm-publish-plugin-1.1-SNAPSHOT.pom>
[INFO] Installing <https://builds.apache.org/job/maven-plugins-ITs-m3.0.4/ws/maven-scm-publish-plugin/target/maven-scm-publish-plugin-1.1-SNAPSHOT.jar>
to <https://builds.apache.org/job/maven-plugins-ITs-m3.0.4/ws/maven-scm-publish-plugin/target/local-repo/org/apache/maven/plugins/maven-scm-publish-plugin/1.1-SNAPSHOT/maven-scm-publish-plugin-1.1-SNAPSHOT.jar>
[INFO] 
[INFO] --- maven-invoker-plugin:1.7:integration-test (integration-test) @ maven-scm-publish-plugin
---
[INFO] Building: 006-site-multi-module/pom.xml
[INFO] run script setup.bsh
[INFO] ..SUCCESS (33.8 s)
[INFO] Building: 003-lifecycle/pom.xml
[INFO] run script setup.bsh
[INFO] ..SUCCESS (13.9 s)
[INFO] Building: 005-site-lifecycle/pom.xml
[INFO] run script setup.bsh
[INFO] ..SUCCESS (27.4 s)
[INFO] Building: 004-publish-scm/pom.xml
[INFO] run script setup.bsh
[INFO] ..SUCCESS (21.0 s)
[INFO] 
[INFO] --- maven-invoker-plugin:1.7:verify (integration-test) @ maven-scm-publish-plugin ---
[INFO] -------------------------------------------------
[INFO] Build Summary:
[INFO]   Passed: 4, Failed: 0, Errors: 0, Skipped: 0
[INFO] -------------------------------------------------
[INFO] 
[INFO] --- maven-install-plugin:2.3.1:install (default-install) @ maven-scm-publish-plugin
---
[INFO] Installing <https://builds.apache.org/job/maven-plugins-ITs-m3.0.4/ws/maven-scm-publish-plugin/target/maven-scm-publish-plugin-1.1-SNAPSHOT.jar>
to /home/jenkins/.m2/repository/org/apache/maven/plugins/maven-scm-publish-plugin/1.1-SNAPSHOT/maven-scm-publish-plugin-1.1-SNAPSHOT.jar
[INFO] Installing <https://builds.apache.org/job/maven-plugins-ITs-m3.0.4/ws/maven-scm-publish-plugin/pom.xml>
to /home/jenkins/.m2/repository/org/apache/maven/plugins/maven-scm-publish-plugin/1.1-SNAPSHOT/maven-scm-publish-plugin-1.1-SNAPSHOT.pom
[INFO]                                                                         
[INFO] ------------------------------------------------------------------------
[INFO] Building Apache Maven GPG Plugin 1.6-SNAPSHOT
[INFO] ------------------------------------------------------------------------
[INFO] 
[INFO] --- maven-clean-plugin:2.5:clean (default-clean) @ maven-gpg-plugin ---
[INFO] Deleting <https://builds.apache.org/job/maven-plugins-ITs-m3.0.4/ws/maven-gpg-plugin/target>
[INFO] 
[INFO] --- maven-enforcer-plugin:1.0.1:enforce (ensure-no-container-api) @ maven-gpg-plugin
---
[INFO] 
[INFO] --- maven-plugin-plugin:3.2:helpmojo (generated-helpmojo) @ maven-gpg-plugin ---
[INFO] Using 'UTF-8' encoding to read mojo metadata.
[INFO] Applying mojo extractor for language: java
[INFO] Mojo extractor for language: java found 0 mojo descriptors.
[INFO] Applying mojo extractor for language: bsh
[INFO] Mojo extractor for language: bsh found 0 mojo descriptors.
[INFO] Applying mojo extractor for language: java-annotations
[INFO] Mojo extractor for language: java-annotations found 0 mojo descriptors.
[INFO] 
[INFO] --- maven-plugin-plugin:3.2:descriptor (default-descriptor) @ maven-gpg-plugin ---
[INFO] Using 'UTF-8' encoding to read mojo metadata.
[INFO] Applying mojo extractor for language: java
[INFO] Mojo extractor for language: java found 0 mojo descriptors.
[INFO] Applying mojo extractor for language: bsh
[INFO] Mojo extractor for language: bsh found 0 mojo descriptors.
[INFO] Applying mojo extractor for language: java-annotations
[INFO] Mojo extractor for language: java-annotations found 0 mojo descriptors.
[INFO] 
[INFO] --- maven-remote-resources-plugin:1.4:process (default) @ maven-gpg-plugin ---
[INFO] 
[INFO] --- maven-resources-plugin:2.6:resources (default-resources) @ maven-gpg-plugin ---
[INFO] Using 'UTF-8' encoding to copy filtered resources.
[INFO] skip non existing resourceDirectory <https://builds.apache.org/job/maven-plugins-ITs-m3.0.4/ws/maven-gpg-plugin/src/main/resources>
[INFO] Copying 3 resources
[INFO] 
[INFO] --- maven-compiler-plugin:3.0:compile (default-compile) @ maven-gpg-plugin ---
[INFO] Changes detected - recompiling the module!
[INFO] Compiling 9 source files to <https://builds.apache.org/job/maven-plugins-ITs-m3.0.4/ws/maven-gpg-plugin/target/classes>
[INFO] 
[INFO] --- maven-plugin-plugin:3.2:descriptor (generate-descriptor) @ maven-gpg-plugin ---
[INFO] Using 'UTF-8' encoding to read mojo metadata.
[INFO] Applying mojo extractor for language: java
[INFO] Mojo extractor for language: java found 0 mojo descriptors.
[INFO] Applying mojo extractor for language: bsh
[INFO] Mojo extractor for language: bsh found 0 mojo descriptors.
[INFO] Applying mojo extractor for language: java-annotations
[INFO] Mojo extractor for language: java-annotations found 3 mojo descriptors.
[INFO] 
[INFO] --- maven-resources-plugin:2.6:testResources (default-testResources) @ maven-gpg-plugin
---
[INFO] Using 'UTF-8' encoding to copy filtered resources.
[INFO] Copying 8 resources
[INFO] Copying 3 resources
[INFO] 
[INFO] --- maven-compiler-plugin:3.0:testCompile (default-testCompile) @ maven-gpg-plugin
---
[INFO] No sources to compile
[INFO] 
[INFO] --- maven-surefire-plugin:2.12.4:test (default-test) @ maven-gpg-plugin ---
[INFO] 
[INFO] --- maven-jar-plugin:2.4:jar (default-jar) @ maven-gpg-plugin ---
[INFO] Building jar: <https://builds.apache.org/job/maven-plugins-ITs-m3.0.4/ws/maven-gpg-plugin/target/maven-gpg-plugin-1.6-SNAPSHOT.jar>
[INFO] 
[INFO] --- maven-plugin-plugin:3.2:addPluginArtifactMetadata (default-addPluginArtifactMetadata)
@ maven-gpg-plugin ---
[INFO] 
[INFO] --- maven-invoker-plugin:1.7:install (integration-test) @ maven-gpg-plugin ---
[INFO] Installing <https://builds.apache.org/job/maven-plugins-ITs-m3.0.4/ws/maven-gpg-plugin/pom.xml>
to <https://builds.apache.org/job/maven-plugins-ITs-m3.0.4/ws/maven-gpg-plugin/target/local-repo/org/apache/maven/plugins/maven-gpg-plugin/1.6-SNAPSHOT/maven-gpg-plugin-1.6-SNAPSHOT.pom>
[INFO] Installing <https://builds.apache.org/job/maven-plugins-ITs-m3.0.4/ws/maven-gpg-plugin/target/maven-gpg-plugin-1.6-SNAPSHOT.jar>
to <https://builds.apache.org/job/maven-plugins-ITs-m3.0.4/ws/maven-gpg-plugin/target/local-repo/org/apache/maven/plugins/maven-gpg-plugin/1.6-SNAPSHOT/maven-gpg-plugin-1.6-SNAPSHOT.jar>
[INFO] 
[INFO] --- maven-invoker-plugin:1.7:integration-test (integration-test) @ maven-gpg-plugin
---
[INFO] Building: sign-release/pom.xml
[INFO] run script verify.bsh
[INFO] ..SUCCESS (4.2 s)
[INFO] Building: alternative-secret-keyring/pom.xml
[INFO] run script verify.bsh
[INFO] ..SUCCESS (2.5 s)
[INFO] Building: no-main-artifact/pom.xml
[INFO] run script verify.bsh
[INFO] ..SUCCESS (2.7 s)
[INFO] 
[INFO] --- maven-invoker-plugin:1.7:verify (integration-test) @ maven-gpg-plugin ---
[INFO] -------------------------------------------------
[INFO] Build Summary:
[INFO]   Passed: 3, Failed: 0, Errors: 0, Skipped: 0
[INFO] -------------------------------------------------
[INFO] 
[INFO] --- maven-install-plugin:2.3.1:install (default-install) @ maven-gpg-plugin ---
[INFO] Installing <https://builds.apache.org/job/maven-plugins-ITs-m3.0.4/ws/maven-gpg-plugin/target/maven-gpg-plugin-1.6-SNAPSHOT.jar>
to /home/jenkins/.m2/repository/org/apache/maven/plugins/maven-gpg-plugin/1.6-SNAPSHOT/maven-gpg-plugin-1.6-SNAPSHOT.jar
[INFO] Installing <https://builds.apache.org/job/maven-plugins-ITs-m3.0.4/ws/maven-gpg-plugin/pom.xml>
to /home/jenkins/.m2/repository/org/apache/maven/plugins/maven-gpg-plugin/1.6-SNAPSHOT/maven-gpg-plugin-1.6-SNAPSHOT.pom
[INFO]                                                                         
[INFO] ------------------------------------------------------------------------
[INFO] Building Apache Maven Plugins Aggregator 1-SNAPSHOT
[INFO] ------------------------------------------------------------------------
[INFO] 
[INFO] --- maven-clean-plugin:2.4.1:clean (default-clean) @ maven-plugins-aggregator ---
[INFO] Deleting <https://builds.apache.org/job/maven-plugins-ITs-m3.0.4/ws/target>
[INFO] 
[INFO] --- maven-remote-resources-plugin:1.1:process (default) @ maven-plugins-aggregator
---
[INFO] Setting property: classpath.resource.loader.class => 'org.codehaus.plexus.velocity.ContextClassLoaderResourceLoader'.
[INFO] Setting property: velocimacro.messages.on => 'false'.
[INFO] Setting property: resource.loader => 'classpath'.
[INFO] Setting property: resource.manager.logwhenfound => 'false'.
[INFO] 
[INFO] --- maven-install-plugin:2.3.1:install (default-install) @ maven-plugins-aggregator
---
[INFO] Installing <https://builds.apache.org/job/maven-plugins-ITs-m3.0.4/ws/pom.xml>
to /home/jenkins/.m2/repository/org/apache/maven/plugins/maven-plugins-aggregator/1-SNAPSHOT/maven-plugins-aggregator-1-SNAPSHOT.pom
[INFO] ------------------------------------------------------------------------
[INFO] Reactor Summary:
[INFO] 
[INFO] Apache Maven Plugins .............................. SUCCESS [8.512s]
[INFO] Apache Maven ACR Plugin ........................... SUCCESS [51.729s]
[INFO] Apache Maven Ant Plugin ........................... SUCCESS [2:37.414s]
[INFO] Apache Maven AntRun Plugin ........................ SUCCESS [1:07.961s]
[INFO] Apache Maven Eclipse Plugin ....................... SUCCESS [8:33.954s]
[INFO] Apache Maven Assembly Plugin ...................... SUCCESS [14:16.343s]
[INFO] Apache Maven Changelog Plugin ..................... SUCCESS [58.504s]
[INFO] Apache Maven Changes Plugin ....................... SUCCESS [1:25.592s]
[INFO] Apache Maven Checkstyle Plugin .................... SUCCESS [2:52.989s]
[INFO] Apache Maven Clean Plugin ......................... SUCCESS [21.166s]
[INFO] Apache Maven Compiler Plugin ...................... SUCCESS [1:32.416s]
[INFO] Apache Maven Dependency Plugin .................... SUCCESS [3:11.739s]
[INFO] Apache Maven Deploy Plugin ........................ SUCCESS [1:26.039s]
[INFO] Apache Maven DOAP Plugin .......................... SUCCESS [7.787s]
[INFO] Apache Maven Documentation Checker Plugin ......... SUCCESS [10.663s]
[INFO] Apache Maven EAR Plugin ........................... SUCCESS [4:41.022s]
[INFO] Apache Maven EJB Plugin ........................... SUCCESS [33.545s]
[INFO] Apache Maven Help Plugin .......................... SUCCESS [54.021s]
[INFO] Apache Maven Install Plugin ....................... SUCCESS [1:00.260s]
[INFO] Apache Maven JAR Plugin ........................... SUCCESS [1:20.979s]
[INFO] Apache Maven Jarsigner Plugin ..................... SUCCESS [38.965s]
[INFO] Apache Maven Javadoc Plugin ....................... SUCCESS [3:26.787s]
[INFO] Apache Maven Linkcheck Plugin ..................... SUCCESS [2.589s]
[INFO] Apache Maven Patch Plugin ......................... SUCCESS [18.723s]
[INFO] Apache Maven PDF Plugin ........................... SUCCESS [1:40.529s]
[INFO] Apache Maven PMD Plugin ........................... SUCCESS [1:54.895s]
[INFO] Apache Maven RAR Plugin ........................... SUCCESS [9.803s]
[INFO] Apache Maven Reactor Plugin ....................... SUCCESS [3.335s]
[INFO] Apache Maven Repository Plugin .................... SUCCESS [44.610s]
[INFO] Apache Maven Resources Plugin ..................... SUCCESS [1:00.024s]
[INFO] Apache Maven Site Plugin 3 ........................ SUCCESS [7:31.464s]
[INFO] Apache Maven Source Plugin ........................ SUCCESS [1:00.932s]
[INFO] Apache Maven Stage Plugin ......................... SUCCESS [2.795s]
[INFO] Apache Maven Toolchains Plugin .................... SUCCESS [2.089s]
[INFO] Apache Maven Verifier Plugin ...................... SUCCESS [23.710s]
[INFO] Apache Maven WAR Plugin ........................... SUCCESS [1:26.357s]
[INFO] Apache Maven Invoker Plugin ....................... SUCCESS [5:00.428s]
[INFO] Apache Maven Project Info Reports Plugin .......... FAILURE [19.271s]
[INFO] Apache Maven Remote Resources Plugin .............. SUCCESS [58.866s]
[INFO] Apache Maven Shade Plugin ......................... FAILURE [26.347s]
[INFO] Apache Maven SCM Publish Plugin ................... SUCCESS [1:46.466s]
[INFO] Apache Maven GPG Plugin ........................... SUCCESS [11.044s]
[INFO] Apache Maven Plugins Aggregator ................... SUCCESS [0.739s]
[INFO] ------------------------------------------------------------------------
[INFO] BUILD FAILURE
[INFO] ------------------------------------------------------------------------
[INFO] Total time: 1:17:26.363s
[INFO] Finished at: Fri Mar 07 18:29:30 UTC 2014
[INFO] Final Memory: 100M/426M
[INFO] ------------------------------------------------------------------------
[WARNING] The requested profile "apache.snapshots" could not be activated because it does
not exist.
[ERROR] Failed to execute goal org.apache.maven.plugins:maven-surefire-plugin:2.12.4:test
(default-test) on project maven-project-info-reports-plugin: There are test failures.
[ERROR] 
[ERROR] Please refer to <https://builds.apache.org/job/maven-plugins-ITs-m3.0.4/ws/maven-project-info-reports-plugin/target/surefire-reports>
for the individual test results.
[ERROR] -> [Help 1]
[ERROR] Failed to execute goal org.apache.maven.plugins:maven-invoker-plugin:1.8:install (integration-test)
on project maven-shade-plugin: Failed to install project dependencies: MavenProject: org.apache.maven.plugins:maven-shade-plugin:2.3-SNAPSHOT
@ <https://builds.apache.org/job/maven-plugins-ITs-m3.0.4/ws/maven-shade-plugin/pom.xml>:
Failed to install project artifacts: MavenProject: org.apache.maven.plugins:maven-project-info-reports-plugin:2.8-SNAPSHOT
@ <https://builds.apache.org/job/maven-plugins-ITs-m3.0.4/ws/maven-project-info-reports-plugin/pom.xml>:
Failed to install artifact: org.apache.maven.plugins:maven-project-info-reports-plugin:maven-plugin:2.8-SNAPSHOT:
Artifact is not fully assembled: <https://builds.apache.org/job/maven-plugins-ITs-m3.0.4/ws/maven-project-info-reports-plugin/target/classes>
-> [Help 2]
[ERROR] 
[ERROR] To see the full stack trace of the errors, re-run Maven with the -e switch.
[ERROR] Re-run Maven using the -X switch to enable full debug logging.
[ERROR] 
[ERROR] For more information about the errors and possible solutions, please read the following
articles:
[ERROR] [Help 1] http://cwiki.apache.org/confluence/display/MAVEN/MojoFailureException
[ERROR] [Help 2] http://cwiki.apache.org/confluence/display/MAVEN/MojoExecutionException
[ERROR] 
[ERROR] After correcting the problems, you can resume the build with the command
[ERROR]   mvn <goals> -rf :maven-project-info-reports-plugin
Build step 'Invoke top-level Maven targets' marked build as failure
Recording test results

Mime
View raw message