maven-notifications mailing list archives

Site index · List index
Message view « Date » · « Thread »
Top « Date » · « Thread »
From Apache Jenkins Server <jenk...@builds.apache.org>
Subject Build failed in Jenkins: maven-plugins-ITs-m3.0.4 #501
Date Tue, 11 Mar 2014 22:16:58 GMT
See <https://builds.apache.org/job/maven-plugins-ITs-m3.0.4/501/changes>

Changes:

[dennisl] [maven-release-plugin] prepare for next development iteration

[dennisl] [maven-release-plugin] prepare release maven-pmd-plugin-3.1

[dennisl] [MPMD-181] Add flag to capture Benchmark information
- Add missing @since tags for parameters

[dennisl] Fix errors reported by Checkstyle.

------------------------------------------
[...truncated 29315 lines...]
[INFO] --- maven-enforcer-plugin:1.0.1:enforce (ensure-no-container-api) @ maven-scm-publish-plugin
---
[INFO] 
[INFO] --- maven-plugin-plugin:3.2:helpmojo (generated-helpmojo) @ maven-scm-publish-plugin
---
[INFO] Using 'UTF-8' encoding to read mojo metadata.
[INFO] Applying mojo extractor for language: java
[INFO] Mojo extractor for language: java found 1 mojo descriptors.
[INFO] Applying mojo extractor for language: bsh
[INFO] Mojo extractor for language: bsh found 0 mojo descriptors.
[INFO] Applying mojo extractor for language: java-annotations
[INFO] Mojo extractor for language: java-annotations found 0 mojo descriptors.
[INFO] 
[INFO] --- maven-plugin-plugin:3.2:descriptor (default-descriptor) @ maven-scm-publish-plugin
---
[INFO] Using 'UTF-8' encoding to read mojo metadata.
[INFO] Applying mojo extractor for language: java
[INFO] Mojo extractor for language: java found 1 mojo descriptors.
[INFO] Applying mojo extractor for language: bsh
[INFO] Mojo extractor for language: bsh found 0 mojo descriptors.
[INFO] Applying mojo extractor for language: java-annotations
[INFO] Mojo extractor for language: java-annotations found 0 mojo descriptors.
[INFO] 
[INFO] --- maven-remote-resources-plugin:1.4:process (default) @ maven-scm-publish-plugin
---
[INFO] 
[INFO] --- maven-resources-plugin:2.6:resources (default-resources) @ maven-scm-publish-plugin
---
[INFO] Using 'UTF-8' encoding to copy filtered resources.
[INFO] Copying 2 resources
[INFO] Copying 3 resources
[INFO] 
[INFO] --- maven-compiler-plugin:3.0:compile (default-compile) @ maven-scm-publish-plugin
---
[INFO] Changes detected - recompiling the module!
[INFO] Compiling 4 source files to <https://builds.apache.org/job/maven-plugins-ITs-m3.0.4/ws/maven-scm-publish-plugin/target/classes>
[INFO] 
[INFO] --- maven-plugin-plugin:3.2:descriptor (mojo-descriptor) @ maven-scm-publish-plugin
---
[INFO] Using 'UTF-8' encoding to read mojo metadata.
[INFO] Applying mojo extractor for language: java
[INFO] Mojo extractor for language: java found 1 mojo descriptors.
[INFO] Applying mojo extractor for language: bsh
[INFO] Mojo extractor for language: bsh found 0 mojo descriptors.
[INFO] Applying mojo extractor for language: java-annotations
[INFO] Mojo extractor for language: java-annotations found 2 mojo descriptors.
[INFO] 
[INFO] --- maven-resources-plugin:2.6:testResources (default-testResources) @ maven-scm-publish-plugin
---
[INFO] Using 'UTF-8' encoding to copy filtered resources.
[INFO] skip non existing resourceDirectory <https://builds.apache.org/job/maven-plugins-ITs-m3.0.4/ws/maven-scm-publish-plugin/src/test/resources>
[INFO] Copying 3 resources
[INFO] 
[INFO] --- maven-compiler-plugin:3.0:testCompile (default-testCompile) @ maven-scm-publish-plugin
---
[INFO] No sources to compile
[INFO] 
[INFO] --- maven-surefire-plugin:2.12.4:test (default-test) @ maven-scm-publish-plugin ---
[INFO] 
[INFO] --- maven-jar-plugin:2.4:jar (default-jar) @ maven-scm-publish-plugin ---
[INFO] Building jar: <https://builds.apache.org/job/maven-plugins-ITs-m3.0.4/ws/maven-scm-publish-plugin/target/maven-scm-publish-plugin-1.1-SNAPSHOT.jar>
[INFO] 
[INFO] --- maven-plugin-plugin:3.2:addPluginArtifactMetadata (default-addPluginArtifactMetadata)
@ maven-scm-publish-plugin ---
[INFO] 
[INFO] --- maven-invoker-plugin:1.7:install (integration-test) @ maven-scm-publish-plugin
---
[INFO] Installing <https://builds.apache.org/job/maven-plugins-ITs-m3.0.4/ws/maven-scm-publish-plugin/pom.xml>
to <https://builds.apache.org/job/maven-plugins-ITs-m3.0.4/ws/maven-scm-publish-plugin/target/local-repo/org/apache/maven/plugins/maven-scm-publish-plugin/1.1-SNAPSHOT/maven-scm-publish-plugin-1.1-SNAPSHOT.pom>
[INFO] Installing <https://builds.apache.org/job/maven-plugins-ITs-m3.0.4/ws/maven-scm-publish-plugin/target/maven-scm-publish-plugin-1.1-SNAPSHOT.jar>
to <https://builds.apache.org/job/maven-plugins-ITs-m3.0.4/ws/maven-scm-publish-plugin/target/local-repo/org/apache/maven/plugins/maven-scm-publish-plugin/1.1-SNAPSHOT/maven-scm-publish-plugin-1.1-SNAPSHOT.jar>
[INFO] 
[INFO] --- maven-invoker-plugin:1.7:integration-test (integration-test) @ maven-scm-publish-plugin
---
[INFO] Building: 006-site-multi-module/pom.xml
[INFO] run script setup.bsh
[INFO] ..SUCCESS (23.1 s)
[INFO] Building: 004-publish-scm/pom.xml
[INFO] run script setup.bsh
[INFO] ..SUCCESS (17.8 s)
[INFO] Building: 003-lifecycle/pom.xml
[INFO] run script setup.bsh
[INFO] ..SUCCESS (8.8 s)
[INFO] Building: 005-site-lifecycle/pom.xml
[INFO] run script setup.bsh
[INFO] ..SUCCESS (17.2 s)
[INFO] 
[INFO] --- maven-invoker-plugin:1.7:verify (integration-test) @ maven-scm-publish-plugin ---
[INFO] -------------------------------------------------
[INFO] Build Summary:
[INFO]   Passed: 4, Failed: 0, Errors: 0, Skipped: 0
[INFO] -------------------------------------------------
[INFO] 
[INFO] --- maven-install-plugin:2.3.1:install (default-install) @ maven-scm-publish-plugin
---
[INFO] Installing <https://builds.apache.org/job/maven-plugins-ITs-m3.0.4/ws/maven-scm-publish-plugin/target/maven-scm-publish-plugin-1.1-SNAPSHOT.jar>
to /home/jenkins/.m2/repository/org/apache/maven/plugins/maven-scm-publish-plugin/1.1-SNAPSHOT/maven-scm-publish-plugin-1.1-SNAPSHOT.jar
[INFO] Installing <https://builds.apache.org/job/maven-plugins-ITs-m3.0.4/ws/maven-scm-publish-plugin/pom.xml>
to /home/jenkins/.m2/repository/org/apache/maven/plugins/maven-scm-publish-plugin/1.1-SNAPSHOT/maven-scm-publish-plugin-1.1-SNAPSHOT.pom
[INFO]                                                                         
[INFO] ------------------------------------------------------------------------
[INFO] Building Apache Maven GPG Plugin 1.6-SNAPSHOT
[INFO] ------------------------------------------------------------------------
[INFO] 
[INFO] --- maven-clean-plugin:2.5:clean (default-clean) @ maven-gpg-plugin ---
[INFO] 
[INFO] --- maven-enforcer-plugin:1.0.1:enforce (ensure-no-container-api) @ maven-gpg-plugin
---
[INFO] 
[INFO] --- maven-plugin-plugin:3.2:helpmojo (generated-helpmojo) @ maven-gpg-plugin ---
[INFO] Using 'UTF-8' encoding to read mojo metadata.
[INFO] Applying mojo extractor for language: java
[INFO] Mojo extractor for language: java found 0 mojo descriptors.
[INFO] Applying mojo extractor for language: bsh
[INFO] Mojo extractor for language: bsh found 0 mojo descriptors.
[INFO] Applying mojo extractor for language: java-annotations
[INFO] Mojo extractor for language: java-annotations found 0 mojo descriptors.
[INFO] 
[INFO] --- maven-plugin-plugin:3.2:descriptor (default-descriptor) @ maven-gpg-plugin ---
[INFO] Using 'UTF-8' encoding to read mojo metadata.
[INFO] Applying mojo extractor for language: java
[INFO] Mojo extractor for language: java found 0 mojo descriptors.
[INFO] Applying mojo extractor for language: bsh
[INFO] Mojo extractor for language: bsh found 0 mojo descriptors.
[INFO] Applying mojo extractor for language: java-annotations
[INFO] Mojo extractor for language: java-annotations found 0 mojo descriptors.
[INFO] 
[INFO] --- maven-remote-resources-plugin:1.4:process (default) @ maven-gpg-plugin ---
[INFO] 
[INFO] --- maven-resources-plugin:2.6:resources (default-resources) @ maven-gpg-plugin ---
[INFO] Using 'UTF-8' encoding to copy filtered resources.
[INFO] skip non existing resourceDirectory <https://builds.apache.org/job/maven-plugins-ITs-m3.0.4/ws/maven-gpg-plugin/src/main/resources>
[INFO] Copying 3 resources
[INFO] 
[INFO] --- maven-compiler-plugin:3.0:compile (default-compile) @ maven-gpg-plugin ---
[INFO] Changes detected - recompiling the module!
[INFO] Compiling 9 source files to <https://builds.apache.org/job/maven-plugins-ITs-m3.0.4/ws/maven-gpg-plugin/target/classes>
[INFO] 
[INFO] --- maven-plugin-plugin:3.2:descriptor (generate-descriptor) @ maven-gpg-plugin ---
[INFO] Using 'UTF-8' encoding to read mojo metadata.
[INFO] Applying mojo extractor for language: java
[INFO] Mojo extractor for language: java found 0 mojo descriptors.
[INFO] Applying mojo extractor for language: bsh
[INFO] Mojo extractor for language: bsh found 0 mojo descriptors.
[INFO] Applying mojo extractor for language: java-annotations
[INFO] Mojo extractor for language: java-annotations found 3 mojo descriptors.
[INFO] 
[INFO] --- maven-resources-plugin:2.6:testResources (default-testResources) @ maven-gpg-plugin
---
[INFO] Using 'UTF-8' encoding to copy filtered resources.
[INFO] Copying 8 resources
[INFO] Copying 3 resources
[INFO] 
[INFO] --- maven-compiler-plugin:3.0:testCompile (default-testCompile) @ maven-gpg-plugin
---
[INFO] No sources to compile
[INFO] 
[INFO] --- maven-surefire-plugin:2.12.4:test (default-test) @ maven-gpg-plugin ---
[INFO] 
[INFO] --- maven-jar-plugin:2.4:jar (default-jar) @ maven-gpg-plugin ---
[INFO] Building jar: <https://builds.apache.org/job/maven-plugins-ITs-m3.0.4/ws/maven-gpg-plugin/target/maven-gpg-plugin-1.6-SNAPSHOT.jar>
[INFO] 
[INFO] --- maven-plugin-plugin:3.2:addPluginArtifactMetadata (default-addPluginArtifactMetadata)
@ maven-gpg-plugin ---
[INFO] 
[INFO] --- maven-invoker-plugin:1.7:install (integration-test) @ maven-gpg-plugin ---
[INFO] Installing <https://builds.apache.org/job/maven-plugins-ITs-m3.0.4/ws/maven-gpg-plugin/pom.xml>
to <https://builds.apache.org/job/maven-plugins-ITs-m3.0.4/ws/maven-gpg-plugin/target/local-repo/org/apache/maven/plugins/maven-gpg-plugin/1.6-SNAPSHOT/maven-gpg-plugin-1.6-SNAPSHOT.pom>
[INFO] Installing <https://builds.apache.org/job/maven-plugins-ITs-m3.0.4/ws/maven-gpg-plugin/target/maven-gpg-plugin-1.6-SNAPSHOT.jar>
to <https://builds.apache.org/job/maven-plugins-ITs-m3.0.4/ws/maven-gpg-plugin/target/local-repo/org/apache/maven/plugins/maven-gpg-plugin/1.6-SNAPSHOT/maven-gpg-plugin-1.6-SNAPSHOT.jar>
[INFO] 
[INFO] --- maven-invoker-plugin:1.7:integration-test (integration-test) @ maven-gpg-plugin
---
[INFO] Building: sign-release/pom.xml
[INFO] run script verify.bsh
[INFO] ..SUCCESS (3.2 s)
[INFO] Building: no-main-artifact/pom.xml
[INFO] run script verify.bsh
[INFO] ..SUCCESS (2.6 s)
[INFO] Building: alternative-secret-keyring/pom.xml
[INFO] run script verify.bsh
[INFO] ..SUCCESS (2.4 s)
[INFO] 
[INFO] --- maven-invoker-plugin:1.7:verify (integration-test) @ maven-gpg-plugin ---
[INFO] -------------------------------------------------
[INFO] Build Summary:
[INFO]   Passed: 3, Failed: 0, Errors: 0, Skipped: 0
[INFO] -------------------------------------------------
[INFO] 
[INFO] --- maven-install-plugin:2.3.1:install (default-install) @ maven-gpg-plugin ---
[INFO] Installing <https://builds.apache.org/job/maven-plugins-ITs-m3.0.4/ws/maven-gpg-plugin/target/maven-gpg-plugin-1.6-SNAPSHOT.jar>
to /home/jenkins/.m2/repository/org/apache/maven/plugins/maven-gpg-plugin/1.6-SNAPSHOT/maven-gpg-plugin-1.6-SNAPSHOT.jar
[INFO] Installing <https://builds.apache.org/job/maven-plugins-ITs-m3.0.4/ws/maven-gpg-plugin/pom.xml>
to /home/jenkins/.m2/repository/org/apache/maven/plugins/maven-gpg-plugin/1.6-SNAPSHOT/maven-gpg-plugin-1.6-SNAPSHOT.pom
[INFO]                                                                         
[INFO] ------------------------------------------------------------------------
[INFO] Building Apache Maven Plugins Aggregator 1-SNAPSHOT
[INFO] ------------------------------------------------------------------------
[INFO] 
[INFO] --- maven-clean-plugin:2.4.1:clean (default-clean) @ maven-plugins-aggregator ---
[INFO] 
[INFO] --- maven-remote-resources-plugin:1.1:process (default) @ maven-plugins-aggregator
---
[INFO] Setting property: classpath.resource.loader.class => 'org.codehaus.plexus.velocity.ContextClassLoaderResourceLoader'.
[INFO] Setting property: velocimacro.messages.on => 'false'.
[INFO] Setting property: resource.loader => 'classpath'.
[INFO] Setting property: resource.manager.logwhenfound => 'false'.
[INFO] 
[INFO] --- maven-install-plugin:2.3.1:install (default-install) @ maven-plugins-aggregator
---
[INFO] Installing <https://builds.apache.org/job/maven-plugins-ITs-m3.0.4/ws/pom.xml>
to /home/jenkins/.m2/repository/org/apache/maven/plugins/maven-plugins-aggregator/1-SNAPSHOT/maven-plugins-aggregator-1-SNAPSHOT.pom
[INFO] ------------------------------------------------------------------------
[INFO] Reactor Summary:
[INFO] 
[INFO] Apache Maven Plugins .............................. SUCCESS [3.886s]
[INFO] Apache Maven ACR Plugin ........................... SUCCESS [36.316s]
[INFO] Apache Maven Ant Plugin ........................... SUCCESS [1:16.970s]
[INFO] Apache Maven AntRun Plugin ........................ SUCCESS [53.754s]
[INFO] Apache Maven Eclipse Plugin ....................... SUCCESS [6:20.303s]
[INFO] Apache Maven Assembly Plugin ...................... SUCCESS [15:46.578s]
[INFO] Apache Maven Changelog Plugin ..................... SUCCESS [55.690s]
[INFO] Apache Maven Changes Plugin ....................... SUCCESS [1:07.206s]
[INFO] Apache Maven Checkstyle Plugin .................... SUCCESS [2:51.143s]
[INFO] Apache Maven Clean Plugin ......................... SUCCESS [20.562s]
[INFO] Apache Maven Compiler Plugin ...................... SUCCESS [1:32.832s]
[INFO] Apache Maven Dependency Plugin .................... SUCCESS [3:03.074s]
[INFO] Apache Maven Deploy Plugin ........................ SUCCESS [1:12.264s]
[INFO] Apache Maven DOAP Plugin .......................... SUCCESS [8.305s]
[INFO] Apache Maven Documentation Checker Plugin ......... SUCCESS [6.326s]
[INFO] Apache Maven EAR Plugin ........................... SUCCESS [4:10.569s]
[INFO] Apache Maven EJB Plugin ........................... SUCCESS [28.854s]
[INFO] Apache Maven Help Plugin .......................... SUCCESS [50.923s]
[INFO] Apache Maven Install Plugin ....................... SUCCESS [58.600s]
[INFO] Apache Maven JAR Plugin ........................... SUCCESS [1:12.496s]
[INFO] Apache Maven Jarsigner Plugin ..................... SUCCESS [42.351s]
[INFO] Apache Maven Javadoc Plugin ....................... SUCCESS [3:00.279s]
[INFO] Apache Maven Linkcheck Plugin ..................... SUCCESS [2.531s]
[INFO] Apache Maven Patch Plugin ......................... SUCCESS [13.008s]
[INFO] Apache Maven PDF Plugin ........................... SUCCESS [35.648s]
[INFO] Apache Maven PMD Plugin ........................... SUCCESS [2:02.290s]
[INFO] Apache Maven RAR Plugin ........................... SUCCESS [9.941s]
[INFO] Apache Maven Reactor Plugin ....................... SUCCESS [2.497s]
[INFO] Apache Maven Repository Plugin .................... SUCCESS [41.893s]
[INFO] Apache Maven Resources Plugin ..................... SUCCESS [54.265s]
[INFO] Apache Maven Site Plugin 3 ........................ SUCCESS [7:16.126s]
[INFO] Apache Maven Source Plugin ........................ SUCCESS [49.783s]
[INFO] Apache Maven Stage Plugin ......................... SUCCESS [4.348s]
[INFO] Apache Maven Toolchains Plugin .................... SUCCESS [1.627s]
[INFO] Apache Maven Verifier Plugin ...................... SUCCESS [20.514s]
[INFO] Apache Maven WAR Plugin ........................... SUCCESS [1:27.915s]
[INFO] Apache Maven Invoker Plugin ....................... SUCCESS [4:55.477s]
[INFO] Apache Maven Project Info Reports Plugin .......... SUCCESS [2:48.653s]
[INFO] Apache Maven Remote Resources Plugin .............. FAILURE [0.496s]
[INFO] Apache Maven Shade Plugin ......................... SUCCESS [3:24.606s]
[INFO] Apache Maven SCM Publish Plugin ................... SUCCESS [1:13.992s]
[INFO] Apache Maven GPG Plugin ........................... SUCCESS [9.571s]
[INFO] Apache Maven Plugins Aggregator ................... SUCCESS [0.752s]
[INFO] ------------------------------------------------------------------------
[INFO] BUILD FAILURE
[INFO] ------------------------------------------------------------------------
[INFO] Total time: 1:14:56.542s
[INFO] Finished at: Tue Mar 11 22:16:46 UTC 2014
[INFO] Final Memory: 101M/432M
[INFO] ------------------------------------------------------------------------
[WARNING] The requested profile "apache.snapshots" could not be activated because it does
not exist.
[ERROR] Failed to execute goal on project maven-remote-resources-plugin: Could not resolve
dependencies for project org.apache.maven.plugins:maven-remote-resources-plugin:maven-plugin:1.6-SNAPSHOT:
Could not find artifact org.apache.maven.shared:maven-filtering:jar:1.2-SNAPSHOT in apache.snapshots
(http://repository.apache.org/snapshots) -> [Help 1]
[ERROR] 
[ERROR] To see the full stack trace of the errors, re-run Maven with the -e switch.
[ERROR] Re-run Maven using the -X switch to enable full debug logging.
[ERROR] 
[ERROR] For more information about the errors and possible solutions, please read the following
articles:
[ERROR] [Help 1] http://cwiki.apache.org/confluence/display/MAVEN/DependencyResolutionException
[ERROR] 
[ERROR] After correcting the problems, you can resume the build with the command
[ERROR]   mvn <goals> -rf :maven-remote-resources-plugin
Build step 'Invoke top-level Maven targets' marked build as failure
Recording test results

Mime
View raw message