maven-notifications mailing list archives

Site index · List index
Message view « Date » · « Thread »
Top « Date » · « Thread »
From Apache Jenkins Server <jenk...@builds.apache.org>
Subject Build failed in Jenkins: doxia-sitetools » JDK 1.6 (latest),Windows #157
Date Wed, 22 Jan 2014 18:05:04 GMT
See <https://builds.apache.org/job/doxia-sitetools/jdk=JDK%201.6%20(latest),label=Windows/157/changes>

Changes:

[hboutemy] [DOXIASITETOOLS-87] more intensive tests since there is a failure on Windows for
at least head.xml xdoc

------------------------------------------
[...truncated 183 lines...]
[INFO] ------------------------------------------------------------------------
[INFO] Building Doxia :: Document Renderer 1.6-SNAPSHOT
[INFO] ------------------------------------------------------------------------
Downloading: http://repository.apache.org/snapshots/org/apache/maven/doxia/doxia-core/1.6-SNAPSHOT/maven-metadata.xml
Downloaded: http://repository.apache.org/snapshots/org/apache/maven/doxia/doxia-core/1.6-SNAPSHOT/maven-metadata.xml
(986 B at 6.2 KB/sec)
Downloading: http://repository.apache.org/snapshots/org/apache/maven/doxia/doxia/1.6-SNAPSHOT/maven-metadata.xml
Downloaded: http://repository.apache.org/snapshots/org/apache/maven/doxia/doxia/1.6-SNAPSHOT/maven-metadata.xml
(809 B at 34.3 KB/sec)
Downloading: http://repository.apache.org/snapshots/org/apache/maven/doxia/doxia-sink-api/1.6-SNAPSHOT/maven-metadata.xml
Downloaded: http://repository.apache.org/snapshots/org/apache/maven/doxia/doxia-sink-api/1.6-SNAPSHOT/maven-metadata.xml
(780 B at 27.2 KB/sec)
Downloading: http://repository.apache.org/snapshots/org/apache/maven/doxia/doxia-logging-api/1.6-SNAPSHOT/maven-metadata.xml
Downloaded: http://repository.apache.org/snapshots/org/apache/maven/doxia/doxia-logging-api/1.6-SNAPSHOT/maven-metadata.xml
(783 B at 30.6 KB/sec)
Downloading: http://repository.apache.org/snapshots/org/apache/maven/doxia/doxia-module-itext/1.6-SNAPSHOT/maven-metadata.xml
Downloaded: http://repository.apache.org/snapshots/org/apache/maven/doxia/doxia-module-itext/1.6-SNAPSHOT/maven-metadata.xml
(784 B at 23.9 KB/sec)
Downloading: http://repository.apache.org/snapshots/org/apache/maven/doxia/doxia-modules/1.6-SNAPSHOT/maven-metadata.xml
Downloaded: http://repository.apache.org/snapshots/org/apache/maven/doxia/doxia-modules/1.6-SNAPSHOT/maven-metadata.xml
(817 B at 29.6 KB/sec)
Downloading: http://repository.apache.org/snapshots/org/apache/maven/doxia/doxia-module-fo/1.6-SNAPSHOT/maven-metadata.xml
Downloaded: http://repository.apache.org/snapshots/org/apache/maven/doxia/doxia-module-fo/1.6-SNAPSHOT/maven-metadata.xml
(781 B at 27.2 KB/sec)
Downloading: http://repository.apache.org/snapshots/org/apache/maven/doxia/doxia-module-apt/1.6-SNAPSHOT/maven-metadata.xml
Downloaded: http://repository.apache.org/snapshots/org/apache/maven/doxia/doxia-module-apt/1.6-SNAPSHOT/maven-metadata.xml
(782 B at 27.3 KB/sec)
Downloading: http://repository.apache.org/snapshots/org/apache/maven/doxia/doxia-module-fml/1.6-SNAPSHOT/maven-metadata.xml
Downloaded: http://repository.apache.org/snapshots/org/apache/maven/doxia/doxia-module-fml/1.6-SNAPSHOT/maven-metadata.xml
(782 B at 24.6 KB/sec)
Downloading: http://repository.apache.org/snapshots/org/apache/maven/doxia/doxia-module-xdoc/1.6-SNAPSHOT/maven-metadata.xml
Downloaded: http://repository.apache.org/snapshots/org/apache/maven/doxia/doxia-module-xdoc/1.6-SNAPSHOT/maven-metadata.xml
(783 B at 29.4 KB/sec)
Downloading: http://repository.apache.org/snapshots/org/apache/maven/doxia/doxia-module-xhtml/1.6-SNAPSHOT/maven-metadata.xml
Downloaded: http://repository.apache.org/snapshots/org/apache/maven/doxia/doxia-module-xhtml/1.6-SNAPSHOT/maven-metadata.xml
(784 B at 29.4 KB/sec)
[INFO] 
[INFO] --- maven-clean-plugin:2.5:clean (default-clean) @ doxia-doc-renderer ---
[INFO] Deleting F:\hudson\hudson-slave\workspace\doxia-sitetools\jdk\JDK 1.6 (latest)\label\Windows\doxia-doc-renderer\target
[INFO] 
[INFO] --- maven-remote-resources-plugin:1.4:process (default) @ doxia-doc-renderer ---
[INFO] 
[INFO] --- maven-resources-plugin:2.6:resources (default-resources) @ doxia-doc-renderer ---
[INFO] Using 'UTF-8' encoding to copy filtered resources.
[INFO] Copying 1 resource
[INFO] skip non existing resourceDirectory F:\hudson\hudson-slave\workspace\doxia-sitetools\jdk\JDK
1.6 (latest)\label\Windows\doxia-doc-renderer\target\generated-site\xsd
[INFO] Copying 3 resources
[INFO] 
[INFO] --- maven-compiler-plugin:3.0:compile (default-compile) @ doxia-doc-renderer ---
[INFO] Changes detected - recompiling the module!
[INFO] Compiling 14 source files to F:\hudson\hudson-slave\workspace\doxia-sitetools\jdk\JDK
1.6 (latest)\label\Windows\doxia-doc-renderer\target\classes
[WARNING] Note: Some input files use or override a deprecated API.
[WARNING] Note: Recompile with -Xlint:deprecation for details.
[INFO] 
[INFO] --- plexus-component-metadata:1.5.5:generate-metadata (default) @ doxia-doc-renderer
---
[INFO] Discovered 4 component descriptors(s)
[INFO] 
[INFO] --- maven-resources-plugin:2.6:testResources (default-testResources) @ doxia-doc-renderer
---
[INFO] Using 'UTF-8' encoding to copy filtered resources.
[INFO] Copying 13 resources
[INFO] Copying 3 resources
[INFO] 
[INFO] --- maven-compiler-plugin:3.0:testCompile (default-testCompile) @ doxia-doc-renderer
---
[INFO] Changes detected - recompiling the module!
[INFO] Compiling 1 source file to F:\hudson\hudson-slave\workspace\doxia-sitetools\jdk\JDK
1.6 (latest)\label\Windows\doxia-doc-renderer\target\test-classes
[INFO] 
[INFO] --- maven-surefire-plugin:2.12.4:test (default-test) @ doxia-doc-renderer ---
[INFO] Surefire report directory: F:\hudson\hudson-slave\workspace\doxia-sitetools\jdk\JDK
1.6 (latest)\label\Windows\doxia-doc-renderer\target\surefire-reports

-------------------------------------------------------
 T E S T S
-------------------------------------------------------
Running org.apache.maven.doxia.docrenderer.DocumentRendererTest
[WARNING] [iText Sink] Modified invalid link: 'Frequently Asked Questions_How_to_export_in_PDF'
to 'Frequently_Asked_Questions_How_to_export_in_PDF'
[WARNING] [iText Sink] Modified invalid link: 'Frequently Asked Questions_How_to_handle_style_in_the_APT_markup_language'
to 'Frequently_Asked_Questions_How_to_handle_style_in_the_APT_markup_language'
[WARNING] [iText Sink] Modified invalid link: 'Frequently Asked Questions_Is_it_possible_to_create_a_book'
to 'Frequently_Asked_Questions_Is_it_possible_to_create_a_book'
[WARNING] [iText Sink] Modified invalid link: 'Frequently Asked Questions_top' to 'Frequently_Asked_Questions_top'
[WARNING] [iText Sink] Modified invalid link: 'Frequently Asked Questions_How_to_export_in_PDF'
to 'Frequently_Asked_Questions_How_to_export_in_PDF'
[WARNING] [iText Sink] Modified invalid link: 'Frequently Asked Questions_How_to_handle_style_in_the_APT_markup_language'
to 'Frequently_Asked_Questions_How_to_handle_style_in_the_APT_markup_language'
[WARNING] [iText Sink] Modified invalid link: 'Frequently Asked Questions_Is_it_possible_to_create_a_book'
to 'Frequently_Asked_Questions_Is_it_possible_to_create_a_book'
[WARNING] [iText Sink] Modified invalid link: 'Frequently Asked Questions_top' to 'Frequently_Asked_Questions_top'
Tests run: 4, Failures: 0, Errors: 0, Skipped: 0, Time elapsed: 7.559 sec

Results :

Tests run: 4, Failures: 0, Errors: 0, Skipped: 0

[INFO] 
[INFO] --- maven-jar-plugin:2.4:jar (default-jar) @ doxia-doc-renderer ---
[INFO] Building jar: F:\hudson\hudson-slave\workspace\doxia-sitetools\jdk\JDK 1.6 (latest)\label\Windows\doxia-doc-renderer\target\doxia-doc-renderer-1.6-SNAPSHOT.jar
[INFO] 
[INFO] --- maven-site-plugin:3.2:attach-descriptor (attach-descriptor) @ doxia-doc-renderer
---
[INFO] 
[INFO] >>> clirr-maven-plugin:2.4:check (default) @ doxia-doc-renderer >>>
[INFO] 
[INFO] --- maven-remote-resources-plugin:1.4:process (default) @ doxia-doc-renderer ---
[INFO] 
[INFO] --- maven-resources-plugin:2.6:resources (default-resources) @ doxia-doc-renderer ---
[INFO] Using 'UTF-8' encoding to copy filtered resources.
[INFO] Copying 1 resource
[INFO] skip non existing resourceDirectory F:\hudson\hudson-slave\workspace\doxia-sitetools\jdk\JDK
1.6 (latest)\label\Windows\doxia-doc-renderer\target\generated-site\xsd
[INFO] Copying 3 resources
[INFO] Copying 3 resources
[INFO] 
[INFO] --- maven-compiler-plugin:3.0:compile (default-compile) @ doxia-doc-renderer ---
[INFO] Changes detected - recompiling the module!
[INFO] Compiling 14 source files to F:\hudson\hudson-slave\workspace\doxia-sitetools\jdk\JDK
1.6 (latest)\label\Windows\doxia-doc-renderer\target\classes
[WARNING] Note: Some input files use or override a deprecated API.
[WARNING] Note: Recompile with -Xlint:deprecation for details.
[INFO] 
[INFO] <<< clirr-maven-plugin:2.4:check (default) @ doxia-doc-renderer <<<
[INFO] 
[INFO] --- clirr-maven-plugin:2.4:check (default) @ doxia-doc-renderer ---
[INFO] Comparing to version: 1.1
[INFO] Succeeded with 0 errors; 0 warnings; and 0 other changes.
[INFO] 
[INFO] --- maven-install-plugin:2.3.1:install (default-install) @ doxia-doc-renderer ---
[INFO] Installing F:\hudson\hudson-slave\workspace\doxia-sitetools\jdk\JDK 1.6 (latest)\label\Windows\doxia-doc-renderer\target\doxia-doc-renderer-1.6-SNAPSHOT.jar
to F:\hudson\m2_repository\org\apache\maven\doxia\doxia-doc-renderer\1.6-SNAPSHOT\doxia-doc-renderer-1.6-SNAPSHOT.jar
[INFO] Installing F:\hudson\hudson-slave\workspace\doxia-sitetools\jdk\JDK 1.6 (latest)\label\Windows\doxia-doc-renderer\pom.xml
to F:\hudson\m2_repository\org\apache\maven\doxia\doxia-doc-renderer\1.6-SNAPSHOT\doxia-doc-renderer-1.6-SNAPSHOT.pom
[INFO]                                                                         
[INFO] ------------------------------------------------------------------------
[INFO] Building Doxia :: Site Renderer 1.6-SNAPSHOT
[INFO] ------------------------------------------------------------------------
Downloading: http://repository.apache.org/snapshots/org/apache/maven/doxia/doxia-module-confluence/1.6-SNAPSHOT/maven-metadata.xml
Downloaded: http://repository.apache.org/snapshots/org/apache/maven/doxia/doxia-module-confluence/1.6-SNAPSHOT/maven-metadata.xml
(789 B at 24.1 KB/sec)
Downloading: http://repository.apache.org/snapshots/org/apache/maven/doxia/doxia-module-docbook-simple/1.6-SNAPSHOT/maven-metadata.xml
Downloaded: http://repository.apache.org/snapshots/org/apache/maven/doxia/doxia-module-docbook-simple/1.6-SNAPSHOT/maven-metadata.xml
(793 B at 14.6 KB/sec)
[INFO] 
[INFO] --- maven-clean-plugin:2.5:clean (default-clean) @ doxia-site-renderer ---
[INFO] Deleting F:\hudson\hudson-slave\workspace\doxia-sitetools\jdk\JDK 1.6 (latest)\label\Windows\doxia-site-renderer\target
[INFO] 
[INFO] --- maven-remote-resources-plugin:1.4:process (default) @ doxia-site-renderer ---
[INFO] 
[INFO] --- maven-resources-plugin:2.6:resources (default-resources) @ doxia-site-renderer
---
[INFO] Using 'UTF-8' encoding to copy filtered resources.
[INFO] Copying 22 resources
[INFO] skip non existing resourceDirectory F:\hudson\hudson-slave\workspace\doxia-sitetools\jdk\JDK
1.6 (latest)\label\Windows\doxia-site-renderer\target\generated-site\xsd
[INFO] Copying 3 resources
[INFO] 
[INFO] --- maven-compiler-plugin:3.0:compile (default-compile) @ doxia-site-renderer ---
[INFO] Changes detected - recompiling the module!
[INFO] Compiling 10 source files to F:\hudson\hudson-slave\workspace\doxia-sitetools\jdk\JDK
1.6 (latest)\label\Windows\doxia-site-renderer\target\classes
[WARNING] Note: F:\hudson\hudson-slave\workspace\doxia-sitetools\jdk\JDK 1.6 (latest)\label\Windows\doxia-site-renderer\src\main\java\org\apache\maven\doxia\siterenderer\sink\SiteRendererSink.java
uses or overrides a deprecated API.
[WARNING] Note: Recompile with -Xlint:deprecation for details.
[INFO] 
[INFO] --- plexus-component-metadata:1.5.5:generate-metadata (default) @ doxia-site-renderer
---
[INFO] Discovered 1 component descriptors(s)
[INFO] 
[INFO] --- maven-resources-plugin:2.6:testResources (default-testResources) @ doxia-site-renderer
---
[INFO] Using 'UTF-8' encoding to copy filtered resources.
[INFO] Copying 46 resources
[INFO] Copying 3 resources
[INFO] 
[INFO] --- maven-compiler-plugin:3.0:testCompile (default-testCompile) @ doxia-site-renderer
---
[INFO] Changes detected - recompiling the module!
[INFO] Compiling 13 source files to F:\hudson\hudson-slave\workspace\doxia-sitetools\jdk\JDK
1.6 (latest)\label\Windows\doxia-site-renderer\target\test-classes
[INFO] 
[INFO] --- maven-surefire-plugin:2.12.4:test (default-test) @ doxia-site-renderer ---
[INFO] Surefire report directory: F:\hudson\hudson-slave\workspace\doxia-sitetools\jdk\JDK
1.6 (latest)\label\Windows\doxia-site-renderer\target\surefire-reports

-------------------------------------------------------
 T E S T S
-------------------------------------------------------
Running org.apache.maven.doxia.siterenderer.DefaultSiteRendererTest
[WARNING] [APT Parser] Ambiguous link: 'cdc.html'. If this is a local link, prepend "./"!
[WARNING] [XHTML Sink] No HTML tag found for unknown event: 'note', ignoring!
[WARNING] [XHTML Sink] No HTML tag found for unknown event: 'sidebar', ignoring!
Jan 22, 2014 6:04:59 PM com.gargoylesoftware.htmlunit.javascript.host.Stylesheet loadStylesheet
SEVERE: F:\hudson\hudson-slave\workspace\doxia-sitetools\jdk\JDK 1.6 (latest)\label\Windows\doxia-site-renderer\target\output\css\maven-theme.css
(The system cannot find the file specified)
Jan 22, 2014 6:04:59 PM com.gargoylesoftware.htmlunit.javascript.host.Stylesheet loadStylesheet
SEVERE: F:\hudson\hudson-slave\workspace\doxia-sitetools\jdk\JDK 1.6 (latest)\label\Windows\doxia-site-renderer\target\output\css\maven-theme.css
(The system cannot find the file specified)
Jan 22, 2014 6:04:59 PM com.gargoylesoftware.htmlunit.javascript.host.Stylesheet loadStylesheet
SEVERE: F:\hudson\hudson-slave\workspace\doxia-sitetools\jdk\JDK 1.6 (latest)\label\Windows\doxia-site-renderer\target\output\css\maven-theme.css
(The system cannot find the file specified)
Jan 22, 2014 6:04:59 PM com.gargoylesoftware.htmlunit.javascript.host.Stylesheet loadStylesheet
SEVERE: F:\hudson\hudson-slave\workspace\doxia-sitetools\jdk\JDK 1.6 (latest)\label\Windows\doxia-site-renderer\target\output\css\maven-theme.css
(The system cannot find the file specified)
Jan 22, 2014 6:04:59 PM com.gargoylesoftware.htmlunit.javascript.host.Stylesheet loadStylesheet
SEVERE: F:\hudson\hudson-slave\workspace\doxia-sitetools\jdk\JDK 1.6 (latest)\label\Windows\doxia-site-renderer\target\output\css\maven-theme.css
(The system cannot find the file specified)
Jan 22, 2014 6:04:59 PM com.gargoylesoftware.htmlunit.javascript.host.Stylesheet loadStylesheet
SEVERE: F:\hudson\hudson-slave\workspace\doxia-sitetools\jdk\JDK 1.6 (latest)\label\Windows\doxia-site-renderer\target\output\css\maven-theme.css
(The system cannot find the file specified)
Jan 22, 2014 6:04:59 PM com.gargoylesoftware.htmlunit.javascript.host.Stylesheet loadStylesheet
SEVERE: F:\hudson\hudson-slave\workspace\doxia-sitetools\jdk\JDK 1.6 (latest)\label\Windows\doxia-site-renderer\target\output\css\maven-theme.css
(The system cannot find the file specified)
Tests run: 4, Failures: 1, Errors: 0, Skipped: 0, Time elapsed: 7.467 sec <<< FAILURE!
testRender(org.apache.maven.doxia.siterenderer.DefaultSiteRendererTest)  Time elapsed: 7.388
sec  <<< FAILURE!
junit.framework.AssertionFailedError: Should contain only Windows or Unix newlines: cr = 118,
lf = 119
	at junit.framework.Assert.fail(Assert.java:47)
	at junit.framework.Assert.assertTrue(Assert.java:20)
	at org.apache.maven.doxia.siterenderer.DefaultSiteRendererTest.checkNewlines(DefaultSiteRendererTest.java:415)
	at org.apache.maven.doxia.siterenderer.DefaultSiteRendererTest.verifyNewlines(DefaultSiteRendererTest.java:400)
	at org.apache.maven.doxia.siterenderer.DefaultSiteRendererTest.testRender(DefaultSiteRendererTest.java:171)

Running org.apache.maven.doxia.siterenderer.RenderingContextTest
Tests run: 1, Failures: 0, Errors: 0, Skipped: 0, Time elapsed: 0 sec

Results :

Failed tests:   testRender(org.apache.maven.doxia.siterenderer.DefaultSiteRendererTest): Should
contain only Windows or Unix newlines: cr = 118, lf = 119

Tests run: 5, Failures: 1, Errors: 0, Skipped: 0

[INFO] ------------------------------------------------------------------------
[INFO] Reactor Summary:
[INFO] 
[INFO] Doxia :: Sitetools ................................ SUCCESS [4.028s]
[INFO] Doxia :: Decoration Model ......................... SUCCESS [5.965s]
[INFO] Doxia :: Document Renderer ........................ SUCCESS [13.005s]
[INFO] Doxia :: Site Renderer ............................ FAILURE [10.848s]
[INFO] ------------------------------------------------------------------------
[INFO] BUILD FAILURE
[INFO] ------------------------------------------------------------------------
[INFO] Total time: 34.292s
[INFO] Finished at: Wed Jan 22 18:04:59 GMT 2014
[INFO] Final Memory: 30M/318M
[INFO] ------------------------------------------------------------------------
[ERROR] Failed to execute goal org.apache.maven.plugins:maven-surefire-plugin:2.12.4:test
(default-test) on project doxia-site-renderer: There are test failures.
[ERROR] 
[ERROR] Please refer to F:\hudson\hudson-slave\workspace\doxia-sitetools\jdk\JDK 1.6 (latest)\label\Windows\doxia-site-renderer\target\surefire-reports
for the individual test results.
[ERROR] -> [Help 1]
org.apache.maven.lifecycle.LifecycleExecutionException: Failed to execute goal org.apache.maven.plugins:maven-surefire-plugin:2.12.4:test
(default-test) on project doxia-site-renderer: There are test failures.

Please refer to F:\hudson\hudson-slave\workspace\doxia-sitetools\jdk\JDK 1.6 (latest)\label\Windows\doxia-site-renderer\target\surefire-reports
for the individual test results.
	at org.apache.maven.lifecycle.internal.MojoExecutor.execute(MojoExecutor.java:213)
	at org.apache.maven.lifecycle.internal.MojoExecutor.execute(MojoExecutor.java:153)
	at org.apache.maven.lifecycle.internal.MojoExecutor.execute(MojoExecutor.java:145)
	at org.apache.maven.lifecycle.internal.LifecycleModuleBuilder.buildProject(LifecycleModuleBuilder.java:84)
	at org.apache.maven.lifecycle.internal.LifecycleModuleBuilder.buildProject(LifecycleModuleBuilder.java:59)
	at org.apache.maven.lifecycle.internal.LifecycleStarter.singleThreadedBuild(LifecycleStarter.java:183)
	at org.apache.maven.lifecycle.internal.LifecycleStarter.execute(LifecycleStarter.java:161)
	at org.apache.maven.DefaultMaven.doExecute(DefaultMaven.java:320)
	at org.apache.maven.DefaultMaven.execute(DefaultMaven.java:156)
	at org.apache.maven.cli.MavenCli.execute(MavenCli.java:537)
	at org.apache.maven.cli.MavenCli.doMain(MavenCli.java:196)
	at org.apache.maven.cli.MavenCli.main(MavenCli.java:141)
	at sun.reflect.NativeMethodAccessorImpl.invoke0(Native Method)
	at sun.reflect.NativeMethodAccessorImpl.invoke(NativeMethodAccessorImpl.java:39)
	at sun.reflect.DelegatingMethodAccessorImpl.invoke(DelegatingMethodAccessorImpl.java:25)
	at java.lang.reflect.Method.invoke(Method.java:597)
	at org.codehaus.plexus.classworlds.launcher.Launcher.launchEnhanced(Launcher.java:290)
	at org.codehaus.plexus.classworlds.launcher.Launcher.launch(Launcher.java:230)
	at org.codehaus.plexus.classworlds.launcher.Launcher.mainWithExitCode(Launcher.java:409)
	at org.codehaus.plexus.classworlds.launcher.Launcher.main(Launcher.java:352)
Caused by: org.apache.maven.plugin.MojoFailureException: There are test failures.

Please refer to F:\hudson\hudson-slave\workspace\doxia-sitetools\jdk\JDK 1.6 (latest)\label\Windows\doxia-site-renderer\target\surefire-reports
for the individual test results.
	at org.apache.maven.plugin.surefire.SurefireHelper.reportExecution(SurefireHelper.java:83)
	at org.apache.maven.plugin.surefire.SurefirePlugin.writeSummary(SurefirePlugin.java:176)
	at org.apache.maven.plugin.surefire.SurefirePlugin.handleSummary(SurefirePlugin.java:150)
	at org.apache.maven.plugin.surefire.AbstractSurefireMojo.executeAfterPreconditionsChecked(AbstractSurefireMojo.java:650)
	at org.apache.maven.plugin.surefire.AbstractSurefireMojo.execute(AbstractSurefireMojo.java:586)
	at org.apache.maven.plugin.DefaultBuildPluginManager.executeMojo(DefaultBuildPluginManager.java:101)
	at org.apache.maven.lifecycle.internal.MojoExecutor.execute(MojoExecutor.java:209)
	... 19 more
[ERROR] 
[ERROR] Re-run Maven using the -X switch to enable full debug logging.
[ERROR] 
[ERROR] For more information about the errors and possible solutions, please read the following
articles:
[ERROR] [Help 1] http://cwiki.apache.org/confluence/display/MAVEN/MojoFailureException
[ERROR] 
[ERROR] After correcting the problems, you can resume the build with the command
[ERROR]   mvn <goals> -rf :doxia-site-renderer
Build step 'Invoke top-level Maven targets' marked build as failure

Mime
View raw message