maven-notifications mailing list archives

Site index · List index
Message view « Date » · « Thread »
Top « Date » · « Thread »
From Apache Jenkins Server <jenk...@builds.apache.org>
Subject Build failed in Jenkins: maven-site-plugin-2.x » JDK 1.5 (latest),Ubuntu #86
Date Thu, 02 Jan 2014 10:01:37 GMT
See <https://builds.apache.org/job/maven-site-plugin-2.x/jdk=JDK%201.5%20(latest),label=Ubuntu/86/>

------------------------------------------
Started by upstream project "maven-site-plugin-2.x" build number 86
originally caused by:
 Started by an SCM change
Building remotely on ubuntu1 in workspace <https://builds.apache.org/job/maven-site-plugin-2.x/jdk=JDK%201.5%20(latest),label=Ubuntu/ws/>
Updating http://svn.apache.org/repos/asf/maven/plugins/branches/maven-site-plugin-2.x at revision
'2014-01-02T05:48:39.586 +0000'
At revision 1554739
no change for http://svn.apache.org/repos/asf/maven/plugins/branches/maven-site-plugin-2.x
since the previous build
[Ubuntu] $ /home/hudson/tools/maven/apache-maven-2.2.1/bin/mvn -Dlabel=Ubuntu "-Djdk=JDK 1.5
(latest)" "-Dmaven.repo.local=<https://builds.apache.org/job/maven-site-plugin-2.x/jdk=JDK%201.5%20(latest),label=Ubuntu/ws/.repository">
clean verify -Prun-its -fae -B -U -e -V
+ Error stacktraces are turned on.
Apache Maven 2.2.1 (r801777; 2009-08-06 19:16:01+0000)
Java version: 1.5.0_22
Java home: /home/jenkins/tools/java/jdk1.5.0_22-32/jre
Default locale: en_US, platform encoding: ANSI_X3.4-1968
OS name: "linux" version: "3.2.0-57-generic" arch: "i386" Family: "unix"
[INFO] Scanning for projects...
[INFO] ------------------------------------------------------------------------
[INFO] Building Maven Site Plugin 2
[INFO]    task-segment: [clean, verify]
[INFO] ------------------------------------------------------------------------
[INFO] [clean:clean {execution: default-clean}]
[INFO] Deleting <https://builds.apache.org/job/maven-site-plugin-2.x/jdk=JDK%201.5%20(latest),label=Ubuntu/ws/target>
[INFO] [enforcer:enforce {execution: ensure-no-container-api}]
[INFO] [plugin:helpmojo {execution: generated-helpmojo}]
[INFO] Using 'UTF-8' encoding to read mojo metadata.
[INFO] Applying mojo extractor for language: java
[INFO] Mojo extractor for language: java found 8 mojo descriptors.
[INFO] Applying mojo extractor for language: bsh
[INFO] Mojo extractor for language: bsh found 0 mojo descriptors.
[INFO] [plugin:descriptor {execution: default-descriptor}]
[INFO] Using 'UTF-8' encoding to read mojo metadata.
[INFO] Applying mojo extractor for language: java
[INFO] Mojo extractor for language: java found 9 mojo descriptors.
[INFO] Applying mojo extractor for language: bsh
[INFO] Mojo extractor for language: bsh found 0 mojo descriptors.
[INFO] Setting property: classpath.resource.loader.class => 'org.codehaus.plexus.velocity.ContextClassLoaderResourceLoader'.
[INFO] Setting property: velocimacro.messages.on => 'false'.
[INFO] Setting property: resource.loader => 'classpath'.
[INFO] Setting property: resource.manager.logwhenfound => 'false'.
[INFO] [remote-resources:process {execution: default}]
[INFO] [resources:resources {execution: default-resources}]
[INFO] Using 'UTF-8' encoding to copy filtered resources.
[INFO] Copying 26 resources
[INFO] Copying 3 resources
[INFO] [compiler:compile {execution: default-compile}]
[INFO] Compiling 20 source files to <https://builds.apache.org/job/maven-site-plugin-2.x/jdk=JDK%201.5%20(latest),label=Ubuntu/ws/target/classes>
[INFO] [resources:testResources {execution: default-testResources}]
[INFO] Using 'UTF-8' encoding to copy filtered resources.
[INFO] Copying 3 resources
[INFO] Copying 3 resources
[INFO] [compiler:testCompile {execution: default-testCompile}]
[INFO] Compiling 3 source files to <https://builds.apache.org/job/maven-site-plugin-2.x/jdk=JDK%201.5%20(latest),label=Ubuntu/ws/target/test-classes>
[INFO] [surefire:test {execution: default-test}]
[INFO] Surefire report directory: <https://builds.apache.org/job/maven-site-plugin-2.x/jdk=JDK%201.5%20(latest),label=Ubuntu/ws/target/surefire-reports>

-------------------------------------------------------
 T E S T S
-------------------------------------------------------
Running org.apache.maven.plugins.site.SiteMojoTest
Tests run: 1, Failures: 0, Errors: 0, Skipped: 0, Time elapsed: 0.672 sec
Running org.apache.maven.plugins.site.SiteDeployMojoTest
Tests run: 11, Failures: 0, Errors: 0, Skipped: 0, Time elapsed: 0.696 sec

Results :

Tests run: 12, Failures: 0, Errors: 0, Skipped: 0

[INFO] [jar:jar {execution: default-jar}]
[INFO] Building jar: <https://builds.apache.org/job/maven-site-plugin-2.x/jdk=JDK%201.5%20(latest),label=Ubuntu/ws/target/maven-site-plugin-2.5-SNAPSHOT.jar>
[INFO] [plugin:addPluginArtifactMetadata {execution: default-addPluginArtifactMetadata}]
[INFO] [invoker:install {execution: integration-test}]
[INFO] Installing <https://builds.apache.org/job/maven-site-plugin-2.x/jdk=JDK%201.5%20(latest),label=Ubuntu/ws/pom.xml>
to <https://builds.apache.org/job/maven-site-plugin-2.x/jdk=JDK%201.5%20(latest),label=Ubuntu/ws/target/local-repo/org/apache/maven/plugins/maven-site-plugin/2.5-SNAPSHOT/maven-site-plugin-2.5-SNAPSHOT.pom>
[INFO] Installing <https://builds.apache.org/job/maven-site-plugin-2.x/jdk=JDK%201.5%20(latest),label=Ubuntu/ws/target/maven-site-plugin-2.5-SNAPSHOT.jar>
to <https://builds.apache.org/job/maven-site-plugin-2.x/jdk=JDK%201.5%20(latest),label=Ubuntu/ws/target/local-repo/org/apache/maven/plugins/maven-site-plugin/2.5-SNAPSHOT/maven-site-plugin-2.5-SNAPSHOT.jar>
[INFO] [invoker:run {execution: integration-test}]
[INFO] Building: MSITE-548/pom.xml
[INFO] ..SUCCESS (10.9 s)
[INFO] Building: it-plugin-test/pom.xml
[INFO] ..SUCCESS (7.6 s)
[INFO] Building: emma-plugin-it/pom.xml
[INFO] ..SUCCESS (7.9 s)
[INFO] Building: full-reporting/pom.xml
[INFO] ..FAILED (24.1 s)
[INFO]   The build exited with code 1. See <https://builds.apache.org/job/maven-site-plugin-2.x/jdk=JDK%201.5%20(latest),label=Ubuntu/ws/target/it/full-reporting/build.log>
for details.
[INFO] Building: MSITE-537/pom.xml
[INFO] ..SUCCESS (8.3 s)
[INFO] Building: site-stage-deploy/pom.xml
[INFO] ..SUCCESS (13.8 s)
[INFO] Building: MSITE-265/pom.xml
[INFO] ..SUCCESS (10.9 s)
[INFO] Building: MSITE-304/pom.xml
[INFO] ..SUCCESS (7.3 s)
[INFO] Building: inheritedReports/pom.xml
[INFO] ..SUCCESS (7.4 s)
[INFO] Building: top-parent-no-site/pom.xml
[INFO] ..SUCCESS (8.4 s)
[INFO] Building: site-inheritance/pom.xml
[INFO] ..SUCCESS (9.9 s)
[INFO] Building: MSITE-566/pom.xml
[INFO] ..SUCCESS (5.9 s)
[INFO] Building: MSITE-506/pom.xml
[INFO] ..SUCCESS (15.2 s)
[INFO] Building: MSITE-354/pom.xml
[INFO] ..SUCCESS (7.5 s)
[INFO] Building: top-parent-different-site/pom.xml
[INFO] ..SUCCESS (6.4 s)
[INFO] Building: site-jar/pom.xml
[INFO] ..SUCCESS (6.7 s)
[INFO] Building: empty-report-set/pom.xml
[INFO] ..SUCCESS (3.8 s)
[INFO] Building: MSITE-159/pom.xml
[INFO] ..SUCCESS (6.9 s)
[INFO] Building: site-deploy/pom.xml
[INFO] ..SUCCESS (6.5 s)
[INFO] Building: inheritedMenus/pom.xml
[INFO] ..SUCCESS (9.9 s)
[INFO] Building: MSITE-497/pom.xml
[INFO] ..SUCCESS (22.8 s)
[INFO] Building: report-changes-generation/pom.xml
[INFO] ..SUCCESS (6.0 s)
[INFO] Building: MSITE-512/pom.xml
[INFO] ..SUCCESS (11.7 s)
[INFO] Building: interpolation/pom.xml
[INFO] ..SUCCESS (8.8 s)
[INFO] Building: site-attach-descriptor/pom.xml
[INFO] ..SUCCESS (4.6 s)
[INFO] Building: MSITE-582/pom.xml
[INFO] ..SUCCESS (6.3 s)
[INFO] Building: site-skip/pom.xml
[INFO] ..SUCCESS (6.6 s)
[INFO] Building: MSITE-504/pom.xml
[INFO] ..SUCCESS (15.1 s)
[INFO] Building: MSITE-322/pom.xml
[INFO] ..SUCCESS (9.3 s)
[INFO] Building: MSITE-550/pom.xml
[INFO] ..SUCCESS (5.5 s)
[INFO] Building: MSITE-458/pom.xml
[INFO] ..SUCCESS (12.8 s)
[INFO] Building: MSITE-312/pom.xml
[INFO] ..SUCCESS (7.1 s)
[INFO] Building: MSITE-507/pom.xml
[INFO] ..SUCCESS (28.0 s)
[INFO] Building: no-version/pom.xml
[INFO] ..SUCCESS (7.2 s)
[INFO] Building: MSITE-456/pom.xml
[INFO] ..SUCCESS (7.4 s)
[INFO] Building: surefire-report/pom.xml
[INFO] ..SUCCESS (7.1 s)
[INFO] -------------------------------------------------
[INFO] Build Summary:
[INFO]   Passed: 35, Failed: 1, Errors: 0, Skipped: 0
[INFO] -------------------------------------------------
[ERROR] The following builds failed:
[ERROR] *  full-reporting/pom.xml
[INFO] -------------------------------------------------
[INFO] Error for project: Maven Site Plugin 2 (during verify)
[INFO] ------------------------------------------------------------------------
[INFO] : org.apache.maven.plugin.invoker.InvokerSession@10fe215
1 build failed.
[INFO] ------------------------------------------------------------------------
[INFO] Trace
org.apache.maven.BuildFailureException: 1 build failed.
	at org.apache.maven.lifecycle.DefaultLifecycleExecutor.executeGoals(DefaultLifecycleExecutor.java:715)
	at org.apache.maven.lifecycle.DefaultLifecycleExecutor.executeGoalWithLifecycle(DefaultLifecycleExecutor.java:556)
	at org.apache.maven.lifecycle.DefaultLifecycleExecutor.executeGoal(DefaultLifecycleExecutor.java:535)
	at org.apache.maven.lifecycle.DefaultLifecycleExecutor.executeGoalAndHandleFailures(DefaultLifecycleExecutor.java:387)
	at org.apache.maven.lifecycle.DefaultLifecycleExecutor.executeTaskSegments(DefaultLifecycleExecutor.java:348)
	at org.apache.maven.lifecycle.DefaultLifecycleExecutor.execute(DefaultLifecycleExecutor.java:180)
	at org.apache.maven.DefaultMaven.doExecute(DefaultMaven.java:328)
	at org.apache.maven.DefaultMaven.execute(DefaultMaven.java:138)
	at org.apache.maven.cli.MavenCli.main(MavenCli.java:362)
	at org.apache.maven.cli.compat.CompatibleMain.main(CompatibleMain.java:60)
	at sun.reflect.NativeMethodAccessorImpl.invoke0(Native Method)
	at sun.reflect.NativeMethodAccessorImpl.invoke(NativeMethodAccessorImpl.java:39)
	at sun.reflect.DelegatingMethodAccessorImpl.invoke(DelegatingMethodAccessorImpl.java:25)
	at java.lang.reflect.Method.invoke(Method.java:592)
	at org.codehaus.classworlds.Launcher.launchEnhanced(Launcher.java:315)
	at org.codehaus.classworlds.Launcher.launch(Launcher.java:255)
	at org.codehaus.classworlds.Launcher.mainWithExitCode(Launcher.java:430)
	at org.codehaus.classworlds.Launcher.main(Launcher.java:375)
Caused by: org.apache.maven.plugin.MojoFailureException: 1 build failed.
	at org.apache.maven.plugin.invoker.InvokerSession.handleFailures(InvokerSession.java:263)
	at org.apache.maven.plugin.invoker.InvokerMojo.processResults(InvokerMojo.java:58)
	at org.apache.maven.plugin.invoker.AbstractInvokerMojo.execute(AbstractInvokerMojo.java:620)
	at org.apache.maven.plugin.DefaultPluginManager.executeMojo(DefaultPluginManager.java:490)
	at org.apache.maven.lifecycle.DefaultLifecycleExecutor.executeGoals(DefaultLifecycleExecutor.java:694)
	... 17 more
[INFO] ------------------------------------------------------------------------
[INFO] BUILD ERRORS
[INFO] ------------------------------------------------------------------------
[INFO] Total time: 6 minutes 30 seconds
[INFO] Finished at: Thu Jan 02 10:01:37 UTC 2014
[INFO] Final Memory: 44M/199M
[INFO] ------------------------------------------------------------------------
Build step 'Invoke top-level Maven targets' marked build as failure

Mime
View raw message