maven-notifications mailing list archives

Site index · List index
Message view « Date » · « Thread »
Top « Date » · « Thread »
From Apache Jenkins Server <jenk...@builds.apache.org>
Subject Build failed in Jenkins: maven-plugins-ITs-m3-windows #430
Date Fri, 03 Jan 2014 22:21:41 GMT
See <https://builds.apache.org/job/maven-plugins-ITs-m3-windows/430/changes>

Changes:

[tchemit] [maven-release-plugin] prepare for next development iteration

[tchemit] [maven-release-plugin] prepare release maven-jarsigner-plugin-1.3.1

[tchemit] MJARSIGNER-33 - Sign already signed jar still does not work

------------------------------------------
[...truncated 10602 lines...]
[INFO] Installing F:\hudson\hudson-slave\workspace\maven-plugins-ITs-m3-windows\maven-resources-plugin\target\maven-resources-plugin-2.7-SNAPSHOT-tests.jar
to F:\hudson\hudson-slave\workspace\maven-plugins-ITs-m3-windows\maven-shade-plugin\target\local-repo\org\apache\maven\plugins\maven-resources-plugin\2.7-SNAPSHOT\maven-resources-plugin-2.7-SNAPSHOT-tests.jar
[INFO] Installing F:\hudson\hudson-slave\workspace\maven-plugins-ITs-m3-windows\maven-site-plugin\dependency-reduced-pom.xml
to F:\hudson\hudson-slave\workspace\maven-plugins-ITs-m3-windows\maven-shade-plugin\target\local-repo\org\apache\maven\plugins\maven-site-plugin\3.4-SNAPSHOT\maven-site-plugin-3.4-SNAPSHOT.pom
[INFO] Installing F:\hudson\hudson-slave\workspace\maven-plugins-ITs-m3-windows\maven-site-plugin\target\maven-site-plugin-3.4-SNAPSHOT.jar
to F:\hudson\hudson-slave\workspace\maven-plugins-ITs-m3-windows\maven-shade-plugin\target\local-repo\org\apache\maven\plugins\maven-site-plugin\3.4-SNAPSHOT\maven-site-plugin-3.4-SNAPSHOT.jar
[INFO] Installing F:\hudson\hudson-slave\workspace\maven-plugins-ITs-m3-windows\maven-site-plugin\dependency-reduced-pom.xml
to F:\hudson\hudson-slave\workspace\maven-plugins-ITs-m3-windows\maven-shade-plugin\target\local-repo\org\apache\maven\plugins\maven-site-plugin\3.4-SNAPSHOT\maven-site-plugin-3.4-SNAPSHOT.pom
[INFO] Installing F:\hudson\hudson-slave\workspace\maven-plugins-ITs-m3-windows\maven-source-plugin\pom.xml
to F:\hudson\hudson-slave\workspace\maven-plugins-ITs-m3-windows\maven-shade-plugin\target\local-repo\org\apache\maven\plugins\maven-source-plugin\2.3-SNAPSHOT\maven-source-plugin-2.3-SNAPSHOT.pom
[INFO] Installing F:\hudson\hudson-slave\workspace\maven-plugins-ITs-m3-windows\maven-source-plugin\target\maven-source-plugin-2.3-SNAPSHOT.jar
to F:\hudson\hudson-slave\workspace\maven-plugins-ITs-m3-windows\maven-shade-plugin\target\local-repo\org\apache\maven\plugins\maven-source-plugin\2.3-SNAPSHOT\maven-source-plugin-2.3-SNAPSHOT.jar
[INFO] Installing F:\hudson\hudson-slave\workspace\maven-plugins-ITs-m3-windows\maven-source-plugin\pom.xml
to F:\hudson\hudson-slave\workspace\maven-plugins-ITs-m3-windows\maven-shade-plugin\target\local-repo\org\apache\maven\plugins\maven-source-plugin\2.3-SNAPSHOT\maven-source-plugin-2.3-SNAPSHOT.pom
[INFO] Installing F:\hudson\hudson-slave\workspace\maven-plugins-ITs-m3-windows\maven-stage-plugin\pom.xml
to F:\hudson\hudson-slave\workspace\maven-plugins-ITs-m3-windows\maven-shade-plugin\target\local-repo\org\apache\maven\plugins\maven-stage-plugin\1.0-SNAPSHOT\maven-stage-plugin-1.0-SNAPSHOT.pom
[INFO] Installing F:\hudson\hudson-slave\workspace\maven-plugins-ITs-m3-windows\maven-stage-plugin\target\maven-stage-plugin-1.0-SNAPSHOT.jar
to F:\hudson\hudson-slave\workspace\maven-plugins-ITs-m3-windows\maven-shade-plugin\target\local-repo\org\apache\maven\plugins\maven-stage-plugin\1.0-SNAPSHOT\maven-stage-plugin-1.0-SNAPSHOT.jar
[INFO] Installing F:\hudson\hudson-slave\workspace\maven-plugins-ITs-m3-windows\maven-stage-plugin\pom.xml
to F:\hudson\hudson-slave\workspace\maven-plugins-ITs-m3-windows\maven-shade-plugin\target\local-repo\org\apache\maven\plugins\maven-stage-plugin\1.0-SNAPSHOT\maven-stage-plugin-1.0-SNAPSHOT.pom
[INFO] Installing F:\hudson\hudson-slave\workspace\maven-plugins-ITs-m3-windows\maven-toolchains-plugin\pom.xml
to F:\hudson\hudson-slave\workspace\maven-plugins-ITs-m3-windows\maven-shade-plugin\target\local-repo\org\apache\maven\plugins\maven-toolchains-plugin\1.1-SNAPSHOT\maven-toolchains-plugin-1.1-SNAPSHOT.pom
[INFO] Installing F:\hudson\hudson-slave\workspace\maven-plugins-ITs-m3-windows\maven-toolchains-plugin\target\maven-toolchains-plugin-1.1-SNAPSHOT.jar
to F:\hudson\hudson-slave\workspace\maven-plugins-ITs-m3-windows\maven-shade-plugin\target\local-repo\org\apache\maven\plugins\maven-toolchains-plugin\1.1-SNAPSHOT\maven-toolchains-plugin-1.1-SNAPSHOT.jar
[INFO] Installing F:\hudson\hudson-slave\workspace\maven-plugins-ITs-m3-windows\maven-toolchains-plugin\pom.xml
to F:\hudson\hudson-slave\workspace\maven-plugins-ITs-m3-windows\maven-shade-plugin\target\local-repo\org\apache\maven\plugins\maven-toolchains-plugin\1.1-SNAPSHOT\maven-toolchains-plugin-1.1-SNAPSHOT.pom
[INFO] Installing F:\hudson\hudson-slave\workspace\maven-plugins-ITs-m3-windows\maven-verifier-plugin\pom.xml
to F:\hudson\hudson-slave\workspace\maven-plugins-ITs-m3-windows\maven-shade-plugin\target\local-repo\org\apache\maven\plugins\maven-verifier-plugin\1.1-SNAPSHOT\maven-verifier-plugin-1.1-SNAPSHOT.pom
[INFO] Installing F:\hudson\hudson-slave\workspace\maven-plugins-ITs-m3-windows\maven-verifier-plugin\target\maven-verifier-plugin-1.1-SNAPSHOT.jar
to F:\hudson\hudson-slave\workspace\maven-plugins-ITs-m3-windows\maven-shade-plugin\target\local-repo\org\apache\maven\plugins\maven-verifier-plugin\1.1-SNAPSHOT\maven-verifier-plugin-1.1-SNAPSHOT.jar
[INFO] Installing F:\hudson\hudson-slave\workspace\maven-plugins-ITs-m3-windows\maven-verifier-plugin\pom.xml
to F:\hudson\hudson-slave\workspace\maven-plugins-ITs-m3-windows\maven-shade-plugin\target\local-repo\org\apache\maven\plugins\maven-verifier-plugin\1.1-SNAPSHOT\maven-verifier-plugin-1.1-SNAPSHOT.pom
[INFO] Installing F:\hudson\hudson-slave\workspace\maven-plugins-ITs-m3-windows\maven-war-plugin\pom.xml
to F:\hudson\hudson-slave\workspace\maven-plugins-ITs-m3-windows\maven-shade-plugin\target\local-repo\org\apache\maven\plugins\maven-war-plugin\2.5-SNAPSHOT\maven-war-plugin-2.5-SNAPSHOT.pom
[INFO] Installing F:\hudson\hudson-slave\workspace\maven-plugins-ITs-m3-windows\maven-war-plugin\target\maven-war-plugin-2.5-SNAPSHOT.jar
to F:\hudson\hudson-slave\workspace\maven-plugins-ITs-m3-windows\maven-shade-plugin\target\local-repo\org\apache\maven\plugins\maven-war-plugin\2.5-SNAPSHOT\maven-war-plugin-2.5-SNAPSHOT.jar
[INFO] Installing F:\hudson\hudson-slave\workspace\maven-plugins-ITs-m3-windows\maven-war-plugin\pom.xml
to F:\hudson\hudson-slave\workspace\maven-plugins-ITs-m3-windows\maven-shade-plugin\target\local-repo\org\apache\maven\plugins\maven-war-plugin\2.5-SNAPSHOT\maven-war-plugin-2.5-SNAPSHOT.pom
[INFO] Installing F:\hudson\hudson-slave\workspace\maven-plugins-ITs-m3-windows\maven-scm-publish-plugin\pom.xml
to F:\hudson\hudson-slave\workspace\maven-plugins-ITs-m3-windows\maven-shade-plugin\target\local-repo\org\apache\maven\plugins\maven-scm-publish-plugin\1.0-SNAPSHOT\maven-scm-publish-plugin-1.0-SNAPSHOT.pom
[INFO] Installing F:\hudson\hudson-slave\workspace\maven-plugins-ITs-m3-windows\maven-scm-publish-plugin\target\maven-scm-publish-plugin-1.0-SNAPSHOT.jar
to F:\hudson\hudson-slave\workspace\maven-plugins-ITs-m3-windows\maven-shade-plugin\target\local-repo\org\apache\maven\plugins\maven-scm-publish-plugin\1.0-SNAPSHOT\maven-scm-publish-plugin-1.0-SNAPSHOT.jar
[INFO] Installing F:\hudson\hudson-slave\workspace\maven-plugins-ITs-m3-windows\maven-scm-publish-plugin\pom.xml
to F:\hudson\hudson-slave\workspace\maven-plugins-ITs-m3-windows\maven-shade-plugin\target\local-repo\org\apache\maven\plugins\maven-scm-publish-plugin\1.0-SNAPSHOT\maven-scm-publish-plugin-1.0-SNAPSHOT.pom
[INFO] Installing F:\hudson\hudson-slave\workspace\maven-plugins-ITs-m3-windows\maven-invoker-plugin\pom.xml
to F:\hudson\hudson-slave\workspace\maven-plugins-ITs-m3-windows\maven-shade-plugin\target\local-repo\org\apache\maven\plugins\maven-invoker-plugin\1.9-SNAPSHOT\maven-invoker-plugin-1.9-SNAPSHOT.pom
[INFO] Installing F:\hudson\hudson-slave\workspace\maven-plugins-ITs-m3-windows\maven-invoker-plugin\target\maven-invoker-plugin-1.9-SNAPSHOT.jar
to F:\hudson\hudson-slave\workspace\maven-plugins-ITs-m3-windows\maven-shade-plugin\target\local-repo\org\apache\maven\plugins\maven-invoker-plugin\1.9-SNAPSHOT\maven-invoker-plugin-1.9-SNAPSHOT.jar
[INFO] Installing F:\hudson\hudson-slave\workspace\maven-plugins-ITs-m3-windows\maven-invoker-plugin\pom.xml
to F:\hudson\hudson-slave\workspace\maven-plugins-ITs-m3-windows\maven-shade-plugin\target\local-repo\org\apache\maven\plugins\maven-invoker-plugin\1.9-SNAPSHOT\maven-invoker-plugin-1.9-SNAPSHOT.pom
[INFO] Installing F:\hudson\hudson-slave\workspace\maven-plugins-ITs-m3-windows\maven-project-info-reports-plugin\pom.xml
to F:\hudson\hudson-slave\workspace\maven-plugins-ITs-m3-windows\maven-shade-plugin\target\local-repo\org\apache\maven\plugins\maven-project-info-reports-plugin\2.8-SNAPSHOT\maven-project-info-reports-plugin-2.8-SNAPSHOT.pom
[INFO] Installing F:\hudson\hudson-slave\workspace\maven-plugins-ITs-m3-windows\maven-project-info-reports-plugin\target\maven-project-info-reports-plugin-2.8-SNAPSHOT.jar
to F:\hudson\hudson-slave\workspace\maven-plugins-ITs-m3-windows\maven-shade-plugin\target\local-repo\org\apache\maven\plugins\maven-project-info-reports-plugin\2.8-SNAPSHOT\maven-project-info-reports-plugin-2.8-SNAPSHOT.jar
[INFO] Installing F:\hudson\hudson-slave\workspace\maven-plugins-ITs-m3-windows\maven-project-info-reports-plugin\pom.xml
to F:\hudson\hudson-slave\workspace\maven-plugins-ITs-m3-windows\maven-shade-plugin\target\local-repo\org\apache\maven\plugins\maven-project-info-reports-plugin\2.8-SNAPSHOT\maven-project-info-reports-plugin-2.8-SNAPSHOT.pom
[INFO] Installing F:\hudson\hudson-slave\workspace\maven-plugins-ITs-m3-windows\maven-remote-resources-plugin\pom.xml
to F:\hudson\hudson-slave\workspace\maven-plugins-ITs-m3-windows\maven-shade-plugin\target\local-repo\org\apache\maven\plugins\maven-remote-resources-plugin\1.6-SNAPSHOT\maven-remote-resources-plugin-1.6-SNAPSHOT.pom
[INFO] Installing F:\hudson\hudson-slave\workspace\maven-plugins-ITs-m3-windows\maven-remote-resources-plugin\target\maven-remote-resources-plugin-1.6-SNAPSHOT.jar
to F:\hudson\hudson-slave\workspace\maven-plugins-ITs-m3-windows\maven-shade-plugin\target\local-repo\org\apache\maven\plugins\maven-remote-resources-plugin\1.6-SNAPSHOT\maven-remote-resources-plugin-1.6-SNAPSHOT.jar
[INFO] Installing F:\hudson\hudson-slave\workspace\maven-plugins-ITs-m3-windows\maven-remote-resources-plugin\pom.xml
to F:\hudson\hudson-slave\workspace\maven-plugins-ITs-m3-windows\maven-shade-plugin\target\local-repo\org\apache\maven\plugins\maven-remote-resources-plugin\1.6-SNAPSHOT\maven-remote-resources-plugin-1.6-SNAPSHOT.pom
[INFO] Installing F:\hudson\hudson-slave\workspace\maven-plugins-ITs-m3-windows\maven-shade-plugin\pom.xml
to F:\hudson\hudson-slave\workspace\maven-plugins-ITs-m3-windows\maven-shade-plugin\target\local-repo\org\apache\maven\plugins\maven-shade-plugin\2.3-SNAPSHOT\maven-shade-plugin-2.3-SNAPSHOT.pom
[INFO] Installing F:\hudson\hudson-slave\workspace\maven-plugins-ITs-m3-windows\maven-shade-plugin\target\maven-shade-plugin-2.3-SNAPSHOT.jar
to F:\hudson\hudson-slave\workspace\maven-plugins-ITs-m3-windows\maven-shade-plugin\target\local-repo\org\apache\maven\plugins\maven-shade-plugin\2.3-SNAPSHOT\maven-shade-plugin-2.3-SNAPSHOT.jar
[INFO] Installing F:\hudson\hudson-slave\workspace\maven-plugins-ITs-m3-windows\maven-shade-plugin\target\maven-shade-plugin-2.3-SNAPSHOT-tests.jar
to F:\hudson\hudson-slave\workspace\maven-plugins-ITs-m3-windows\maven-shade-plugin\target\local-repo\org\apache\maven\plugins\maven-shade-plugin\2.3-SNAPSHOT\maven-shade-plugin-2.3-SNAPSHOT-tests.jar
[INFO] 
[INFO] --- maven-invoker-plugin:1.8:integration-test (integration-test) @ maven-shade-plugin
---
[INFO] Building: artifact-includes-excludes\pom.xml
[INFO] run script verify.bsh
[INFO] ..SUCCESS (9.8 s)
[INFO] Building: attach-after-lifecycle-fork\pom.xml
[INFO] run script setup.bsh
[INFO] run script verify.bsh
[INFO] ..SUCCESS (7.3 s)
[INFO] Building: attached-artifact-type\pom.xml
[INFO] ..SUCCESS (5.0 s)
[INFO] Building: component-descriptor-relocation\pom.xml
[INFO] ..SUCCESS (9.5 s)
[INFO] Building: dep-reduced-pom\pom.xml
[INFO] run script verify.groovy
[INFO] ..SUCCESS (4.9 s)
[INFO] Building: dep-reduced-pom-relocated-result\pom.xml
[INFO] ..SUCCESS (3.7 s)
[INFO] Building: dep-reduced-pom-unique\pom.xml
[INFO] run script verify.groovy
[INFO] ..SUCCESS (5.7 s)
[INFO] Building: dep-reduced-pom-use-base-version\pom.xml
[INFO] run script verify.groovy
[INFO] ..SUCCESS (5.0 s)
[INFO] Building: dep-reduced-pom-with-local-parent\pom.xml
[INFO] ..SUCCESS (3.8 s)
[INFO] Building: duplicate-classes-with-reloc\pom.xml
[INFO] ..SUCCESS (3.9 s)
[INFO] Building: duplicate-classes-without-reloc\pom.xml
[INFO] ..SUCCESS (3.8 s)
[INFO] Building: empty-apache-notice-transform\pom.xml
[INFO] ..SUCCESS (5.1 s)
[INFO] Building: empty-relocation-pattern\pom.xml
[INFO] ..SUCCESS (4.7 s)
[INFO] Building: empty-relocation-shaded-pattern\pom.xml
[INFO] ..SUCCESS (4.9 s)
[INFO] Building: filter-artifact-contents\pom.xml
[INFO] run script verify.bsh
[INFO] ..SUCCESS (5.0 s)
[INFO] Building: finalNameBuild\pom.xml
[INFO] run script setup.bsh
[INFO] run script verify.bsh
[INFO] ..SUCCESS (5.0 s)
[INFO] Building: finalNameBuild-attached\pom.xml
[INFO] run script setup.bsh
[INFO] run script verify.bsh
[INFO] ..SUCCESS (5.0 s)
[INFO] Building: finalNameShade\pom.xml
[INFO] run script setup.bsh
[INFO] run script verify.bsh
[INFO] ..SUCCESS (4.6 s)
[INFO] Building: finalNameShade-attached\pom.xml
[INFO] run script setup.bsh
[INFO] run script verify.bsh
[INFO] ..SUCCESS (4.8 s)
[INFO] Building: implicit-inclusion-of-project-artifact\pom.xml
[INFO] run script verify.bsh
[INFO] ..SUCCESS (5.5 s)
[INFO] Building: manifest-retained\pom.xml
[INFO] run script verify.bsh
[INFO] ..SUCCESS (8.2 s)
[INFO] Building: manifest-transformed\pom.xml
[INFO] run script verify.bsh
[INFO] ..SUCCESS (5.8 s)
[INFO] Building: mini-jar\pom.xml
[INFO] run script verify.bsh
[INFO] ..SUCCESS (5.6 s)
[INFO] Building: mini-jar-malformed-dependencies\pom.xml
[INFO] ..SUCCESS (11.0 s)
[INFO] Building: mini-jar-package-info\pom.xml
[INFO] run script verify.bsh
[INFO] ..SUCCESS (5.7 s)
[INFO] Building: mini-jar-respect-includes\pom.xml
[INFO] run script verify.bsh
[INFO] ..SUCCESS (6.2 s)
[INFO] Building: MSHADE-105\pom.xml
[INFO] run script verify.bsh
[INFO] ..SUCCESS (11.6 s)
[INFO] Building: MSHADE-114\pom.xml
[INFO] ..SUCCESS (5.1 s)
[INFO] Building: mshade-123\pom.xml
[INFO] ..SUCCESS (10.7 s)
[INFO] Building: MSHADE-133\pom.xml
[INFO] run script verify.groovy
[INFO] ..SUCCESS (4.8 s)
[INFO] Building: non-runtime-scope-excluded\pom.xml
[INFO] run script verify.bsh
[INFO] ..SUCCESS (5.3 s)
[INFO] Building: plugin-descriptor-relocation\pom.xml
[INFO] run script verify.groovy
[INFO] ..SUCCESS (12.2 s)
[INFO] Building: pom-packaging\pom.xml
[INFO] run script verify.bsh
[INFO] ..SUCCESS (4.2 s)
[INFO] Building: project-with-reactors-included\pom.xml
[INFO] run script verify.bsh
[INFO] ..SUCCESS (7.2 s)
[INFO] Building: reloc-abs-resource-path\pom.xml
[INFO] ..SUCCESS (9.5 s)
[INFO] Building: reloc-anno\pom.xml
[INFO] ..SUCCESS (4.6 s)
[INFO] Building: reloc-class-from-string-pool\pom.xml
[INFO] ..SUCCESS (4.5 s)
[INFO] Building: reloc-enum-ref-from-anno\pom.xml
[INFO] ..SUCCESS (4.5 s)
[INFO] Building: reloc-includes-excludes\pom.xml
[INFO] run script verify.bsh
[INFO] ..SUCCESS (6.1 s)
[INFO] Building: rerun-with-reloc\pom.xml
[INFO] ..SUCCESS (6.2 s)
[INFO] Building: rerun-without-reloc\pom.xml
[INFO] ..SUCCESS (5.6 s)
[INFO] Building: services-resource-transformer\pom.xml
[INFO] run script verify.bsh
[INFO] ..SUCCESS (5.3 s)
[INFO] Building: shadePomDependency\pom.xml
[INFO] ..SUCCESS (5.6 s)
[INFO] Building: users-shader-impl\pom.xml
[INFO] run script verify.groovy
[INFO] ..SUCCESS (5.7 s)
[INFO] Building: xml-transformer-ignores-dtd\pom.xml
[INFO] run script verify.bsh
[INFO] ..SUCCESS (4.8 s)
[INFO] 
[INFO] --- maven-invoker-plugin:1.8:verify (integration-test) @ maven-shade-plugin ---
[INFO] -------------------------------------------------
[INFO] Build Summary:
[INFO]   Passed: 45, Failed: 0, Errors: 0, Skipped: 0
[INFO] -------------------------------------------------
[INFO] 
[INFO] --- maven-install-plugin:2.3.1:install (default-install) @ maven-shade-plugin ---
[INFO] Installing F:\hudson\hudson-slave\workspace\maven-plugins-ITs-m3-windows\maven-shade-plugin\target\maven-shade-plugin-2.3-SNAPSHOT.jar
to C:\Users\hudson\.m2\repository\org\apache\maven\plugins\maven-shade-plugin\2.3-SNAPSHOT\maven-shade-plugin-2.3-SNAPSHOT.jar
[INFO] Installing F:\hudson\hudson-slave\workspace\maven-plugins-ITs-m3-windows\maven-shade-plugin\pom.xml
to C:\Users\hudson\.m2\repository\org\apache\maven\plugins\maven-shade-plugin\2.3-SNAPSHOT\maven-shade-plugin-2.3-SNAPSHOT.pom
[INFO] Installing F:\hudson\hudson-slave\workspace\maven-plugins-ITs-m3-windows\maven-shade-plugin\target\maven-shade-plugin-2.3-SNAPSHOT-tests.jar
to C:\Users\hudson\.m2\repository\org\apache\maven\plugins\maven-shade-plugin\2.3-SNAPSHOT\maven-shade-plugin-2.3-SNAPSHOT-tests.jar
[INFO]                                                                         
[INFO] ------------------------------------------------------------------------
[INFO] Building Apache Maven Plugins Aggregator 1-SNAPSHOT
[INFO] ------------------------------------------------------------------------
[INFO] 
[INFO] --- maven-clean-plugin:2.4.1:clean (default-clean) @ maven-plugins-aggregator ---
[INFO] Deleting <https://builds.apache.org/job/maven-plugins-ITs-m3-windows/ws/target>
[INFO] 
[INFO] --- maven-remote-resources-plugin:1.1:process (default) @ maven-plugins-aggregator
---
[INFO] Setting property: classpath.resource.loader.class => 'org.codehaus.plexus.velocity.ContextClassLoaderResourceLoader'.
[INFO] Setting property: velocimacro.messages.on => 'false'.
[INFO] Setting property: resource.loader => 'classpath'.
[INFO] Setting property: resource.manager.logwhenfound => 'false'.
[INFO] 
[INFO] --- maven-install-plugin:2.3.1:install (default-install) @ maven-plugins-aggregator
---
[INFO] Installing <https://builds.apache.org/job/maven-plugins-ITs-m3-windows/ws/pom.xml>
to C:\Users\hudson\.m2\repository\org\apache\maven\plugins\maven-plugins-aggregator\1-SNAPSHOT\maven-plugins-aggregator-1-SNAPSHOT.pom
[INFO] ------------------------------------------------------------------------
[INFO] Reactor Summary:
[INFO] 
[INFO] Apache Maven Plugins .............................. SUCCESS [10.051s]
[INFO] Apache Maven ACR Plugin ........................... SUCCESS [40.598s]
[INFO] Apache Maven Ant Plugin ........................... SUCCESS [2:02.510s]
[INFO] Apache Maven AntRun Plugin ........................ SUCCESS [1:20.178s]
[INFO] Apache Maven Eclipse Plugin ....................... SUCCESS [11:29.526s]
[INFO] Apache Maven Assembly Plugin ...................... SUCCESS [14:50.136s]
[INFO] Apache Maven Changelog Plugin ..................... SUCCESS [1:28.306s]
[INFO] Apache Maven Changes Plugin ....................... SUCCESS [1:45.106s]
[INFO] Apache Maven Checkstyle Plugin .................... SUCCESS [2:50.130s]
[INFO] Apache Maven Clean Plugin ......................... SUCCESS [24.934s]
[INFO] Apache Maven Compiler Plugin ...................... SUCCESS [2:12.962s]
[INFO] Apache Maven Dependency Plugin .................... SUCCESS [3:38.554s]
[INFO] Apache Maven Deploy Plugin ........................ SUCCESS [2:13.111s]
[INFO] Apache Maven DOAP Plugin .......................... SUCCESS [10.741s]
[INFO] Apache Maven Documentation Checker Plugin ......... SUCCESS [7.447s]
[INFO] Apache Maven EAR Plugin ........................... SUCCESS [5:53.714s]
[INFO] Apache Maven EJB Plugin ........................... SUCCESS [40.402s]
[INFO] Apache Maven Help Plugin .......................... SUCCESS [1:10.454s]
[INFO] Apache Maven Install Plugin ....................... SUCCESS [1:32.255s]
[INFO] Apache Maven JAR Plugin ........................... SUCCESS [1:41.786s]
[INFO] Apache Maven Jarsigner Plugin ..................... FAILURE [0.392s]
[INFO] Apache Maven Javadoc Plugin ....................... SUCCESS [4:34.975s]
[INFO] Apache Maven Linkcheck Plugin ..................... SUCCESS [3.934s]
[INFO] Apache Maven Patch Plugin ......................... SUCCESS [6.344s]
[INFO] Apache Maven PDF Plugin ........................... SUCCESS [51.946s]
[INFO] Apache Maven PMD Plugin ........................... SUCCESS [2:42.544s]
[INFO] Apache Maven RAR Plugin ........................... SUCCESS [18.605s]
[INFO] Apache Maven Reactor Plugin ....................... SUCCESS [3.303s]
[INFO] Apache Maven Repository Plugin .................... SUCCESS [1:13.357s]
[INFO] Apache Maven Resources Plugin ..................... SUCCESS [1:19.499s]
[INFO] Apache Maven Site Plugin 3 ........................ SUCCESS [10:42.913s]
[INFO] Apache Maven Source Plugin ........................ SUCCESS [1:23.857s]
[INFO] Apache Maven Stage Plugin ......................... SUCCESS [2.911s]
[INFO] Apache Maven Toolchains Plugin .................... SUCCESS [2.193s]
[INFO] Apache Maven Verifier Plugin ...................... SUCCESS [25.938s]
[INFO] Apache Maven WAR Plugin ........................... SUCCESS [1:44.675s]
[INFO] Apache Maven SCM Publish Plugin ................... SUCCESS [1:43.418s]
[INFO] Apache Maven Invoker Plugin ....................... SUCCESS [7:14.429s]
[INFO] Apache Maven Project Info Reports Plugin .......... SUCCESS [4:08.645s]
[INFO] Apache Maven Remote Resources Plugin .............. SUCCESS [1:43.058s]
[INFO] Apache Maven Shade Plugin ......................... SUCCESS [5:15.558s]
[INFO] Apache Maven Plugins Aggregator ................... SUCCESS [0.747s]
[INFO] ------------------------------------------------------------------------
[INFO] BUILD FAILURE
[INFO] ------------------------------------------------------------------------
[INFO] Total time: 1:42:08.762s
[INFO] Finished at: Fri Jan 03 22:18:52 GMT 2014
[INFO] Final Memory: 134M/401M
[INFO] ------------------------------------------------------------------------
[WARNING] The requested profile "apache.snapshots" could not be activated because it does
not exist.
[ERROR] Failed to execute goal on project maven-jarsigner-plugin: Could not resolve dependencies
for project org.apache.maven.plugins:maven-jarsigner-plugin:maven-plugin:1.4-SNAPSHOT: Could
not find artifact org.apache.maven.shared:maven-jarsigner:jar:1.3.1 in central (http://repo.maven.apache.org/maven2)
-> [Help 1]
[ERROR] 
[ERROR] To see the full stack trace of the errors, re-run Maven with the -e switch.
[ERROR] Re-run Maven using the -X switch to enable full debug logging.
[ERROR] 
[ERROR] For more information about the errors and possible solutions, please read the following
articles:
[ERROR] [Help 1] http://cwiki.apache.org/confluence/display/MAVEN/DependencyResolutionException
[ERROR] 
[ERROR] After correcting the problems, you can resume the build with the command
[ERROR]   mvn <goals> -rf :maven-jarsigner-plugin
Build step 'Invoke top-level Maven targets' marked build as failure
Recording test results

Mime
View raw message