maven-notifications mailing list archives

Site index · List index
Message view « Date » · « Thread »
Top « Date » · « Thread »
From Apache Jenkins Server <jenk...@builds.apache.org>
Subject Build failed in Jenkins: maven-site-plugin-2.x » JDK 1.5 (latest),Solaris #83
Date Thu, 02 Jan 2014 01:48:21 GMT
See <https://builds.apache.org/job/maven-site-plugin-2.x/jdk=JDK%201.5%20(latest),label=Solaris/83/>

------------------------------------------
[...truncated 2388 lines...]
4K downloaded  (maven-invoker-2.0.11.pom)
Downloading: http://repo1.maven.org/maven2/org/codehaus/plexus/plexus-utils/1.5.6/plexus-utils-1.5.6.pom
5K downloaded  (plexus-utils-1.5.6.pom)
Downloading: http://repo1.maven.org/maven2/org/codehaus/plexus/plexus/1.0.12/plexus-1.0.12.pom
9K downloaded  (plexus-1.0.12.pom)
Downloading: http://repo1.maven.org/maven2/org/apache/maven/reporting/maven-reporting-impl/2.0.4.1/maven-reporting-impl-2.0.4.1.pom
2K downloaded  (maven-reporting-impl-2.0.4.1.pom)
Downloading: http://repo1.maven.org/maven2/org/apache/maven/maven-project/2.0.4/maven-project-2.0.4.pom
1K downloaded  (maven-project-2.0.4.pom)
Downloading: http://repo1.maven.org/maven2/org/apache/maven/maven/2.0.4/maven-2.0.4.pom
11K downloaded  (maven-2.0.4.pom)
Downloading: http://repo1.maven.org/maven2/org/apache/maven/doxia/doxia-core/1.0-alpha-10/doxia-core-1.0-alpha-10.pom
2K downloaded  (doxia-core-1.0-alpha-10.pom)
Downloading: http://repo1.maven.org/maven2/org/codehaus/plexus/plexus-utils/1.4.5/plexus-utils-1.4.5.pom
2K downloaded  (plexus-utils-1.4.5.pom)
Downloading: http://repo1.maven.org/maven2/org/apache/maven/maven-plugin-api/2.0.4/maven-plugin-api-2.0.4.pom
643b downloaded  (maven-plugin-api-2.0.4.pom)
Downloading: http://repo1.maven.org/maven2/org/apache/maven/reporting/maven-reporting-api/2.0.4/maven-reporting-api-2.0.4.pom
902b downloaded  (maven-reporting-api-2.0.4.pom)
Downloading: http://repo1.maven.org/maven2/org/apache/maven/reporting/maven-reporting/2.0.4/maven-reporting-2.0.4.pom
700b downloaded  (maven-reporting-2.0.4.pom)
Downloading: http://repo1.maven.org/maven2/org/apache/maven/doxia/doxia-site-renderer/1.0-alpha-10/doxia-site-renderer-1.0-alpha-10.pom
4K downloaded  (doxia-site-renderer-1.0-alpha-10.pom)
Downloading: http://repo1.maven.org/maven2/org/apache/maven/doxia/doxia-sitetools/1.0-alpha-10/doxia-sitetools-1.0-alpha-10.pom
7K downloaded  (doxia-sitetools-1.0-alpha-10.pom)
Downloading: http://repo1.maven.org/maven2/org/apache/maven/doxia/doxia-decoration-model/1.0-alpha-10/doxia-decoration-model-1.0-alpha-10.pom
2K downloaded  (doxia-decoration-model-1.0-alpha-10.pom)
Downloading: http://repo1.maven.org/maven2/org/apache/maven/doxia/doxia-module-apt/1.0-alpha-10/doxia-module-apt-1.0-alpha-10.pom
2K downloaded  (doxia-module-apt-1.0-alpha-10.pom)
Downloading: http://repo1.maven.org/maven2/org/apache/maven/doxia/doxia-modules/1.0-alpha-10/doxia-modules-1.0-alpha-10.pom
2K downloaded  (doxia-modules-1.0-alpha-10.pom)
Downloading: http://repo1.maven.org/maven2/org/apache/maven/doxia/doxia-module-fml/1.0-alpha-10/doxia-module-fml-1.0-alpha-10.pom
2K downloaded  (doxia-module-fml-1.0-alpha-10.pom)
Downloading: http://repo1.maven.org/maven2/org/apache/maven/doxia/doxia-module-xdoc/1.0-alpha-10/doxia-module-xdoc-1.0-alpha-10.pom
2K downloaded  (doxia-module-xdoc-1.0-alpha-10.pom)
Downloading: http://repo1.maven.org/maven2/org/apache/maven/doxia/doxia-module-xhtml/1.0-alpha-10/doxia-module-xhtml-1.0-alpha-10.pom
1K downloaded  (doxia-module-xhtml-1.0-alpha-10.pom)
Downloading: http://repo1.maven.org/maven2/org/apache/maven/doxia/doxia-sink-api/1.0-alpha-11/doxia-sink-api-1.0-alpha-11.pom
1K downloaded  (doxia-sink-api-1.0-alpha-11.pom)
Downloading: http://repo1.maven.org/maven2/org/apache/maven/doxia/doxia/1.0-alpha-11/doxia-1.0-alpha-11.pom
9K downloaded  (doxia-1.0-alpha-11.pom)
Downloading: http://repo1.maven.org/maven2/org/apache/maven/doxia/doxia-site-renderer/1.0-alpha-11/doxia-site-renderer-1.0-alpha-11.pom
4K downloaded  (doxia-site-renderer-1.0-alpha-11.pom)
Downloading: http://repo1.maven.org/maven2/org/apache/maven/doxia/doxia-sitetools/1.0-alpha-11/doxia-sitetools-1.0-alpha-11.pom
8K downloaded  (doxia-sitetools-1.0-alpha-11.pom)
Downloading: http://repo1.maven.org/maven2/org/apache/maven/doxia/doxia-core/1.0-alpha-11/doxia-core-1.0-alpha-11.pom
2K downloaded  (doxia-core-1.0-alpha-11.pom)
Downloading: http://repo1.maven.org/maven2/org/apache/maven/doxia/doxia-decoration-model/1.0-alpha-11/doxia-decoration-model-1.0-alpha-11.pom
2K downloaded  (doxia-decoration-model-1.0-alpha-11.pom)
Downloading: http://repo1.maven.org/maven2/org/apache/maven/doxia/doxia-module-apt/1.0-alpha-11/doxia-module-apt-1.0-alpha-11.pom
2K downloaded  (doxia-module-apt-1.0-alpha-11.pom)
Downloading: http://repo1.maven.org/maven2/org/apache/maven/doxia/doxia-modules/1.0-alpha-11/doxia-modules-1.0-alpha-11.pom
2K downloaded  (doxia-modules-1.0-alpha-11.pom)
Downloading: http://repo1.maven.org/maven2/org/apache/maven/doxia/doxia-module-fml/1.0-alpha-11/doxia-module-fml-1.0-alpha-11.pom
2K downloaded  (doxia-module-fml-1.0-alpha-11.pom)
Downloading: http://repo1.maven.org/maven2/org/apache/maven/doxia/doxia-module-xdoc/1.0-alpha-11/doxia-module-xdoc-1.0-alpha-11.pom
2K downloaded  (doxia-module-xdoc-1.0-alpha-11.pom)
Downloading: http://repo1.maven.org/maven2/org/apache/maven/doxia/doxia-module-xhtml/1.0-alpha-11/doxia-module-xhtml-1.0-alpha-11.pom
1K downloaded  (doxia-module-xhtml-1.0-alpha-11.pom)
Downloading: http://repo1.maven.org/maven2/org/codehaus/groovy/groovy/1.5.6/groovy-1.5.6.pom
24K downloaded  (groovy-1.5.6.pom)
Downloading: http://repo1.maven.org/maven2/antlr/antlr/2.7.6/antlr-2.7.6.pom
230b downloaded  (antlr-2.7.6.pom)
Downloading: http://repo1.maven.org/maven2/asm/asm/2.2/asm-2.2.pom
807b downloaded  (asm-2.2.pom)
Downloading: http://repo1.maven.org/maven2/org/apache/ant/ant/1.7.0/ant-1.7.0.pom
9K downloaded  (ant-1.7.0.pom)
Downloading: http://repo1.maven.org/maven2/org/apache/ant/ant-parent/1.7.0/ant-parent-1.7.0.pom
4K downloaded  (ant-parent-1.7.0.pom)
Downloading: http://repo1.maven.org/maven2/org/apache/ant/ant-launcher/1.7.0/ant-launcher-1.7.0.pom
2K downloaded  (ant-launcher-1.7.0.pom)
Downloading: http://repo1.maven.org/maven2/asm/asm-util/2.2/asm-util-2.2.pom
817b downloaded  (asm-util-2.2.pom)
Downloading: http://repo1.maven.org/maven2/asm/asm-analysis/2.2/asm-analysis-2.2.pom
825b downloaded  (asm-analysis-2.2.pom)
Downloading: http://repo1.maven.org/maven2/asm/asm-tree/2.2/asm-tree-2.2.pom
817b downloaded  (asm-tree-2.2.pom)
Downloading: http://repo1.maven.org/maven2/jline/jline/0.9.94/jline-0.9.94.pom
6K downloaded  (jline-0.9.94.pom)
Downloading: http://repo1.maven.org/maven2/org/apache/ant/ant/1.7.1/ant-1.7.1.pom
9K downloaded  (ant-1.7.1.pom)
Downloading: http://repo1.maven.org/maven2/org/apache/ant/ant-parent/1.7.1/ant-parent-1.7.1.pom
4K downloaded  (ant-parent-1.7.1.pom)
Downloading: http://repo1.maven.org/maven2/org/codehaus/plexus/plexus-interpolation/1.2/plexus-interpolation-1.2.pom
2K downloaded  (plexus-interpolation-1.2.pom)
Downloading: http://repo1.maven.org/maven2/asm/asm/2.2/asm-2.2.jar
Downloading: http://repo1.maven.org/maven2/org/apache/maven/doxia/doxia-core/1.0-alpha-10/doxia-core-1.0-alpha-10.jar
Downloading: http://repo1.maven.org/maven2/org/apache/ant/ant/1.7.1/ant-1.7.1.jar
Downloading: http://repo1.maven.org/maven2/org/codehaus/plexus/plexus-utils/1.5.6/plexus-utils-1.5.6.jar
Downloading: http://repo1.maven.org/maven2/org/codehaus/groovy/groovy/1.5.6/groovy-1.5.6.jar
33K downloaded  (asm-2.2.jar)
Downloading: http://repo1.maven.org/maven2/org/apache/maven/shared/maven-invoker/2.0.11/maven-invoker-2.0.11.jar
53K downloaded  (doxia-core-1.0-alpha-10.jar)
28K downloaded  (maven-invoker-2.0.11.jar)
Downloading: http://repo1.maven.org/maven2/org/apache/maven/reporting/maven-reporting-impl/2.0.4.1/maven-reporting-impl-2.0.4.1.jar
244K downloaded  (plexus-utils-1.5.6.jar)
18K downloaded  (maven-reporting-impl-2.0.4.1.jar)
Downloading: http://repo1.maven.org/maven2/jline/jline/0.9.94/jline-0.9.94.jar
Downloading: http://repo1.maven.org/maven2/antlr/antlr/2.7.6/antlr-2.7.6.jar
Downloading: http://repo1.maven.org/maven2/asm/asm-util/2.2/asm-util-2.2.jar
85K downloaded  (jline-0.9.94.jar)
32K downloaded  (asm-util-2.2.jar)
Downloading: http://repo1.maven.org/maven2/org/apache/maven/doxia/doxia-site-renderer/1.0-alpha-11/doxia-site-renderer-1.0-alpha-11.jar
Downloading: http://repo1.maven.org/maven2/asm/asm-analysis/2.2/asm-analysis-2.2.jar
44K downloaded  (doxia-site-renderer-1.0-alpha-11.jar)
17K downloaded  (asm-analysis-2.2.jar)
433K downloaded  (antlr-2.7.6.jar)
Downloading: http://repo1.maven.org/maven2/org/apache/maven/doxia/doxia-decoration-model/1.0-alpha-11/doxia-decoration-model-1.0-alpha-11.jar
Downloading: http://repo1.maven.org/maven2/org/codehaus/plexus/plexus-interpolation/1.2/plexus-interpolation-1.2.jar
Downloading: http://repo1.maven.org/maven2/asm/asm-tree/2.2/asm-tree-2.2.jar
48K downloaded  (doxia-decoration-model-1.0-alpha-11.jar)
15K downloaded  (asm-tree-2.2.jar)
Downloading: http://repo1.maven.org/maven2/org/apache/maven/doxia/doxia-module-apt/1.0-alpha-11/doxia-module-apt-1.0-alpha-11.jar
35K downloaded  (plexus-interpolation-1.2.jar)
45K downloaded  (doxia-module-apt-1.0-alpha-11.jar)
1291K downloaded  (ant-1.7.1.jar)
Downloading: http://repo1.maven.org/maven2/org/apache/ant/ant-launcher/1.7.0/ant-launcher-1.7.0.jar
Downloading: http://repo1.maven.org/maven2/org/apache/maven/doxia/doxia-module-fml/1.0-alpha-11/doxia-module-fml-1.0-alpha-11.jar
11K downloaded  (ant-launcher-1.7.0.jar)
17K downloaded  (doxia-module-fml-1.0-alpha-11.jar)
Downloading: http://repo1.maven.org/maven2/org/apache/maven/doxia/doxia-module-xdoc/1.0-alpha-11/doxia-module-xdoc-1.0-alpha-11.jar
26K downloaded  (doxia-module-xdoc-1.0-alpha-11.jar)
Downloading: http://repo1.maven.org/maven2/org/apache/maven/doxia/doxia-module-xhtml/1.0-alpha-11/doxia-module-xhtml-1.0-alpha-11.jar
2251K downloaded  (groovy-1.5.6.jar)
20K downloaded  (doxia-module-xhtml-1.0-alpha-11.jar)
[INFO] [invoker:install {execution: integration-test}]
[INFO] Installing /zonestorage/hudson_solaris/home/hudson/hudson-slave/workspace/maven-site-plugin-2.x/jdk/JDK
1.5 (latest)/label/Solaris/pom.xml to /zonestorage/hudson_solaris/home/hudson/hudson-slave/workspace/maven-site-plugin-2.x/jdk/JDK
1.5 (latest)/label/Solaris/target/local-repo/org/apache/maven/plugins/maven-site-plugin/2.5-SNAPSHOT/maven-site-plugin-2.5-SNAPSHOT.pom
[INFO] Installing /zonestorage/hudson_solaris/home/hudson/hudson-slave/workspace/maven-site-plugin-2.x/jdk/JDK
1.5 (latest)/label/Solaris/target/maven-site-plugin-2.5-SNAPSHOT.jar to /zonestorage/hudson_solaris/home/hudson/hudson-slave/workspace/maven-site-plugin-2.x/jdk/JDK
1.5 (latest)/label/Solaris/target/local-repo/org/apache/maven/plugins/maven-site-plugin/2.5-SNAPSHOT/maven-site-plugin-2.5-SNAPSHOT.jar
[INFO] [invoker:run {execution: integration-test}]
[INFO] Building: MSITE-512/pom.xml
[INFO] ..SUCCESS (21.3 s)
[INFO] Building: report-changes-generation/pom.xml
[INFO] ..SUCCESS (10.5 s)
[INFO] Building: site-jar/pom.xml
[INFO] ..SUCCESS (10.7 s)
[INFO] Building: it-plugin-test/pom.xml
[INFO] ..SUCCESS (10.0 s)
[INFO] Building: empty-report-set/pom.xml
[INFO] ..SUCCESS (6.2 s)
[INFO] Building: top-parent-no-site/pom.xml
[INFO] ..SUCCESS (13.1 s)
[INFO] Building: MSITE-506/pom.xml
[INFO] ..SUCCESS (28.1 s)
[INFO] Building: MSITE-550/pom.xml
[INFO] ..SUCCESS (11.2 s)
[INFO] Building: surefire-report/pom.xml
[INFO] ..SUCCESS (12.7 s)
[INFO] Building: no-version/pom.xml
[INFO] ..SUCCESS (10.9 s)
[INFO] Building: site-skip/pom.xml
[INFO] ..SUCCESS (11.3 s)
[INFO] Building: MSITE-582/pom.xml
[INFO] ..SUCCESS (12.8 s)
[INFO] Building: emma-plugin-it/pom.xml
[INFO] ..SUCCESS (21.8 s)
[INFO] Building: MSITE-566/pom.xml
[INFO] ..SUCCESS (8.9 s)
[INFO] Building: inheritedMenus/pom.xml
[INFO] ..SUCCESS (15.8 s)
[INFO] Building: MSITE-304/pom.xml
[INFO] ..SUCCESS (10.4 s)
[INFO] Building: MSITE-537/pom.xml
[INFO] ..SUCCESS (11.4 s)
[INFO] Building: site-inheritance/pom.xml
[INFO] ..SUCCESS (13.7 s)
[INFO] Building: MSITE-322/pom.xml
[INFO] ..SUCCESS (15.9 s)
[INFO] Building: MSITE-312/pom.xml
[INFO] ..SUCCESS (12.3 s)
[INFO] Building: MSITE-456/pom.xml
[INFO] ..SUCCESS (10.8 s)
[INFO] Building: MSITE-159/pom.xml
[INFO] ..SUCCESS (9.8 s)
[INFO] Building: MSITE-548/pom.xml
[INFO] ..SUCCESS (12.8 s)
[INFO] Building: MSITE-507/pom.xml
[INFO] ..SUCCESS (56.3 s)
[INFO] Building: full-reporting/pom.xml
[INFO] ..FAILED (29.4 s)
[INFO]   The build exited with code 1. See /zonestorage/hudson_solaris/home/hudson/hudson-slave/workspace/maven-site-plugin-2.x/jdk/JDK
1.5 (latest)/label/Solaris/target/it/full-reporting/build.log for details.
[INFO] Building: site-stage-deploy/pom.xml
[INFO] ..SUCCESS (17.5 s)
[INFO] Building: site-attach-descriptor/pom.xml
[INFO] ..SUCCESS (7.4 s)
[INFO] Building: MSITE-265/pom.xml
[INFO] ..SUCCESS (15.5 s)
[INFO] Building: MSITE-354/pom.xml
[INFO] ..SUCCESS (10.0 s)
[INFO] Building: top-parent-different-site/pom.xml
[INFO] ..SUCCESS (9.9 s)
[INFO] Building: MSITE-504/pom.xml
[INFO] ..SUCCESS (20.6 s)
[INFO] Building: MSITE-497/pom.xml
[INFO] ..SUCCESS (30.7 s)
[INFO] Building: inheritedReports/pom.xml
[INFO] ..SUCCESS (10.8 s)
[INFO] Building: site-deploy/pom.xml
[INFO] ..SUCCESS (9.2 s)
[INFO] Building: MSITE-458/pom.xml
[INFO] ..SUCCESS (18.5 s)
[INFO] Building: interpolation/pom.xml
[INFO] ..SUCCESS (11.8 s)
[INFO] -------------------------------------------------
[INFO] Build Summary:
[INFO]   Passed: 35, Failed: 1, Errors: 0, Skipped: 0
[INFO] -------------------------------------------------
[ERROR] The following builds failed:
[ERROR] *  full-reporting/pom.xml
[INFO] -------------------------------------------------
[INFO] Error for project: Maven Site Plugin 2 (during verify)
[INFO] ------------------------------------------------------------------------
[INFO] : org.apache.maven.plugin.invoker.InvokerSession@6b258d
1 build failed.
[INFO] ------------------------------------------------------------------------
[INFO] Trace
org.apache.maven.BuildFailureException: 1 build failed.
	at org.apache.maven.lifecycle.DefaultLifecycleExecutor.executeGoals(DefaultLifecycleExecutor.java:715)
	at org.apache.maven.lifecycle.DefaultLifecycleExecutor.executeGoalWithLifecycle(DefaultLifecycleExecutor.java:556)
	at org.apache.maven.lifecycle.DefaultLifecycleExecutor.executeGoal(DefaultLifecycleExecutor.java:535)
	at org.apache.maven.lifecycle.DefaultLifecycleExecutor.executeGoalAndHandleFailures(DefaultLifecycleExecutor.java:387)
	at org.apache.maven.lifecycle.DefaultLifecycleExecutor.executeTaskSegments(DefaultLifecycleExecutor.java:348)
	at org.apache.maven.lifecycle.DefaultLifecycleExecutor.execute(DefaultLifecycleExecutor.java:180)
	at org.apache.maven.DefaultMaven.doExecute(DefaultMaven.java:328)
	at org.apache.maven.DefaultMaven.execute(DefaultMaven.java:138)
	at org.apache.maven.cli.MavenCli.main(MavenCli.java:362)
	at org.apache.maven.cli.compat.CompatibleMain.main(CompatibleMain.java:60)
	at sun.reflect.NativeMethodAccessorImpl.invoke0(Native Method)
	at sun.reflect.NativeMethodAccessorImpl.invoke(NativeMethodAccessorImpl.java:39)
	at sun.reflect.DelegatingMethodAccessorImpl.invoke(DelegatingMethodAccessorImpl.java:25)
	at java.lang.reflect.Method.invoke(Method.java:592)
	at org.codehaus.classworlds.Launcher.launchEnhanced(Launcher.java:315)
	at org.codehaus.classworlds.Launcher.launch(Launcher.java:255)
	at org.codehaus.classworlds.Launcher.mainWithExitCode(Launcher.java:430)
	at org.codehaus.classworlds.Launcher.main(Launcher.java:375)
Caused by: org.apache.maven.plugin.MojoFailureException: 1 build failed.
	at org.apache.maven.plugin.invoker.InvokerSession.handleFailures(InvokerSession.java:263)
	at org.apache.maven.plugin.invoker.InvokerMojo.processResults(InvokerMojo.java:58)
	at org.apache.maven.plugin.invoker.AbstractInvokerMojo.execute(AbstractInvokerMojo.java:620)
	at org.apache.maven.plugin.DefaultPluginManager.executeMojo(DefaultPluginManager.java:490)
	at org.apache.maven.lifecycle.DefaultLifecycleExecutor.executeGoals(DefaultLifecycleExecutor.java:694)
	... 17 more
[INFO] ------------------------------------------------------------------------
[INFO] BUILD ERRORS
[INFO] ------------------------------------------------------------------------
[INFO] Total time: 9 minutes 56 seconds
[INFO] Finished at: Thu Jan 02 01:48:52 GMT+00:00 2014
[INFO] Final Memory: 44M/216M
[INFO] ------------------------------------------------------------------------
Build step 'Invoke top-level Maven targets' marked build as failure

Mime
View raw message