maven-notifications mailing list archives

Site index · List index
Message view « Date » · « Thread »
Top « Date » · « Thread »
From Apache Jenkins Server <jenk...@builds.apache.org>
Subject Build failed in Jenkins: maven-skins #188
Date Sun, 08 Dec 2013 15:42:12 GMT
See <https://builds.apache.org/job/maven-skins/188/changes>

Changes:

[hboutemy] added V8 in history

------------------------------------------
[...truncated 279 lines...]
[INFO] run script verify.groovy
[INFO] ..SUCCESS (17.9 s)
[JENKINS] Recording test results
[INFO] 
[INFO] --- maven-invoker-plugin:1.8:verify (integration-test) @ maven-stylus-skin ---
[INFO] -------------------------------------------------
[INFO] Build Summary:
[INFO]   Passed: 3, Failed: 0, Errors: 0, Skipped: 0
[INFO] -------------------------------------------------
[INFO] 
[INFO] --- maven-install-plugin:2.3.1:install (default-install) @ maven-stylus-skin ---
[INFO] Installing F:\jenkins\jenkins-slave\workspace\maven-skins\maven-stylus-skin\target\maven-stylus-skin-1.6-SNAPSHOT.jar
to f:\jenkins\jenkins-slave\maven-repositories\1\org\apache\maven\skins\maven-stylus-skin\1.6-SNAPSHOT\maven-stylus-skin-1.6-SNAPSHOT.jar
[INFO] Installing F:\jenkins\jenkins-slave\workspace\maven-skins\maven-stylus-skin\pom.xml
to f:\jenkins\jenkins-slave\maven-repositories\1\org\apache\maven\skins\maven-stylus-skin\1.6-SNAPSHOT\maven-stylus-skin-1.6-SNAPSHOT.pom
[INFO]                                                                         
[INFO] ------------------------------------------------------------------------
[INFO] Building Apache Maven Fluido Skin 1.4.0-SNAPSHOT
[INFO] ------------------------------------------------------------------------
[INFO] 
[INFO] --- maven-clean-plugin:2.5:clean (default-clean) @ maven-fluido-skin ---
[INFO] Deleting F:\jenkins\jenkins-slave\workspace\maven-skins\maven-fluido-skin\target
[INFO] 
[INFO] --- maven-remote-resources-plugin:1.4:process (default) @ maven-fluido-skin ---
[INFO] 
[INFO] --- maven-minify-plugin:1.3.5:minify (default-minify) @ maven-fluido-skin ---
[INFO] Processing source files [bootstrap-3.0.2.css, maven-base.css, maven-theme.css, prettify.css]
[INFO] Creating merged file [apache-maven-fluido-1.4.0-SNAPSHOT.css]
[INFO] Creating minified file [apache-maven-fluido-1.4.0-SNAPSHOT.min.css]
[INFO] Processing source files [jquery-1.10.2.js, bootstrap-3.0.2.js, prettify.js, fluido.js]
[INFO] Creating merged file [apache-maven-fluido-1.4.0-SNAPSHOT.js]
[INFO] Creating minified file [apache-maven-fluido-1.4.0-SNAPSHOT.min.js]
[INFO] 
[INFO] --- maven-resources-plugin:2.6:resources (default-resources) @ maven-fluido-skin ---
[INFO] Using 'UTF-8' encoding to copy filtered resources.
[INFO] Copying 2 resources to META-INF
[INFO] Copying 34 resources
[INFO] Copying 1 resource
[INFO] Copying 2 resources
[INFO] Copying 3 resources
[INFO] 
[INFO] --- maven-compiler-plugin:3.0:compile (default-compile) @ maven-fluido-skin ---
[INFO] No sources to compile
[INFO] 
[INFO] --- maven-resources-plugin:2.6:testResources (default-testResources) @ maven-fluido-skin
---
[INFO] Using 'UTF-8' encoding to copy filtered resources.
[INFO] skip non existing resourceDirectory F:\jenkins\jenkins-slave\workspace\maven-skins\maven-fluido-skin\src\test\resources
[INFO] Copying 3 resources
[INFO] 
[INFO] --- maven-compiler-plugin:3.0:testCompile (default-testCompile) @ maven-fluido-skin
---
[INFO] No sources to compile
[INFO] 
[INFO] --- maven-surefire-plugin:2.12.4:test (default-test) @ maven-fluido-skin ---
[JENKINS] Recording test results
[INFO] 
[INFO] --- maven-jar-plugin:2.4:jar (default-jar) @ maven-fluido-skin ---
[INFO] Building jar: F:\jenkins\jenkins-slave\workspace\maven-skins\maven-fluido-skin\target\maven-fluido-skin-1.4.0-SNAPSHOT.jar
[INFO] 
[INFO] --- maven-site-plugin:3.3:attach-descriptor (attach-descriptor) @ maven-fluido-skin
---
[INFO] 
[INFO] --- maven-invoker-plugin:1.8:install (integration-test) @ maven-fluido-skin ---
[INFO] Installing F:\jenkins\jenkins-slave\workspace\maven-skins\maven-skins\pom.xml to F:\jenkins\jenkins-slave\workspace\maven-skins\maven-fluido-skin\target\local-repo\org\apache\maven\skins\maven-skins\9-SNAPSHOT\maven-skins-9-SNAPSHOT.pom
[INFO] Installing F:\jenkins\jenkins-slave\workspace\maven-skins\maven-skins\target\maven-skins-9-SNAPSHOT-site.xml
to F:\jenkins\jenkins-slave\workspace\maven-skins\maven-fluido-skin\target\local-repo\org\apache\maven\skins\maven-skins\9-SNAPSHOT\maven-skins-9-SNAPSHOT-site.xml
[INFO] Installing F:\jenkins\jenkins-slave\workspace\maven-skins\maven-application-skin\pom.xml
to F:\jenkins\jenkins-slave\workspace\maven-skins\maven-fluido-skin\target\local-repo\org\apache\maven\skins\maven-application-skin\1.1-SNAPSHOT\maven-application-skin-1.1-SNAPSHOT.pom
[INFO] Installing F:\jenkins\jenkins-slave\workspace\maven-skins\maven-application-skin\target\maven-application-skin-1.1-SNAPSHOT.jar
to F:\jenkins\jenkins-slave\workspace\maven-skins\maven-fluido-skin\target\local-repo\org\apache\maven\skins\maven-application-skin\1.1-SNAPSHOT\maven-application-skin-1.1-SNAPSHOT.jar
[INFO] Installing F:\jenkins\jenkins-slave\workspace\maven-skins\maven-application-skin\pom.xml
to F:\jenkins\jenkins-slave\workspace\maven-skins\maven-fluido-skin\target\local-repo\org\apache\maven\skins\maven-application-skin\1.1-SNAPSHOT\maven-application-skin-1.1-SNAPSHOT.pom
[INFO] Installing F:\jenkins\jenkins-slave\workspace\maven-skins\maven-default-skin\pom.xml
to F:\jenkins\jenkins-slave\workspace\maven-skins\maven-fluido-skin\target\local-repo\org\apache\maven\skins\maven-default-skin\1.2-SNAPSHOT\maven-default-skin-1.2-SNAPSHOT.pom
[INFO] Installing F:\jenkins\jenkins-slave\workspace\maven-skins\maven-default-skin\target\maven-default-skin-1.2-SNAPSHOT.jar
to F:\jenkins\jenkins-slave\workspace\maven-skins\maven-fluido-skin\target\local-repo\org\apache\maven\skins\maven-default-skin\1.2-SNAPSHOT\maven-default-skin-1.2-SNAPSHOT.jar
[INFO] Installing F:\jenkins\jenkins-slave\workspace\maven-skins\maven-default-skin\pom.xml
to F:\jenkins\jenkins-slave\workspace\maven-skins\maven-fluido-skin\target\local-repo\org\apache\maven\skins\maven-default-skin\1.2-SNAPSHOT\maven-default-skin-1.2-SNAPSHOT.pom
[INFO] Installing F:\jenkins\jenkins-slave\workspace\maven-skins\maven-classic-skin\pom.xml
to F:\jenkins\jenkins-slave\workspace\maven-skins\maven-fluido-skin\target\local-repo\org\apache\maven\skins\maven-classic-skin\1.2-SNAPSHOT\maven-classic-skin-1.2-SNAPSHOT.pom
[INFO] Installing F:\jenkins\jenkins-slave\workspace\maven-skins\maven-classic-skin\target\maven-classic-skin-1.2-SNAPSHOT.jar
to F:\jenkins\jenkins-slave\workspace\maven-skins\maven-fluido-skin\target\local-repo\org\apache\maven\skins\maven-classic-skin\1.2-SNAPSHOT\maven-classic-skin-1.2-SNAPSHOT.jar
[INFO] Installing F:\jenkins\jenkins-slave\workspace\maven-skins\maven-classic-skin\pom.xml
to F:\jenkins\jenkins-slave\workspace\maven-skins\maven-fluido-skin\target\local-repo\org\apache\maven\skins\maven-classic-skin\1.2-SNAPSHOT\maven-classic-skin-1.2-SNAPSHOT.pom
[INFO] Installing F:\jenkins\jenkins-slave\workspace\maven-skins\maven-stylus-skin\pom.xml
to F:\jenkins\jenkins-slave\workspace\maven-skins\maven-fluido-skin\target\local-repo\org\apache\maven\skins\maven-stylus-skin\1.6-SNAPSHOT\maven-stylus-skin-1.6-SNAPSHOT.pom
[INFO] Installing F:\jenkins\jenkins-slave\workspace\maven-skins\maven-stylus-skin\target\maven-stylus-skin-1.6-SNAPSHOT.jar
to F:\jenkins\jenkins-slave\workspace\maven-skins\maven-fluido-skin\target\local-repo\org\apache\maven\skins\maven-stylus-skin\1.6-SNAPSHOT\maven-stylus-skin-1.6-SNAPSHOT.jar
[INFO] Installing F:\jenkins\jenkins-slave\workspace\maven-skins\maven-stylus-skin\pom.xml
to F:\jenkins\jenkins-slave\workspace\maven-skins\maven-fluido-skin\target\local-repo\org\apache\maven\skins\maven-stylus-skin\1.6-SNAPSHOT\maven-stylus-skin-1.6-SNAPSHOT.pom
[INFO] Installing F:\jenkins\jenkins-slave\workspace\maven-skins\maven-fluido-skin\pom.xml
to F:\jenkins\jenkins-slave\workspace\maven-skins\maven-fluido-skin\target\local-repo\org\apache\maven\skins\maven-fluido-skin\1.4.0-SNAPSHOT\maven-fluido-skin-1.4.0-SNAPSHOT.pom
[INFO] Installing F:\jenkins\jenkins-slave\workspace\maven-skins\maven-fluido-skin\target\maven-fluido-skin-1.4.0-SNAPSHOT.jar
to F:\jenkins\jenkins-slave\workspace\maven-skins\maven-fluido-skin\target\local-repo\org\apache\maven\skins\maven-fluido-skin\1.4.0-SNAPSHOT\maven-fluido-skin-1.4.0-SNAPSHOT.jar
[INFO] 
[INFO] --- maven-invoker-plugin:1.8:integration-test (integration-test) @ maven-fluido-skin
---
[INFO] Building: mskins-10\pom.xml
[INFO] run script verify.groovy
[INFO] ..SUCCESS (21.0 s)
[INFO] Building: mskins-13\pom.xml
[INFO] run script verify.groovy
[INFO] ..SUCCESS (11.5 s)
[INFO] Building: mskins-14\pom.xml
[INFO] ..SUCCESS (11.7 s)
[INFO] Building: mskins-14_sitesearch\pom.xml
[INFO] ..SUCCESS (11.6 s)
[INFO] Building: mskins-15\pom.xml
[INFO] ..SUCCESS (11.7 s)
[INFO] Building: mskins-16\pom.xml
[INFO] ..SUCCESS (11.6 s)
[INFO] Building: mskins-17\pom.xml
[INFO] run script verify.groovy
[INFO] ..SUCCESS (11.7 s)
[INFO] Building: mskins-21\pom.xml
[INFO] ..SUCCESS (17.3 s)
[INFO] Building: mskins-22\pom.xml
[INFO] ..SUCCESS (14.1 s)
[INFO] Building: mskins-22_default\pom.xml
[INFO] ..SUCCESS (13.8 s)
[INFO] Building: mskins-22_topbar\pom.xml
[INFO] ..SUCCESS (13.2 s)
[INFO] Building: mskins-23\pom.xml
[INFO] ..SUCCESS (14.1 s)
[INFO] Building: mskins-24\pom.xml
[INFO] ..SUCCESS (14.2 s)
[INFO] Building: mskins-24_topbar\pom.xml
[INFO] ..SUCCESS (13.2 s)
[INFO] Building: mskins-25\pom.xml
[INFO] ..SUCCESS (13.8 s)
[INFO] Building: mskins-28\pom.xml
[INFO] ..SUCCESS (8.6 s)
[INFO] Building: mskins-31\pom.xml
[INFO] ..SUCCESS (12.4 s)
[INFO] Building: mskins-33\pom.xml
[INFO] ..SUCCESS (14.1 s)
[INFO] Building: mskins-33_topbar\pom.xml
[INFO] ..SUCCESS (13.1 s)
[INFO] Building: mskins-34\pom.xml
[INFO] ..SUCCESS (13.9 s)
[INFO] Building: mskins-34_topbar\pom.xml
[INFO] ..SUCCESS (13.6 s)
[INFO] Building: mskins-41\pom.xml
[INFO] ..SUCCESS (8.7 s)
[INFO] Building: mskins-47\pom.xml
[INFO] run script verify.groovy
[INFO] ..SUCCESS (11.5 s)
[INFO] Building: mskins-72\pom.xml
[INFO] run script verify.groovy
[INFO] ..SUCCESS (13.7 s)
[INFO] Building: mskins-75\pom.xml
[INFO] run script verify.groovy
[INFO] ..SUCCESS (14.0 s)
[INFO] Building: mskins-76\pom.xml
[INFO] run script verify.groovy
[INFO] ..SUCCESS (13.8 s)
[INFO] Building: mskins-76_topbar\pom.xml
[INFO] run script verify.groovy
[INFO] ..SUCCESS (13.2 s)
[INFO] Building: mskins-85\pom.xml
[INFO] ..SUCCESS (13.8 s)
[INFO] Building: sidebar\pom.xml
[INFO] ..SUCCESS (13.7 s)
[INFO] Building: topbar\pom.xml
[INFO] ..SUCCESS (14.0 s)
[INFO] Building: topbar-inverse\pom.xml
[INFO] ..SUCCESS (14.0 s)
[JENKINS] Recording test results
[INFO] 
[INFO] --- maven-invoker-plugin:1.8:verify (integration-test) @ maven-fluido-skin ---
[INFO] -------------------------------------------------
[INFO] Build Summary:
[INFO]   Passed: 31, Failed: 0, Errors: 0, Skipped: 0
[INFO] -------------------------------------------------
[INFO] 
[INFO] --- maven-install-plugin:2.3.1:install (default-install) @ maven-fluido-skin ---
[INFO] Installing F:\jenkins\jenkins-slave\workspace\maven-skins\maven-fluido-skin\target\maven-fluido-skin-1.4.0-SNAPSHOT.jar
to f:\jenkins\jenkins-slave\maven-repositories\1\org\apache\maven\skins\maven-fluido-skin\1.4.0-SNAPSHOT\maven-fluido-skin-1.4.0-SNAPSHOT.jar
[INFO] Installing F:\jenkins\jenkins-slave\workspace\maven-skins\maven-fluido-skin\pom.xml
to f:\jenkins\jenkins-slave\maven-repositories\1\org\apache\maven\skins\maven-fluido-skin\1.4.0-SNAPSHOT\maven-fluido-skin-1.4.0-SNAPSHOT.pom
[INFO]                                                                         
[INFO] ------------------------------------------------------------------------
[INFO] Building Maven Skins Aggregator 1-SNAPSHOT
[INFO] ------------------------------------------------------------------------
[INFO] 
[INFO] --- maven-clean-plugin:2.4.1:clean (default-clean) @ maven-skins-aggregator ---
[INFO] Deleting <https://builds.apache.org/job/maven-skins/ws/target>
[INFO] 
[INFO] --- maven-remote-resources-plugin:1.2.1:process (default) @ maven-skins-aggregator
---
[INFO] 
[INFO] --- maven-site-plugin:3.0:attach-descriptor (attach-descriptor) @ maven-skins-aggregator
---
[INFO] 
[INFO] --- maven-install-plugin:2.3.1:install (default-install) @ maven-skins-aggregator ---
[INFO] Installing <https://builds.apache.org/job/maven-skins/ws/pom.xml> to f:\jenkins\jenkins-slave\maven-repositories\1\org\apache\maven\skins\maven-skins-aggregator\1-SNAPSHOT\maven-skins-aggregator-1-SNAPSHOT.pom
[INFO] Installing <https://builds.apache.org/job/maven-skins/ws/target\maven-skins-aggregator-1-SNAPSHOT-site.xml>
to f:\jenkins\jenkins-slave\maven-repositories\1\org\apache\maven\skins\maven-skins-aggregator\1-SNAPSHOT\maven-skins-aggregator-1-SNAPSHOT-site.xml
[INFO] ------------------------------------------------------------------------
[INFO] Reactor Summary:
[INFO] 
[INFO] Maven Skins ....................................... SUCCESS [8.981s]
[INFO] Maven Application Skin ............................ SUCCESS [28.619s]
[INFO] Maven Default Skin ................................ SUCCESS [27.431s]
[INFO] Maven Classic Skin ................................ SUCCESS [27.473s]
[INFO] Maven Stylus Skin ................................. SUCCESS [50.379s]
[INFO] Apache Maven Fluido Skin .......................... SUCCESS [7:01.205s]
[INFO] Maven Skins Aggregator ............................ SUCCESS [2.210s]
[INFO] ------------------------------------------------------------------------
[INFO] BUILD SUCCESS
[INFO] ------------------------------------------------------------------------
[INFO] Total time: 9:32.240s
[INFO] Finished at: Sun Dec 08 07:42:06 PST 2013
[INFO] Final Memory: 36M/87M
[INFO] ------------------------------------------------------------------------
Waiting for Jenkins to finish collecting data
[JENKINS] Archiving F:\jenkins\jenkins-slave\workspace\maven-skins\maven-fluido-skin\pom.xml
to org.apache.maven.skins/maven-fluido-skin/1.4.0-SNAPSHOT/maven-fluido-skin-1.4.0-SNAPSHOT.pom
[JENKINS] Archiving F:\jenkins\jenkins-slave\workspace\maven-skins\maven-fluido-skin\target\maven-fluido-skin-1.4.0-SNAPSHOT.jar
to org.apache.maven.skins/maven-fluido-skin/1.4.0-SNAPSHOT/maven-fluido-skin-1.4.0-SNAPSHOT.jar
[JENKINS] Archiving F:\jenkins\jenkins-slave\workspace\maven-skins\maven-skins\pom.xml to
org.apache.maven.skins/maven-skins/9-SNAPSHOT/maven-skins-9-SNAPSHOT.pom
[JENKINS] Archiving F:\jenkins\jenkins-slave\workspace\maven-skins\maven-skins\target\maven-skins-9-SNAPSHOT-site.xml
to org.apache.maven.skins/maven-skins/9-SNAPSHOT/maven-skins-9-SNAPSHOT-site.xml
[JENKINS] Archiving F:\jenkins\jenkins-slave\workspace\maven-skins\maven-default-skin\pom.xml
to org.apache.maven.skins/maven-default-skin/1.2-SNAPSHOT/maven-default-skin-1.2-SNAPSHOT.pom
[JENKINS] Archiving F:\jenkins\jenkins-slave\workspace\maven-skins\maven-default-skin\target\maven-default-skin-1.2-SNAPSHOT.jar
to org.apache.maven.skins/maven-default-skin/1.2-SNAPSHOT/maven-default-skin-1.2-SNAPSHOT.jar
[JENKINS] Archiving F:\jenkins\jenkins-slave\workspace\maven-skins\maven-application-skin\pom.xml
to org.apache.maven.skins/maven-application-skin/1.1-SNAPSHOT/maven-application-skin-1.1-SNAPSHOT.pom
[JENKINS] Archiving F:\jenkins\jenkins-slave\workspace\maven-skins\maven-application-skin\target\maven-application-skin-1.1-SNAPSHOT.jar
to org.apache.maven.skins/maven-application-skin/1.1-SNAPSHOT/maven-application-skin-1.1-SNAPSHOT.jar
[JENKINS] Archiving F:\jenkins\jenkins-slave\workspace\maven-skins\maven-stylus-skin\pom.xml
to org.apache.maven.skins/maven-stylus-skin/1.6-SNAPSHOT/maven-stylus-skin-1.6-SNAPSHOT.pom
[JENKINS] Archiving F:\jenkins\jenkins-slave\workspace\maven-skins\maven-stylus-skin\target\maven-stylus-skin-1.6-SNAPSHOT.jar
to org.apache.maven.skins/maven-stylus-skin/1.6-SNAPSHOT/maven-stylus-skin-1.6-SNAPSHOT.jar
[JENKINS] Archiving F:\jenkins\jenkins-slave\workspace\maven-skins\maven-classic-skin\pom.xml
to org.apache.maven.skins/maven-classic-skin/1.2-SNAPSHOT/maven-classic-skin-1.2-SNAPSHOT.pom
[JENKINS] Archiving F:\jenkins\jenkins-slave\workspace\maven-skins\maven-classic-skin\target\maven-classic-skin-1.2-SNAPSHOT.jar
to org.apache.maven.skins/maven-classic-skin/1.2-SNAPSHOT/maven-classic-skin-1.2-SNAPSHOT.jar
[JENKINS] Archiving <https://builds.apache.org/job/maven-skins/ws/pom.xml> to org.apache.maven.skins/maven-skins-aggregator/1-SNAPSHOT/maven-skins-aggregator-1-SNAPSHOT.pom
[JENKINS] Archiving <https://builds.apache.org/job/maven-skins/ws/target\maven-skins-aggregator-1-SNAPSHOT-site.xml>
to org.apache.maven.skins/maven-skins-aggregator/1-SNAPSHOT/maven-skins-aggregator-1-SNAPSHOT-site.xml
channel stopped
Maven RedeployPublisher use remote windows2 maven settings from : f:\jenkins\jenkins-slave\tools\hudson.tasks.Maven_MavenInstallation\Maven_3.0.5/conf/settings.xml
[INFO] Deployment in https://repository.apache.org/content/repositories/snapshots (id=apache.snapshots.https,uniqueVersion=true)
Deploying the main artifact jenkins-1933519500294687125maven-application-skin-1.1-SNAPSHOT.jar
Downloading: https://repository.apache.org/content/repositories/snapshots/org/apache/maven/skins/maven-application-skin/1.1-SNAPSHOT/maven-metadata.xml
Downloaded: https://repository.apache.org/content/repositories/snapshots/org/apache/maven/skins/maven-application-skin/1.1-SNAPSHOT/maven-metadata.xml
(791 B at 0.2 KB/sec)
Uploading: https://repository.apache.org/content/repositories/snapshots/org/apache/maven/skins/maven-application-skin/1.1-SNAPSHOT/maven-application-skin-1.1-20131208.154212-82.jar
Uploading: https://repository.apache.org/content/repositories/snapshots/org/apache/maven/skins/maven-application-skin/1.1-SNAPSHOT/maven-application-skin-1.1-20131208.154212-82.pom
ERROR: Failed to deploy artifacts: Could not transfer artifact org.apache.maven.skins:maven-application-skin:jar:1.1-20131208.154212-82
from/to apache.snapshots.https (https://repository.apache.org/content/repositories/snapshots):
Failed to transfer file: https://repository.apache.org/content/repositories/snapshots/org/apache/maven/skins/maven-application-skin/1.1-SNAPSHOT/maven-application-skin-1.1-20131208.154212-82.jar.
Return code is: 401, ReasonPhrase: Unauthorized.
org.apache.maven.artifact.deployer.ArtifactDeploymentException: Failed to deploy artifacts:
Could not transfer artifact org.apache.maven.skins:maven-application-skin:jar:1.1-20131208.154212-82
from/to apache.snapshots.https (https://repository.apache.org/content/repositories/snapshots):
Failed to transfer file: https://repository.apache.org/content/repositories/snapshots/org/apache/maven/skins/maven-application-skin/1.1-SNAPSHOT/maven-application-skin-1.1-20131208.154212-82.jar.
Return code is: 401, ReasonPhrase: Unauthorized.
	at org.apache.maven.artifact.deployer.DefaultArtifactDeployer.deploy(DefaultArtifactDeployer.java:143)
	at hudson.maven.reporters.MavenArtifactRecord.deploy(MavenArtifactRecord.java:191)
	at hudson.maven.RedeployPublisher.perform(RedeployPublisher.java:176)
	at hudson.tasks.BuildStepMonitor$1.perform(BuildStepMonitor.java:20)
	at hudson.model.AbstractBuild$AbstractBuildExecution.perform(AbstractBuild.java:785)
	at hudson.model.AbstractBuild$AbstractBuildExecution.performAllBuildSteps(AbstractBuild.java:757)
	at hudson.maven.MavenModuleSetBuild$MavenModuleSetBuildExecution.post2(MavenModuleSetBuild.java:1020)
	at hudson.model.AbstractBuild$AbstractBuildExecution.post(AbstractBuild.java:706)
	at hudson.model.Run.execute(Run.java:1702)
	at hudson.maven.MavenModuleSetBuild.run(MavenModuleSetBuild.java:509)
	at hudson.model.ResourceController.execute(ResourceController.java:88)
	at hudson.model.Executor.run(Executor.java:231)
Caused by: org.eclipse.aether.deployment.DeploymentException: Failed to deploy artifacts:
Could not transfer artifact org.apache.maven.skins:maven-application-skin:jar:1.1-20131208.154212-82
from/to apache.snapshots.https (https://repository.apache.org/content/repositories/snapshots):
Failed to transfer file: https://repository.apache.org/content/repositories/snapshots/org/apache/maven/skins/maven-application-skin/1.1-SNAPSHOT/maven-application-skin-1.1-20131208.154212-82.jar.
Return code is: 401, ReasonPhrase: Unauthorized.
	at org.eclipse.aether.internal.impl.DefaultDeployer.deploy(DefaultDeployer.java:341)
	at org.eclipse.aether.internal.impl.DefaultDeployer.deploy(DefaultDeployer.java:269)
	at org.eclipse.aether.internal.impl.DefaultRepositorySystem.deploy(DefaultRepositorySystem.java:413)
	at org.apache.maven.artifact.deployer.DefaultArtifactDeployer.deploy(DefaultArtifactDeployer.java:139)
	... 11 more
Caused by: org.eclipse.aether.transfer.ArtifactTransferException: Could not transfer artifact
org.apache.maven.skins:maven-application-skin:jar:1.1-20131208.154212-82 from/to apache.snapshots.https
(https://repository.apache.org/content/repositories/snapshots): Failed to transfer file: https://repository.apache.org/content/repositories/snapshots/org/apache/maven/skins/maven-application-skin/1.1-SNAPSHOT/maven-application-skin-1.1-20131208.154212-82.jar.
Return code is: 401, ReasonPhrase: Unauthorized.
	at org.eclipse.aether.connector.wagon.WagonRepositoryConnector$6.wrap(WagonRepositoryConnector.java:1016)
	at org.eclipse.aether.connector.wagon.WagonRepositoryConnector$6.wrap(WagonRepositoryConnector.java:1004)
	at org.eclipse.aether.connector.wagon.WagonRepositoryConnector$PutTask.run(WagonRepositoryConnector.java:895)
	at org.eclipse.aether.connector.wagon.WagonRepositoryConnector.put(WagonRepositoryConnector.java:522)
	at org.eclipse.aether.internal.impl.DefaultDeployer.deploy(DefaultDeployer.java:335)
	... 14 more
Caused by: org.apache.maven.wagon.TransferFailedException: Failed to transfer file: https://repository.apache.org/content/repositories/snapshots/org/apache/maven/skins/maven-application-skin/1.1-SNAPSHOT/maven-application-skin-1.1-20131208.154212-82.jar.
Return code is: 401, ReasonPhrase: Unauthorized.
	at org.apache.maven.wagon.shared.http4.AbstractHttpClientWagon.put(AbstractHttpClientWagon.java:626)
	at org.apache.maven.wagon.shared.http4.AbstractHttpClientWagon.put(AbstractHttpClientWagon.java:524)
	at org.apache.maven.wagon.shared.http4.AbstractHttpClientWagon.put(AbstractHttpClientWagon.java:505)
	at org.apache.maven.wagon.shared.http4.AbstractHttpClientWagon.put(AbstractHttpClientWagon.java:485)
	at org.eclipse.aether.connector.wagon.WagonRepositoryConnector$PutTask.run(WagonRepositoryConnector.java:871)
	... 16 more
[INFO] Deployment failed after 4.3 sec
Build step 'Deploy artifacts to Maven repository' changed build result to FAILURE

Mime
View raw message