maven-notifications mailing list archives

Site index · List index
Message view « Date » · « Thread »
Top « Date » · « Thread »
From Apache Jenkins Server <jenk...@builds.apache.org>
Subject Build failed in Jenkins: maven-plugins-windows #351
Date Sun, 29 Dec 2013 21:55:56 GMT
See <https://builds.apache.org/job/maven-plugins-windows/351/changes>

Changes:

[tchemit] [maven-release-plugin] prepare for next development iteration

[tchemit] [maven-release-plugin] prepare release maven-jarsigner-plugin-1.3

[tchemit] MJARSIGNER-27 - Use maven-jarsigner 1.3

[tchemit] MJARSIGNER-13 - signing in multi-module project fails on windows

[tchemit] MJARSIGNER-32 - Update requirements to maven 2.1.0

[tchemit] MJARSIGNER-24 - Use Password Encryption in pom.xml
add doc + make site generation possible

[tchemit] MJARSIGNER-27 - Use maven-jarsigner 1.3

------------------------------------------
[...truncated 6599 lines...]
Tests run: 4, Failures: 0, Errors: 0, Skipped: 0, Time elapsed: 2.362 sec
Running org.apache.maven.plugins.shade.relocation.SimpleRelocatorParameterTest
Tests run: 2, Failures: 0, Errors: 0, Skipped: 0, Time elapsed: 0 sec
Running org.apache.maven.plugins.shade.relocation.SimpleRelocatorTest
Tests run: 7, Failures: 0, Errors: 0, Skipped: 0, Time elapsed: 0 sec
Running org.apache.maven.plugins.shade.resource.ApacheLicenseResourceTransformerTest
Tests run: 1, Failures: 0, Errors: 0, Skipped: 0, Time elapsed: 0.001 sec
Running org.apache.maven.plugins.shade.resource.ApacheNoticeResourceTransformerTest
Tests run: 1, Failures: 0, Errors: 0, Skipped: 0, Time elapsed: 0 sec
Running org.apache.maven.plugins.shade.resource.AppendingTransformerTest
Tests run: 1, Failures: 0, Errors: 0, Skipped: 0, Time elapsed: 0.013 sec
Running org.apache.maven.plugins.shade.resource.ComponentsXmlResourceTransformerTest
Tests run: 1, Failures: 0, Errors: 0, Skipped: 0, Time elapsed: 0.167 sec
Running org.apache.maven.plugins.shade.resource.XmlAppendingTransformerTest
Tests run: 1, Failures: 0, Errors: 0, Skipped: 0, Time elapsed: 0 sec

Results :

Tests run: 27, Failures: 0, Errors: 0, Skipped: 0

[JENKINS] Recording test results
[INFO] 
[INFO] --- maven-jar-plugin:2.4:jar (default-jar) @ maven-shade-plugin ---
[INFO] Building jar: F:\hudson\hudson-slave\workspace\maven-plugins-windows\maven-shade-plugin\target\maven-shade-plugin-2.3-SNAPSHOT.jar
[INFO] 
[INFO] --- maven-plugin-plugin:3.2:addPluginArtifactMetadata (default-addPluginArtifactMetadata)
@ maven-shade-plugin ---
[INFO] 
[INFO] --- maven-install-plugin:2.3.1:install (default-install) @ maven-shade-plugin ---
[INFO] Installing F:\hudson\hudson-slave\workspace\maven-plugins-windows\maven-shade-plugin\target\maven-shade-plugin-2.3-SNAPSHOT.jar
to f:\hudson\hudson-slave\maven-repositories\0\org\apache\maven\plugins\maven-shade-plugin\2.3-SNAPSHOT\maven-shade-plugin-2.3-SNAPSHOT.jar
[INFO] Installing F:\hudson\hudson-slave\workspace\maven-plugins-windows\maven-shade-plugin\pom.xml
to f:\hudson\hudson-slave\maven-repositories\0\org\apache\maven\plugins\maven-shade-plugin\2.3-SNAPSHOT\maven-shade-plugin-2.3-SNAPSHOT.pom
[INFO] 1 archive(s) processed
[INFO] 
[INFO] --- maven-jarsigner-plugin:1.2:verify (verify) @ maven-project-info-reports-plugin
---
[INFO] 1 archive(s) processed
[INFO] 
[INFO] --- maven-install-plugin:2.3.1:install (default-install) @ maven-project-info-reports-plugin
---
[INFO] Installing F:\hudson\hudson-slave\workspace\maven-plugins-windows\maven-project-info-reports-plugin\target\maven-project-info-reports-plugin-2.8-SNAPSHOT.jar
to f:\hudson\hudson-slave\maven-repositories\0\org\apache\maven\plugins\maven-project-info-reports-plugin\2.8-SNAPSHOT\maven-project-info-reports-plugin-2.8-SNAPSHOT.jar
[INFO] Installing F:\hudson\hudson-slave\workspace\maven-plugins-windows\maven-project-info-reports-plugin\pom.xml
to f:\hudson\hudson-slave\maven-repositories\0\org\apache\maven\plugins\maven-project-info-reports-plugin\2.8-SNAPSHOT\maven-project-info-reports-plugin-2.8-SNAPSHOT.pom
[INFO]                                                                         
[INFO] ------------------------------------------------------------------------
[INFO] Building Apache Maven Plugins Aggregator 1-SNAPSHOT
[INFO] ------------------------------------------------------------------------
[WARNING] *****************************************************************
[WARNING] * Your build is requesting parallel execution, but project      *
[WARNING] * contains the following plugin(s) that are not marked as       *
[WARNING] * @threadSafe to support parallel building.                     *
[WARNING] * While this /may/ work fine, please look for plugin updates    *
[WARNING] * and/or request plugins be made thread-safe.                   *
[WARNING] * If reporting an issue, report it against the plugin in        *
[WARNING] * question, not against maven-core                              *
[WARNING] *****************************************************************
[WARNING] The following plugins are not marked @threadSafe in Apache Maven Plugins Aggregator:
[WARNING] org.apache.maven.plugins:maven-remote-resources-plugin:1.1
[WARNING] *****************************************************************
[INFO] 
[INFO] --- maven-clean-plugin:2.4.1:clean (default-clean) @ maven-plugins-aggregator ---
[INFO] Deleting <https://builds.apache.org/job/maven-plugins-windows/ws/target>
[INFO] 
[INFO] --- maven-remote-resources-plugin:1.1:process (default) @ maven-plugins-aggregator
---
[INFO] Setting property: classpath.resource.loader.class => 'org.codehaus.plexus.velocity.ContextClassLoaderResourceLoader'.
[INFO] Setting property: velocimacro.messages.on => 'false'.
[INFO] Setting property: resource.loader => 'classpath'.
[INFO] Setting property: resource.manager.logwhenfound => 'false'.
[INFO] 
[INFO] --- maven-install-plugin:2.3.1:install (default-install) @ maven-plugins-aggregator
---
[INFO] Installing <https://builds.apache.org/job/maven-plugins-windows/ws/pom.xml> to
f:\hudson\hudson-slave\maven-repositories\0\org\apache\maven\plugins\maven-plugins-aggregator\1-SNAPSHOT\maven-plugins-aggregator-1-SNAPSHOT.pom
[INFO] ------------------------------------------------------------------------
[INFO] Reactor Summary:
[INFO] 
[INFO] Apache Maven Plugins .............................. SUCCESS [28.907s]
[INFO] Apache Maven ACR Plugin ........................... SUCCESS [36.244s]
[INFO] Apache Maven Ant Plugin ........................... SUCCESS [46.377s]
[INFO] Apache Maven AntRun Plugin ........................ SUCCESS [10.514s]
[INFO] Apache Maven Eclipse Plugin ....................... SUCCESS [2:22.691s]
[INFO] Apache Maven Assembly Plugin ...................... SUCCESS [1:31.361s]
[INFO] Apache Maven Changelog Plugin ..................... SUCCESS [1:28.369s]
[INFO] Apache Maven Changes Plugin ....................... SUCCESS [44.081s]
[INFO] Apache Maven Checkstyle Plugin .................... SUCCESS [34.308s]
[INFO] Apache Maven Clean Plugin ......................... SUCCESS [13.522s]
[INFO] Apache Maven Compiler Plugin ...................... SUCCESS [23.970s]
[INFO] Apache Maven Dependency Plugin .................... SUCCESS [1:24.380s]
[INFO] Apache Maven Deploy Plugin ........................ SUCCESS [15.580s]
[INFO] Apache Maven DOAP Plugin .......................... SUCCESS [39.972s]
[INFO] Apache Maven Documentation Checker Plugin ......... SUCCESS [12.447s]
[INFO] Apache Maven EAR Plugin ........................... SUCCESS [29.737s]
[INFO] Apache Maven EJB Plugin ........................... SUCCESS [13.903s]
[INFO] Apache Maven Help Plugin .......................... SUCCESS [16.540s]
[INFO] Apache Maven Install Plugin ....................... SUCCESS [16.517s]
[INFO] Apache Maven JAR Plugin ........................... SUCCESS [10.162s]
[INFO] Apache Maven Jarsigner Plugin ..................... FAILURE [6.242s]
[INFO] Apache Maven Javadoc Plugin ....................... SUCCESS [3:38.787s]
[INFO] Apache Maven Linkcheck Plugin ..................... SUCCESS [9.416s]
[INFO] Apache Maven Patch Plugin ......................... SUCCESS [7.362s]
[INFO] Apache Maven PDF Plugin ........................... SUCCESS [44.795s]
[INFO] Apache Maven PMD Plugin ........................... SUCCESS [50.383s]
[INFO] Apache Maven RAR Plugin ........................... SUCCESS [19.029s]
[INFO] Apache Maven Reactor Plugin ....................... SUCCESS [10.459s]
[INFO] Apache Maven Repository Plugin .................... SUCCESS [14.324s]
[INFO] Apache Maven Resources Plugin ..................... SUCCESS [15.847s]
[INFO] Apache Maven Site Plugin 3 ........................ SUCCESS [41.844s]
[INFO] Apache Maven Source Plugin ........................ SUCCESS [12.733s]
[INFO] Apache Maven Stage Plugin ......................... SUCCESS [10.170s]
[INFO] Apache Maven Toolchains Plugin .................... SUCCESS [20.083s]
[INFO] Apache Maven Verifier Plugin ...................... SUCCESS [8.621s]
[INFO] Apache Maven WAR Plugin ........................... SUCCESS [33.559s]
[INFO] Apache Maven SCM Publish Plugin ................... SUCCESS [15.419s]
[INFO] Apache Maven Invoker Plugin ....................... SUCCESS [31.654s]
[INFO] Apache Maven Project Info Reports Plugin .......... SUCCESS [51.919s]
[INFO] Apache Maven Remote Resources Plugin .............. SUCCESS [16.947s]
[INFO] Apache Maven Shade Plugin ......................... SUCCESS [26.210s]
[INFO] Apache Maven Plugins Aggregator ................... SUCCESS [9.231s]
[INFO] ------------------------------------------------------------------------
[INFO] BUILD FAILURE
[INFO] ------------------------------------------------------------------------
[INFO] Total time: 14:20.692s (Wall Clock)
[INFO] Finished at: Sun Dec 29 21:55:41 GMT 2013
[INFO] Final Memory: 91M/314M
[INFO] ------------------------------------------------------------------------
Waiting for Jenkins to finish collecting data
[ERROR] Failed to execute goal on project maven-jarsigner-plugin: Could not resolve dependencies
for project org.apache.maven.plugins:maven-jarsigner-plugin:maven-plugin:1.4-SNAPSHOT: Could
not find artifact org.apache.maven.shared:maven-jarsigner:jar:1.3 in central (http://repo1.maven.org/maven2)
-> [Help 1]
org.apache.maven.lifecycle.LifecycleExecutionException: Failed to execute goal on project
maven-jarsigner-plugin: Could not resolve dependencies for project org.apache.maven.plugins:maven-jarsigner-plugin:maven-plugin:1.4-SNAPSHOT:
Could not find artifact org.apache.maven.shared:maven-jarsigner:jar:1.3 in central (http://repo1.maven.org/maven2)
	at org.apache.maven.lifecycle.internal.LifecycleDependencyResolver.getDependencies(LifecycleDependencyResolver.java:190)
	at org.apache.maven.lifecycle.internal.LifecycleDependencyResolver.resolveProjectDependencies(LifecycleDependencyResolver.java:104)
	at org.apache.maven.lifecycle.internal.MojoExecutor.ensureDependenciesAreResolved(MojoExecutor.java:258)
	at org.apache.maven.lifecycle.internal.MojoExecutor.execute(MojoExecutor.java:201)
	at org.apache.maven.lifecycle.internal.MojoExecutor.execute(MojoExecutor.java:153)
	at org.apache.maven.lifecycle.internal.MojoExecutor.execute(MojoExecutor.java:145)
	at org.apache.maven.lifecycle.internal.LifecycleModuleBuilder.buildProject(LifecycleModuleBuilder.java:84)
	at org.apache.maven.lifecycle.internal.LifecycleThreadedBuilder$1.call(LifecycleThreadedBuilder.java:167)
	at org.apache.maven.lifecycle.internal.LifecycleThreadedBuilder$1.call(LifecycleThreadedBuilder.java:164)
	at java.util.concurrent.FutureTask$Sync.innerRun(FutureTask.java:334)
	at java.util.concurrent.FutureTask.run(FutureTask.java:166)
	at java.util.concurrent.Executors$RunnableAdapter.call(Executors.java:471)
	at java.util.concurrent.FutureTask$Sync.innerRun(FutureTask.java:334)
	at java.util.concurrent.FutureTask.run(FutureTask.java:166)
	at java.util.concurrent.ThreadPoolExecutor.runWorker(ThreadPoolExecutor.java:1110)
	at java.util.concurrent.ThreadPoolExecutor$Worker.run(ThreadPoolExecutor.java:603)
	at java.lang.Thread.run(Thread.java:722)
Caused by: org.apache.maven.project.DependencyResolutionException: Could not resolve dependencies
for project org.apache.maven.plugins:maven-jarsigner-plugin:maven-plugin:1.4-SNAPSHOT: Could
not find artifact org.apache.maven.shared:maven-jarsigner:jar:1.3 in central (http://repo1.maven.org/maven2)
	at org.apache.maven.project.DefaultProjectDependenciesResolver.resolve(DefaultProjectDependenciesResolver.java:156)
	at org.apache.maven.lifecycle.internal.LifecycleDependencyResolver.getDependencies(LifecycleDependencyResolver.java:165)
	... 16 more
Caused by: org.sonatype.aether.resolution.ArtifactResolutionException: Could not find artifact
org.apache.maven.shared:maven-jarsigner:jar:1.3 in central (http://repo1.maven.org/maven2)
	at org.sonatype.aether.impl.internal.DefaultArtifactResolver.resolveArtifacts(DefaultArtifactResolver.java:526)
	at org.sonatype.aether.impl.internal.DefaultRepositorySystem.resolveArtifacts(DefaultRepositorySystem.java:304)
	at org.sonatype.aether.impl.internal.DefaultRepositorySystem.resolveDependencies(DefaultRepositorySystem.java:334)
	at org.apache.maven.project.DefaultProjectDependenciesResolver.resolve(DefaultProjectDependenciesResolver.java:150)
	... 17 more
Caused by: org.sonatype.aether.transfer.ArtifactNotFoundException: Could not find artifact
org.apache.maven.shared:maven-jarsigner:jar:1.3 in central (http://repo1.maven.org/maven2)
	at org.sonatype.aether.connector.wagon.WagonRepositoryConnector$4.wrap(WagonRepositoryConnector.java:945)
	at org.sonatype.aether.connector.wagon.WagonRepositoryConnector$4.wrap(WagonRepositoryConnector.java:940)
	at org.sonatype.aether.connector.wagon.WagonRepositoryConnector$GetTask.flush(WagonRepositoryConnector.java:696)
	at org.sonatype.aether.connector.wagon.WagonRepositoryConnector$GetTask.flush(WagonRepositoryConnector.java:690)
	at org.sonatype.aether.connector.wagon.WagonRepositoryConnector.get(WagonRepositoryConnector.java:435)
	at org.sonatype.aether.impl.internal.DefaultArtifactResolver.resolveArtifacts(DefaultArtifactResolver.java:438)
	... 20 more
[ERROR] 
[ERROR] Re-run Maven using the -X switch to enable full debug logging.
[ERROR] 
[JENKINS] Archiving F:\hudson\hudson-slave\workspace\maven-plugins-windows\maven-scm-publish-plugin\pom.xml
to org.apache.maven.plugins/maven-scm-publish-plugin/1.0-SNAPSHOT/maven-scm-publish-plugin-1.0-SNAPSHOT.pom
[JENKINS] Archiving F:\hudson\hudson-slave\workspace\maven-plugins-windows\maven-scm-publish-plugin\target\maven-scm-publish-plugin-1.0-SNAPSHOT.jar
to org.apache.maven.plugins/maven-scm-publish-plugin/1.0-SNAPSHOT/maven-scm-publish-plugin-1.0-SNAPSHOT.jar
[ERROR] For more information about the errors and possible solutions, please read the following
articles:
[ERROR] [Help 1] http://cwiki.apache.org/confluence/display/MAVEN/DependencyResolutionException
[ERROR] 
[ERROR] After correcting the problems, you can resume the build with the command
[ERROR]   mvn <goals> -rf :maven-jarsigner-plugin
[JENKINS] Archiving F:\hudson\hudson-slave\workspace\maven-plugins-windows\maven-linkcheck-plugin\pom.xml
to org.apache.maven.plugins/maven-linkcheck-plugin/1.2-SNAPSHOT/maven-linkcheck-plugin-1.2-SNAPSHOT.pom
[JENKINS] Archiving F:\hudson\hudson-slave\workspace\maven-plugins-windows\maven-linkcheck-plugin\target\maven-linkcheck-plugin-1.2-SNAPSHOT.jar
to org.apache.maven.plugins/maven-linkcheck-plugin/1.2-SNAPSHOT/maven-linkcheck-plugin-1.2-SNAPSHOT.jar
[JENKINS] Archiving F:\hudson\hudson-slave\workspace\maven-plugins-windows\maven-changes-plugin\pom.xml
to org.apache.maven.plugins/maven-changes-plugin/2.10-SNAPSHOT/maven-changes-plugin-2.10-SNAPSHOT.pom
[JENKINS] Archiving F:\hudson\hudson-slave\workspace\maven-plugins-windows\maven-changes-plugin\target\maven-changes-plugin-2.10-SNAPSHOT.jar
to org.apache.maven.plugins/maven-changes-plugin/2.10-SNAPSHOT/maven-changes-plugin-2.10-SNAPSHOT.jar
[JENKINS] Archiving F:\hudson\hudson-slave\workspace\maven-plugins-windows\maven-ear-plugin\pom.xml
to org.apache.maven.plugins/maven-ear-plugin/2.10-SNAPSHOT/maven-ear-plugin-2.10-SNAPSHOT.pom
[JENKINS] Archiving F:\hudson\hudson-slave\workspace\maven-plugins-windows\maven-ear-plugin\target\maven-ear-plugin-2.10-SNAPSHOT.jar
to org.apache.maven.plugins/maven-ear-plugin/2.10-SNAPSHOT/maven-ear-plugin-2.10-SNAPSHOT.jar
[JENKINS] Archiving F:\hudson\hudson-slave\workspace\maven-plugins-windows\maven-pdf-plugin\pom.xml
to org.apache.maven.plugins/maven-pdf-plugin/1.3-SNAPSHOT/maven-pdf-plugin-1.3-SNAPSHOT.pom
[JENKINS] Archiving F:\hudson\hudson-slave\workspace\maven-plugins-windows\maven-pdf-plugin\target\maven-pdf-plugin-1.3-SNAPSHOT.jar
to org.apache.maven.plugins/maven-pdf-plugin/1.3-SNAPSHOT/maven-pdf-plugin-1.3-SNAPSHOT.jar
[JENKINS] Archiving F:\hudson\hudson-slave\workspace\maven-plugins-windows\maven-help-plugin\pom.xml
to org.apache.maven.plugins/maven-help-plugin/2.2.1-SNAPSHOT/maven-help-plugin-2.2.1-SNAPSHOT.pom
[JENKINS] Archiving F:\hudson\hudson-slave\workspace\maven-plugins-windows\maven-help-plugin\target\maven-help-plugin-2.2.1-SNAPSHOT.jar
to org.apache.maven.plugins/maven-help-plugin/2.2.1-SNAPSHOT/maven-help-plugin-2.2.1-SNAPSHOT.jar
[JENKINS] Archiving F:\hudson\hudson-slave\workspace\maven-plugins-windows\maven-site-plugin\dependency-reduced-pom.xml
to org.apache.maven.plugins/maven-site-plugin/3.4-SNAPSHOT/maven-site-plugin-3.4-SNAPSHOT.pom
[JENKINS] Archiving F:\hudson\hudson-slave\workspace\maven-plugins-windows\maven-site-plugin\target\maven-site-plugin-3.4-SNAPSHOT.jar
to org.apache.maven.plugins/maven-site-plugin/3.4-SNAPSHOT/maven-site-plugin-3.4-SNAPSHOT.jar
[JENKINS] Archiving F:\hudson\hudson-slave\workspace\maven-plugins-windows\maven-reactor-plugin\pom.xml
to org.apache.maven.plugins/maven-reactor-plugin/1.1-SNAPSHOT/maven-reactor-plugin-1.1-SNAPSHOT.pom
[JENKINS] Archiving F:\hudson\hudson-slave\workspace\maven-plugins-windows\maven-reactor-plugin\target\maven-reactor-plugin-1.1-SNAPSHOT.jar
to org.apache.maven.plugins/maven-reactor-plugin/1.1-SNAPSHOT/maven-reactor-plugin-1.1-SNAPSHOT.jar
[JENKINS] Archiving F:\hudson\hudson-slave\workspace\maven-plugins-windows\maven-patch-plugin\pom.xml
to org.apache.maven.plugins/maven-patch-plugin/1.2-SNAPSHOT/maven-patch-plugin-1.2-SNAPSHOT.pom
[JENKINS] Archiving F:\hudson\hudson-slave\workspace\maven-plugins-windows\maven-patch-plugin\target\maven-patch-plugin-1.2-SNAPSHOT.jar
to org.apache.maven.plugins/maven-patch-plugin/1.2-SNAPSHOT/maven-patch-plugin-1.2-SNAPSHOT.jar
[JENKINS] Archiving F:\hudson\hudson-slave\workspace\maven-plugins-windows\maven-rar-plugin\pom.xml
to org.apache.maven.plugins/maven-rar-plugin/2.4-SNAPSHOT/maven-rar-plugin-2.4-SNAPSHOT.pom
[JENKINS] Archiving F:\hudson\hudson-slave\workspace\maven-plugins-windows\maven-rar-plugin\target\maven-rar-plugin-2.4-SNAPSHOT.jar
to org.apache.maven.plugins/maven-rar-plugin/2.4-SNAPSHOT/maven-rar-plugin-2.4-SNAPSHOT.jar
[JENKINS] Archiving F:\hudson\hudson-slave\workspace\maven-plugins-windows\maven-docck-plugin\pom.xml
to org.apache.maven.plugins/maven-docck-plugin/1.1-SNAPSHOT/maven-docck-plugin-1.1-SNAPSHOT.pom
[JENKINS] Archiving F:\hudson\hudson-slave\workspace\maven-plugins-windows\maven-docck-plugin\target\maven-docck-plugin-1.1-SNAPSHOT.jar
to org.apache.maven.plugins/maven-docck-plugin/1.1-SNAPSHOT/maven-docck-plugin-1.1-SNAPSHOT.jar
[JENKINS] Archiving F:\hudson\hudson-slave\workspace\maven-plugins-windows\maven-verifier-plugin\pom.xml
to org.apache.maven.plugins/maven-verifier-plugin/1.1-SNAPSHOT/maven-verifier-plugin-1.1-SNAPSHOT.pom
[JENKINS] Archiving F:\hudson\hudson-slave\workspace\maven-plugins-windows\maven-verifier-plugin\target\maven-verifier-plugin-1.1-SNAPSHOT.jar
to org.apache.maven.plugins/maven-verifier-plugin/1.1-SNAPSHOT/maven-verifier-plugin-1.1-SNAPSHOT.jar
[JENKINS] Archiving F:\hudson\hudson-slave\workspace\maven-plugins-windows\maven-jar-plugin\pom.xml
to org.apache.maven.plugins/maven-jar-plugin/2.5-SNAPSHOT/maven-jar-plugin-2.5-SNAPSHOT.pom
[JENKINS] Archiving F:\hudson\hudson-slave\workspace\maven-plugins-windows\maven-jar-plugin\target\maven-jar-plugin-2.5-SNAPSHOT.jar
to org.apache.maven.plugins/maven-jar-plugin/2.5-SNAPSHOT/maven-jar-plugin-2.5-SNAPSHOT.jar
[JENKINS] Archiving F:\hudson\hudson-slave\workspace\maven-plugins-windows\maven-changelog-plugin\pom.xml
to org.apache.maven.plugins/maven-changelog-plugin/2.3-SNAPSHOT/maven-changelog-plugin-2.3-SNAPSHOT.pom
[JENKINS] Archiving F:\hudson\hudson-slave\workspace\maven-plugins-windows\maven-changelog-plugin\target\maven-changelog-plugin-2.3-SNAPSHOT.jar
to org.apache.maven.plugins/maven-changelog-plugin/2.3-SNAPSHOT/maven-changelog-plugin-2.3-SNAPSHOT.jar
[JENKINS] Archiving F:\hudson\hudson-slave\workspace\maven-plugins-windows\maven-invoker-plugin\pom.xml
to org.apache.maven.plugins/maven-invoker-plugin/1.9-SNAPSHOT/maven-invoker-plugin-1.9-SNAPSHOT.pom
[JENKINS] Archiving F:\hudson\hudson-slave\workspace\maven-plugins-windows\maven-invoker-plugin\target\maven-invoker-plugin-1.9-SNAPSHOT.jar
to org.apache.maven.plugins/maven-invoker-plugin/1.9-SNAPSHOT/maven-invoker-plugin-1.9-SNAPSHOT.jar
[JENKINS] Archiving F:\hudson\hudson-slave\workspace\maven-plugins-windows\maven-jarsigner-plugin\pom.xml
to org.apache.maven.plugins/maven-jarsigner-plugin/1.4-SNAPSHOT/maven-jarsigner-plugin-1.4-SNAPSHOT.pom
[JENKINS] Archiving F:\hudson\hudson-slave\workspace\maven-plugins-windows\maven-repository-plugin\pom.xml
to org.apache.maven.plugins/maven-repository-plugin/2.3.2-SNAPSHOT/maven-repository-plugin-2.3.2-SNAPSHOT.pom
[JENKINS] Archiving F:\hudson\hudson-slave\workspace\maven-plugins-windows\maven-repository-plugin\target\maven-repository-plugin-2.3.2-SNAPSHOT.jar
to org.apache.maven.plugins/maven-repository-plugin/2.3.2-SNAPSHOT/maven-repository-plugin-2.3.2-SNAPSHOT.jar
[JENKINS] Archiving F:\hudson\hudson-slave\workspace\maven-plugins-windows\maven-remote-resources-plugin\pom.xml
to org.apache.maven.plugins/maven-remote-resources-plugin/1.6-SNAPSHOT/maven-remote-resources-plugin-1.6-SNAPSHOT.pom
[JENKINS] Archiving F:\hudson\hudson-slave\workspace\maven-plugins-windows\maven-remote-resources-plugin\target\maven-remote-resources-plugin-1.6-SNAPSHOT.jar
to org.apache.maven.plugins/maven-remote-resources-plugin/1.6-SNAPSHOT/maven-remote-resources-plugin-1.6-SNAPSHOT.jar
[JENKINS] Archiving F:\hudson\hudson-slave\workspace\maven-plugins-windows\maven-deploy-plugin\pom.xml
to org.apache.maven.plugins/maven-deploy-plugin/2.9-SNAPSHOT/maven-deploy-plugin-2.9-SNAPSHOT.pom
[JENKINS] Archiving F:\hudson\hudson-slave\workspace\maven-plugins-windows\maven-deploy-plugin\target\maven-deploy-plugin-2.9-SNAPSHOT.jar
to org.apache.maven.plugins/maven-deploy-plugin/2.9-SNAPSHOT/maven-deploy-plugin-2.9-SNAPSHOT.jar
[JENKINS] Archiving F:\hudson\hudson-slave\workspace\maven-plugins-windows\maven-eclipse-plugin\pom.xml
to org.apache.maven.plugins/maven-eclipse-plugin/2.10-SNAPSHOT/maven-eclipse-plugin-2.10-SNAPSHOT.pom
[JENKINS] Archiving F:\hudson\hudson-slave\workspace\maven-plugins-windows\maven-eclipse-plugin\target\maven-eclipse-plugin-2.10-SNAPSHOT.jar
to org.apache.maven.plugins/maven-eclipse-plugin/2.10-SNAPSHOT/maven-eclipse-plugin-2.10-SNAPSHOT.jar
[JENKINS] Archiving F:\hudson\hudson-slave\workspace\maven-plugins-windows\maven-compiler-plugin\pom.xml
to org.apache.maven.plugins/maven-compiler-plugin/3.2-SNAPSHOT/maven-compiler-plugin-3.2-SNAPSHOT.pom
[JENKINS] Archiving F:\hudson\hudson-slave\workspace\maven-plugins-windows\maven-compiler-plugin\target\maven-compiler-plugin-3.2-SNAPSHOT.jar
to org.apache.maven.plugins/maven-compiler-plugin/3.2-SNAPSHOT/maven-compiler-plugin-3.2-SNAPSHOT.jar
[JENKINS] Archiving F:\hudson\hudson-slave\workspace\maven-plugins-windows\maven-resources-plugin\pom.xml
to org.apache.maven.plugins/maven-resources-plugin/2.7-SNAPSHOT/maven-resources-plugin-2.7-SNAPSHOT.pom
[JENKINS] Archiving F:\hudson\hudson-slave\workspace\maven-plugins-windows\maven-resources-plugin\target\maven-resources-plugin-2.7-SNAPSHOT.jar
to org.apache.maven.plugins/maven-resources-plugin/2.7-SNAPSHOT/maven-resources-plugin-2.7-SNAPSHOT.jar
[JENKINS] Archiving F:\hudson\hudson-slave\workspace\maven-plugins-windows\maven-antrun-plugin\pom.xml
to org.apache.maven.plugins/maven-antrun-plugin/1.8-SNAPSHOT/maven-antrun-plugin-1.8-SNAPSHOT.pom
[JENKINS] Archiving F:\hudson\hudson-slave\workspace\maven-plugins-windows\maven-antrun-plugin\target\maven-antrun-plugin-1.8-SNAPSHOT.jar
to org.apache.maven.plugins/maven-antrun-plugin/1.8-SNAPSHOT/maven-antrun-plugin-1.8-SNAPSHOT.jar
[JENKINS] Archiving F:\hudson\hudson-slave\workspace\maven-plugins-windows\maven-ant-plugin\pom.xml
to org.apache.maven.plugins/maven-ant-plugin/2.4-SNAPSHOT/maven-ant-plugin-2.4-SNAPSHOT.pom
[JENKINS] Archiving F:\hudson\hudson-slave\workspace\maven-plugins-windows\maven-ant-plugin\target\maven-ant-plugin-2.4-SNAPSHOT.jar
to org.apache.maven.plugins/maven-ant-plugin/2.4-SNAPSHOT/maven-ant-plugin-2.4-SNAPSHOT.jar
[JENKINS] Archiving F:\hudson\hudson-slave\workspace\maven-plugins-windows\maven-pmd-plugin\pom.xml
to org.apache.maven.plugins/maven-pmd-plugin/3.1-SNAPSHOT/maven-pmd-plugin-3.1-SNAPSHOT.pom
[JENKINS] Archiving F:\hudson\hudson-slave\workspace\maven-plugins-windows\maven-pmd-plugin\target\maven-pmd-plugin-3.1-SNAPSHOT.jar
to org.apache.maven.plugins/maven-pmd-plugin/3.1-SNAPSHOT/maven-pmd-plugin-3.1-SNAPSHOT.jar
[JENKINS] Archiving F:\hudson\hudson-slave\workspace\maven-plugins-windows\maven-acr-plugin\pom.xml
to org.apache.maven.plugins/maven-acr-plugin/1.0.1-SNAPSHOT/maven-acr-plugin-1.0.1-SNAPSHOT.pom
[JENKINS] Archiving F:\hudson\hudson-slave\workspace\maven-plugins-windows\maven-acr-plugin\target\maven-acr-plugin-1.0.1-SNAPSHOT.jar
to org.apache.maven.plugins/maven-acr-plugin/1.0.1-SNAPSHOT/maven-acr-plugin-1.0.1-SNAPSHOT.jar
[JENKINS] Archiving F:\hudson\hudson-slave\workspace\maven-plugins-windows\maven-plugins\pom.xml
to org.apache.maven.plugins/maven-plugins/25-SNAPSHOT/maven-plugins-25-SNAPSHOT.pom
[JENKINS] Archiving F:\hudson\hudson-slave\workspace\maven-plugins-windows\maven-plugins\target\maven-plugins-25-SNAPSHOT-site.xml
to org.apache.maven.plugins/maven-plugins/25-SNAPSHOT/maven-plugins-25-SNAPSHOT-site.xml
[JENKINS] Archiving F:\hudson\hudson-slave\workspace\maven-plugins-windows\maven-project-info-reports-plugin\pom.xml
to org.apache.maven.plugins/maven-project-info-reports-plugin/2.8-SNAPSHOT/maven-project-info-reports-plugin-2.8-SNAPSHOT.pom
[JENKINS] Archiving F:\hudson\hudson-slave\workspace\maven-plugins-windows\maven-project-info-reports-plugin\target\maven-project-info-reports-plugin-2.8-SNAPSHOT.jar
to org.apache.maven.plugins/maven-project-info-reports-plugin/2.8-SNAPSHOT/maven-project-info-reports-plugin-2.8-SNAPSHOT.jar
[JENKINS] Archiving F:\hudson\hudson-slave\workspace\maven-plugins-windows\maven-toolchains-plugin\pom.xml
to org.apache.maven.plugins/maven-toolchains-plugin/1.1-SNAPSHOT/maven-toolchains-plugin-1.1-SNAPSHOT.pom
[JENKINS] Archiving F:\hudson\hudson-slave\workspace\maven-plugins-windows\maven-toolchains-plugin\target\maven-toolchains-plugin-1.1-SNAPSHOT.jar
to org.apache.maven.plugins/maven-toolchains-plugin/1.1-SNAPSHOT/maven-toolchains-plugin-1.1-SNAPSHOT.jar
[JENKINS] Archiving <https://builds.apache.org/job/maven-plugins-windows/ws/pom.xml>
to org.apache.maven.plugins/maven-plugins-aggregator/1-SNAPSHOT/maven-plugins-aggregator-1-SNAPSHOT.pom
[JENKINS] Archiving F:\hudson\hudson-slave\workspace\maven-plugins-windows\maven-dependency-plugin\pom.xml
to org.apache.maven.plugins/maven-dependency-plugin/2.9-SNAPSHOT/maven-dependency-plugin-2.9-SNAPSHOT.pom
[JENKINS] Archiving F:\hudson\hudson-slave\workspace\maven-plugins-windows\maven-dependency-plugin\target\maven-dependency-plugin-2.9-SNAPSHOT.jar
to org.apache.maven.plugins/maven-dependency-plugin/2.9-SNAPSHOT/maven-dependency-plugin-2.9-SNAPSHOT.jar
[JENKINS] Archiving F:\hudson\hudson-slave\workspace\maven-plugins-windows\maven-clean-plugin\pom.xml
to org.apache.maven.plugins/maven-clean-plugin/2.6-SNAPSHOT/maven-clean-plugin-2.6-SNAPSHOT.pom
[JENKINS] Archiving F:\hudson\hudson-slave\workspace\maven-plugins-windows\maven-clean-plugin\target\maven-clean-plugin-2.6-SNAPSHOT.jar
to org.apache.maven.plugins/maven-clean-plugin/2.6-SNAPSHOT/maven-clean-plugin-2.6-SNAPSHOT.jar
[JENKINS] Archiving F:\hudson\hudson-slave\workspace\maven-plugins-windows\maven-doap-plugin\pom.xml
to org.apache.maven.plugins/maven-doap-plugin/1.2-SNAPSHOT/maven-doap-plugin-1.2-SNAPSHOT.pom
[JENKINS] Archiving F:\hudson\hudson-slave\workspace\maven-plugins-windows\maven-doap-plugin\target\maven-doap-plugin-1.2-SNAPSHOT.jar
to org.apache.maven.plugins/maven-doap-plugin/1.2-SNAPSHOT/maven-doap-plugin-1.2-SNAPSHOT.jar
[JENKINS] Archiving F:\hudson\hudson-slave\workspace\maven-plugins-windows\maven-war-plugin\pom.xml
to org.apache.maven.plugins/maven-war-plugin/2.5-SNAPSHOT/maven-war-plugin-2.5-SNAPSHOT.pom
[JENKINS] Archiving F:\hudson\hudson-slave\workspace\maven-plugins-windows\maven-war-plugin\target\maven-war-plugin-2.5-SNAPSHOT.jar
to org.apache.maven.plugins/maven-war-plugin/2.5-SNAPSHOT/maven-war-plugin-2.5-SNAPSHOT.jar
[JENKINS] Archiving F:\hudson\hudson-slave\workspace\maven-plugins-windows\maven-checkstyle-plugin\pom.xml
to org.apache.maven.plugins/maven-checkstyle-plugin/2.12-SNAPSHOT/maven-checkstyle-plugin-2.12-SNAPSHOT.pom
[JENKINS] Archiving F:\hudson\hudson-slave\workspace\maven-plugins-windows\maven-checkstyle-plugin\target\maven-checkstyle-plugin-2.12-SNAPSHOT.jar
to org.apache.maven.plugins/maven-checkstyle-plugin/2.12-SNAPSHOT/maven-checkstyle-plugin-2.12-SNAPSHOT.jar
[JENKINS] Archiving F:\hudson\hudson-slave\workspace\maven-plugins-windows\maven-ejb-plugin\pom.xml
to org.apache.maven.plugins/maven-ejb-plugin/2.4-SNAPSHOT/maven-ejb-plugin-2.4-SNAPSHOT.pom
[JENKINS] Archiving F:\hudson\hudson-slave\workspace\maven-plugins-windows\maven-ejb-plugin\target\maven-ejb-plugin-2.4-SNAPSHOT.jar
to org.apache.maven.plugins/maven-ejb-plugin/2.4-SNAPSHOT/maven-ejb-plugin-2.4-SNAPSHOT.jar
[JENKINS] Archiving F:\hudson\hudson-slave\workspace\maven-plugins-windows\maven-shade-plugin\pom.xml
to org.apache.maven.plugins/maven-shade-plugin/2.3-SNAPSHOT/maven-shade-plugin-2.3-SNAPSHOT.pom
[JENKINS] Archiving F:\hudson\hudson-slave\workspace\maven-plugins-windows\maven-shade-plugin\target\maven-shade-plugin-2.3-SNAPSHOT.jar
to org.apache.maven.plugins/maven-shade-plugin/2.3-SNAPSHOT/maven-shade-plugin-2.3-SNAPSHOT.jar
[JENKINS] Archiving F:\hudson\hudson-slave\workspace\maven-plugins-windows\maven-stage-plugin\pom.xml
to org.apache.maven.plugins/maven-stage-plugin/1.0-SNAPSHOT/maven-stage-plugin-1.0-SNAPSHOT.pom
[JENKINS] Archiving F:\hudson\hudson-slave\workspace\maven-plugins-windows\maven-stage-plugin\target\maven-stage-plugin-1.0-SNAPSHOT.jar
to org.apache.maven.plugins/maven-stage-plugin/1.0-SNAPSHOT/maven-stage-plugin-1.0-SNAPSHOT.jar
[JENKINS] Archiving F:\hudson\hudson-slave\workspace\maven-plugins-windows\maven-javadoc-plugin\pom.xml
to org.apache.maven.plugins/maven-javadoc-plugin/2.9.2-SNAPSHOT/maven-javadoc-plugin-2.9.2-SNAPSHOT.pom
[JENKINS] Archiving F:\hudson\hudson-slave\workspace\maven-plugins-windows\maven-javadoc-plugin\target\maven-javadoc-plugin-2.9.2-SNAPSHOT.jar
to org.apache.maven.plugins/maven-javadoc-plugin/2.9.2-SNAPSHOT/maven-javadoc-plugin-2.9.2-SNAPSHOT.jar
[JENKINS] Archiving F:\hudson\hudson-slave\workspace\maven-plugins-windows\maven-source-plugin\pom.xml
to org.apache.maven.plugins/maven-source-plugin/2.3-SNAPSHOT/maven-source-plugin-2.3-SNAPSHOT.pom
[JENKINS] Archiving F:\hudson\hudson-slave\workspace\maven-plugins-windows\maven-source-plugin\target\maven-source-plugin-2.3-SNAPSHOT.jar
to org.apache.maven.plugins/maven-source-plugin/2.3-SNAPSHOT/maven-source-plugin-2.3-SNAPSHOT.jar
[JENKINS] Archiving F:\hudson\hudson-slave\workspace\maven-plugins-windows\maven-assembly-plugin\pom.xml
to org.apache.maven.plugins/maven-assembly-plugin/2.5-SNAPSHOT/maven-assembly-plugin-2.5-SNAPSHOT.pom
[JENKINS] Archiving F:\hudson\hudson-slave\workspace\maven-plugins-windows\maven-assembly-plugin\target\maven-assembly-plugin-2.5-SNAPSHOT.jar
to org.apache.maven.plugins/maven-assembly-plugin/2.5-SNAPSHOT/maven-assembly-plugin-2.5-SNAPSHOT.jar
[JENKINS] Archiving F:\hudson\hudson-slave\workspace\maven-plugins-windows\maven-install-plugin\pom.xml
to org.apache.maven.plugins/maven-install-plugin/2.6-SNAPSHOT/maven-install-plugin-2.6-SNAPSHOT.pom
[JENKINS] Archiving F:\hudson\hudson-slave\workspace\maven-plugins-windows\maven-install-plugin\target\maven-install-plugin-2.6-SNAPSHOT.jar
to org.apache.maven.plugins/maven-install-plugin/2.6-SNAPSHOT/maven-install-plugin-2.6-SNAPSHOT.jar
Sending e-mails to: notifications@maven.apache.org null@apache.org
channel stopped
[WARNINGS] Skipping publisher since build result is FAILURE

Mime
View raw message