maven-notifications mailing list archives

Site index · List index
Message view « Date » · « Thread »
Top « Date » · « Thread »
From Apache Jenkins Server <jenk...@builds.apache.org>
Subject Build failed in Jenkins: maven-skins #179
Date Fri, 29 Nov 2013 04:43:12 GMT
See <https://builds.apache.org/job/maven-skins/179/changes>

Changes:

[olamy] make it working with recent maven core version

[olamy] make it working with recent maven core version

[olamy] invoker plugin 1.8

[olamy] bump version to 1.4.0-SNAPSHOT

[olamy] remove previous jquery version

[olamy] [MSKINS-90] jquery 1.10.2

------------------------------------------
[...truncated 860 lines...]
[INFO] --- maven-compiler-plugin:3.0:compile (default-compile) @ maven-fluido-skin ---
[INFO] No sources to compile
[INFO] 
[INFO] --- maven-resources-plugin:2.6:testResources (default-testResources) @ maven-fluido-skin
---
[INFO] Using 'UTF-8' encoding to copy filtered resources.
[INFO] skip non existing resourceDirectory F:\jenkins\jenkins-slave\workspace\maven-skins\maven-fluido-skin\src\test\resources
[INFO] Copying 3 resources
[INFO] 
[INFO] --- maven-compiler-plugin:3.0:testCompile (default-testCompile) @ maven-fluido-skin
---
[INFO] No sources to compile
[INFO] 
[INFO] --- maven-surefire-plugin:2.12.4:test (default-test) @ maven-fluido-skin ---
[JENKINS] Recording test results
[INFO] 
[INFO] --- maven-jar-plugin:2.4:jar (default-jar) @ maven-fluido-skin ---
[INFO] Building jar: F:\jenkins\jenkins-slave\workspace\maven-skins\maven-fluido-skin\target\maven-fluido-skin-1.4.0-SNAPSHOT.jar
[INFO] 
[INFO] --- maven-site-plugin:3.2:attach-descriptor (attach-descriptor) @ maven-fluido-skin
---
[INFO] 
[INFO] --- maven-invoker-plugin:1.8:install (integration-test) @ maven-fluido-skin ---
[INFO] Installing F:\jenkins\jenkins-slave\workspace\maven-skins\maven-skins\pom.xml to F:\jenkins\jenkins-slave\workspace\maven-skins\maven-fluido-skin\target\local-repo\org\apache\maven\skins\maven-skins\8-SNAPSHOT\maven-skins-8-SNAPSHOT.pom
[INFO] Installing F:\jenkins\jenkins-slave\workspace\maven-skins\maven-skins\target\maven-skins-8-SNAPSHOT-site.xml
to F:\jenkins\jenkins-slave\workspace\maven-skins\maven-fluido-skin\target\local-repo\org\apache\maven\skins\maven-skins\8-SNAPSHOT\maven-skins-8-SNAPSHOT-site.xml
[INFO] Installing F:\jenkins\jenkins-slave\workspace\maven-skins\maven-application-skin\pom.xml
to F:\jenkins\jenkins-slave\workspace\maven-skins\maven-fluido-skin\target\local-repo\org\apache\maven\skins\maven-application-skin\1.1-SNAPSHOT\maven-application-skin-1.1-SNAPSHOT.pom
[INFO] Installing F:\jenkins\jenkins-slave\workspace\maven-skins\maven-application-skin\target\maven-application-skin-1.1-SNAPSHOT.jar
to F:\jenkins\jenkins-slave\workspace\maven-skins\maven-fluido-skin\target\local-repo\org\apache\maven\skins\maven-application-skin\1.1-SNAPSHOT\maven-application-skin-1.1-SNAPSHOT.jar
[INFO] Installing F:\jenkins\jenkins-slave\workspace\maven-skins\maven-application-skin\pom.xml
to F:\jenkins\jenkins-slave\workspace\maven-skins\maven-fluido-skin\target\local-repo\org\apache\maven\skins\maven-application-skin\1.1-SNAPSHOT\maven-application-skin-1.1-SNAPSHOT.pom
[INFO] Installing F:\jenkins\jenkins-slave\workspace\maven-skins\maven-default-skin\pom.xml
to F:\jenkins\jenkins-slave\workspace\maven-skins\maven-fluido-skin\target\local-repo\org\apache\maven\skins\maven-default-skin\1.2-SNAPSHOT\maven-default-skin-1.2-SNAPSHOT.pom
[INFO] Installing F:\jenkins\jenkins-slave\workspace\maven-skins\maven-default-skin\target\maven-default-skin-1.2-SNAPSHOT.jar
to F:\jenkins\jenkins-slave\workspace\maven-skins\maven-fluido-skin\target\local-repo\org\apache\maven\skins\maven-default-skin\1.2-SNAPSHOT\maven-default-skin-1.2-SNAPSHOT.jar
[INFO] Installing F:\jenkins\jenkins-slave\workspace\maven-skins\maven-default-skin\pom.xml
to F:\jenkins\jenkins-slave\workspace\maven-skins\maven-fluido-skin\target\local-repo\org\apache\maven\skins\maven-default-skin\1.2-SNAPSHOT\maven-default-skin-1.2-SNAPSHOT.pom
[INFO] Installing F:\jenkins\jenkins-slave\workspace\maven-skins\maven-classic-skin\pom.xml
to F:\jenkins\jenkins-slave\workspace\maven-skins\maven-fluido-skin\target\local-repo\org\apache\maven\skins\maven-classic-skin\1.2-SNAPSHOT\maven-classic-skin-1.2-SNAPSHOT.pom
[INFO] Installing F:\jenkins\jenkins-slave\workspace\maven-skins\maven-classic-skin\target\maven-classic-skin-1.2-SNAPSHOT.jar
to F:\jenkins\jenkins-slave\workspace\maven-skins\maven-fluido-skin\target\local-repo\org\apache\maven\skins\maven-classic-skin\1.2-SNAPSHOT\maven-classic-skin-1.2-SNAPSHOT.jar
[INFO] Installing F:\jenkins\jenkins-slave\workspace\maven-skins\maven-classic-skin\pom.xml
to F:\jenkins\jenkins-slave\workspace\maven-skins\maven-fluido-skin\target\local-repo\org\apache\maven\skins\maven-classic-skin\1.2-SNAPSHOT\maven-classic-skin-1.2-SNAPSHOT.pom
[INFO] Installing F:\jenkins\jenkins-slave\workspace\maven-skins\maven-stylus-skin\pom.xml
to F:\jenkins\jenkins-slave\workspace\maven-skins\maven-fluido-skin\target\local-repo\org\apache\maven\skins\maven-stylus-skin\1.6-SNAPSHOT\maven-stylus-skin-1.6-SNAPSHOT.pom
[INFO] Installing F:\jenkins\jenkins-slave\workspace\maven-skins\maven-stylus-skin\target\maven-stylus-skin-1.6-SNAPSHOT.jar
to F:\jenkins\jenkins-slave\workspace\maven-skins\maven-fluido-skin\target\local-repo\org\apache\maven\skins\maven-stylus-skin\1.6-SNAPSHOT\maven-stylus-skin-1.6-SNAPSHOT.jar
[INFO] Installing F:\jenkins\jenkins-slave\workspace\maven-skins\maven-stylus-skin\pom.xml
to F:\jenkins\jenkins-slave\workspace\maven-skins\maven-fluido-skin\target\local-repo\org\apache\maven\skins\maven-stylus-skin\1.6-SNAPSHOT\maven-stylus-skin-1.6-SNAPSHOT.pom
[INFO] Installing F:\jenkins\jenkins-slave\workspace\maven-skins\maven-fluido-skin\pom.xml
to F:\jenkins\jenkins-slave\workspace\maven-skins\maven-fluido-skin\target\local-repo\org\apache\maven\skins\maven-fluido-skin\1.4.0-SNAPSHOT\maven-fluido-skin-1.4.0-SNAPSHOT.pom
[INFO] Installing F:\jenkins\jenkins-slave\workspace\maven-skins\maven-fluido-skin\target\maven-fluido-skin-1.4.0-SNAPSHOT.jar
to F:\jenkins\jenkins-slave\workspace\maven-skins\maven-fluido-skin\target\local-repo\org\apache\maven\skins\maven-fluido-skin\1.4.0-SNAPSHOT\maven-fluido-skin-1.4.0-SNAPSHOT.jar
[INFO] 
[INFO] --- maven-invoker-plugin:1.8:integration-test (integration-test) @ maven-fluido-skin
---
[INFO] Building: mskins-10\pom.xml
[INFO] run script verify.groovy
[INFO] ..SUCCESS (20.5 s)
[INFO] Building: mskins-13\pom.xml
[INFO] run script verify.groovy
[INFO] ..SUCCESS (11.6 s)
[INFO] Building: mskins-14\pom.xml
[INFO] ..SUCCESS (11.6 s)
[INFO] Building: mskins-14_sitesearch\pom.xml
[INFO] ..SUCCESS (11.6 s)
[INFO] Building: mskins-15\pom.xml
[INFO] ..SUCCESS (11.7 s)
[INFO] Building: mskins-16\pom.xml
[INFO] ..SUCCESS (11.9 s)
[INFO] Building: mskins-17\pom.xml
[INFO] run script verify.groovy
[INFO] ..SUCCESS (11.6 s)
[INFO] Building: mskins-21\pom.xml
[INFO] ..SUCCESS (17.6 s)
[INFO] Building: mskins-22\pom.xml
[INFO] ..SUCCESS (14.0 s)
[INFO] Building: mskins-22_default\pom.xml
[INFO] ..SUCCESS (13.8 s)
[INFO] Building: mskins-22_topbar\pom.xml
[INFO] ..SUCCESS (13.2 s)
[INFO] Building: mskins-23\pom.xml
[INFO] ..SUCCESS (13.8 s)
[INFO] Building: mskins-24\pom.xml
[INFO] ..SUCCESS (13.9 s)
[INFO] Building: mskins-24_topbar\pom.xml
[INFO] ..SUCCESS (13.3 s)
[INFO] Building: mskins-25\pom.xml
[INFO] ..SUCCESS (14.1 s)
[INFO] Building: mskins-28\pom.xml
[INFO] ..SUCCESS (8.5 s)
[INFO] Building: mskins-31\pom.xml
[INFO] ..SUCCESS (14.1 s)
[INFO] Building: mskins-33\pom.xml
[INFO] ..SUCCESS (13.8 s)
[INFO] Building: mskins-33_topbar\pom.xml
[INFO] ..SUCCESS (13.4 s)
[INFO] Building: mskins-34\pom.xml
[INFO] ..SUCCESS (13.8 s)
[INFO] Building: mskins-34_topbar\pom.xml
[INFO] ..SUCCESS (13.3 s)
[INFO] Building: mskins-41\pom.xml
[INFO] ..SUCCESS (8.5 s)
[INFO] Building: mskins-47\pom.xml
[INFO] run script verify.groovy
[INFO] ..SUCCESS (11.3 s)
[INFO] Building: mskins-72\pom.xml
[INFO] run script verify.groovy
[INFO] ..SUCCESS (14.1 s)
[INFO] Building: mskins-75\pom.xml
[INFO] run script verify.groovy
[INFO] ..SUCCESS (13.8 s)
[INFO] Building: mskins-76\pom.xml
[INFO] run script verify.groovy
[INFO] ..SUCCESS (13.7 s)
[INFO] Building: mskins-76_topbar\pom.xml
[INFO] run script verify.groovy
[INFO] ..SUCCESS (13.2 s)
[INFO] Building: mskins-85\pom.xml
[INFO] ..SUCCESS (13.6 s)
[INFO] Building: sidebar\pom.xml
[INFO] ..SUCCESS (13.8 s)
[INFO] Building: topbar\pom.xml
[INFO] ..SUCCESS (14.0 s)
[INFO] Building: topbar-inverse\pom.xml
[INFO] ..SUCCESS (14.2 s)
[JENKINS] Recording test results
[INFO] 
[INFO] --- maven-invoker-plugin:1.8:verify (integration-test) @ maven-fluido-skin ---
[INFO] -------------------------------------------------
[INFO] Build Summary:
[INFO]   Passed: 31, Failed: 0, Errors: 0, Skipped: 0
[INFO] -------------------------------------------------
[INFO] 
[INFO] --- maven-install-plugin:2.3.1:install (default-install) @ maven-fluido-skin ---
[INFO] Installing F:\jenkins\jenkins-slave\workspace\maven-skins\maven-fluido-skin\target\maven-fluido-skin-1.4.0-SNAPSHOT.jar
to f:\jenkins\jenkins-slave\maven-repositories\0\org\apache\maven\skins\maven-fluido-skin\1.4.0-SNAPSHOT\maven-fluido-skin-1.4.0-SNAPSHOT.jar
[INFO] Installing F:\jenkins\jenkins-slave\workspace\maven-skins\maven-fluido-skin\pom.xml
to f:\jenkins\jenkins-slave\maven-repositories\0\org\apache\maven\skins\maven-fluido-skin\1.4.0-SNAPSHOT\maven-fluido-skin-1.4.0-SNAPSHOT.pom
[INFO]                                                                         
[INFO] ------------------------------------------------------------------------
[INFO] Building Maven Skins Aggregator 1-SNAPSHOT
[INFO] ------------------------------------------------------------------------
Downloading: http://repo.maven.apache.org/maven2/org/apache/maven/plugins/maven-remote-resources-plugin/1.2.1/maven-remote-resources-plugin-1.2.1.pom
Downloaded: http://repo.maven.apache.org/maven2/org/apache/maven/plugins/maven-remote-resources-plugin/1.2.1/maven-remote-resources-plugin-1.2.1.pom
(13 KB at 141.8 KB/sec)
Downloading: http://repo.maven.apache.org/maven2/org/apache/maven/plugins/maven-remote-resources-plugin/1.2.1/maven-remote-resources-plugin-1.2.1.jar
Downloaded: http://repo.maven.apache.org/maven2/org/apache/maven/plugins/maven-remote-resources-plugin/1.2.1/maven-remote-resources-plugin-1.2.1.jar
(63 KB at 507.7 KB/sec)
Downloading: http://repo.maven.apache.org/maven2/org/apache/maven/plugins/maven-site-plugin/3.0/maven-site-plugin-3.0.pom
Downloaded: http://repo.maven.apache.org/maven2/org/apache/maven/plugins/maven-site-plugin/3.0/maven-site-plugin-3.0.pom
(20 KB at 354.0 KB/sec)
Downloading: http://repo.maven.apache.org/maven2/org/apache/maven/plugins/maven-plugins/21/maven-plugins-21.pom
Downloaded: http://repo.maven.apache.org/maven2/org/apache/maven/plugins/maven-plugins/21/maven-plugins-21.pom
(13 KB at 225.7 KB/sec)
Downloading: http://repo.maven.apache.org/maven2/org/apache/maven/plugins/maven-site-plugin/3.0/maven-site-plugin-3.0.jar
Downloaded: http://repo.maven.apache.org/maven2/org/apache/maven/plugins/maven-site-plugin/3.0/maven-site-plugin-3.0.jar
(112 KB at 898.6 KB/sec)
Downloading: http://repo.maven.apache.org/maven2/org/apache/maven/plugins/maven-clean-plugin/2.4.1/maven-clean-plugin-2.4.1.pom
Downloaded: http://repo.maven.apache.org/maven2/org/apache/maven/plugins/maven-clean-plugin/2.4.1/maven-clean-plugin-2.4.1.pom
(5 KB at 72.5 KB/sec)
Downloading: http://repo.maven.apache.org/maven2/org/apache/maven/plugins/maven-clean-plugin/2.4.1/maven-clean-plugin-2.4.1.jar
Downloaded: http://repo.maven.apache.org/maven2/org/apache/maven/plugins/maven-clean-plugin/2.4.1/maven-clean-plugin-2.4.1.jar
(23 KB at 396.5 KB/sec)
[INFO] 
[INFO] --- maven-clean-plugin:2.4.1:clean (default-clean) @ maven-skins-aggregator ---
[INFO] 
[INFO] --- maven-remote-resources-plugin:1.2.1:process (default) @ maven-skins-aggregator
---
Downloading: http://repo.maven.apache.org/maven2/org/apache/maven/shared/maven-downloader/1.1/maven-downloader-1.1.pom
Downloaded: http://repo.maven.apache.org/maven2/org/apache/maven/shared/maven-downloader/1.1/maven-downloader-1.1.pom
(2 KB at 31.7 KB/sec)
Downloading: http://repo.maven.apache.org/maven2/org/apache/maven/shared/maven-shared-components/4/maven-shared-components-4.pom
Downloaded: http://repo.maven.apache.org/maven2/org/apache/maven/shared/maven-shared-components/4/maven-shared-components-4.pom
(3 KB at 39.2 KB/sec)
Downloading: http://repo.maven.apache.org/maven2/org/apache/velocity/velocity/1.6.4/velocity-1.6.4.pom
Downloaded: http://repo.maven.apache.org/maven2/org/apache/velocity/velocity/1.6.4/velocity-1.6.4.pom
(11 KB at 185.2 KB/sec)
Downloading: http://repo.maven.apache.org/maven2/org/apache/maven/shared/maven-downloader/1.1/maven-downloader-1.1.jar
Downloading: http://repo.maven.apache.org/maven2/org/apache/velocity/velocity/1.6.4/velocity-1.6.4.jar
Downloaded: http://repo.maven.apache.org/maven2/org/apache/maven/shared/maven-downloader/1.1/maven-downloader-1.1.jar
(7 KB at 98.8 KB/sec)
Downloaded: http://repo.maven.apache.org/maven2/org/apache/velocity/velocity/1.6.4/velocity-1.6.4.jar
(412 KB at 1277.8 KB/sec)
[INFO] 
[INFO] --- maven-site-plugin:3.0:attach-descriptor (attach-descriptor) @ maven-skins-aggregator
---
Downloading: http://repo.maven.apache.org/maven2/org/apache/maven/reporting/maven-reporting-exec/1.0.1/maven-reporting-exec-1.0.1.pom
Downloaded: http://repo.maven.apache.org/maven2/org/apache/maven/reporting/maven-reporting-exec/1.0.1/maven-reporting-exec-1.0.1.pom
(10 KB at 149.4 KB/sec)
Downloading: http://repo.maven.apache.org/maven2/org/codehaus/plexus/plexus-component-annotations/1.5.4/plexus-component-annotations-1.5.4.pom
Downloaded: http://repo.maven.apache.org/maven2/org/codehaus/plexus/plexus-component-annotations/1.5.4/plexus-component-annotations-1.5.4.pom
(815 B at 11.1 KB/sec)
Downloading: http://repo.maven.apache.org/maven2/org/codehaus/plexus/plexus-containers/1.5.4/plexus-containers-1.5.4.pom
Downloaded: http://repo.maven.apache.org/maven2/org/codehaus/plexus/plexus-containers/1.5.4/plexus-containers-1.5.4.pom
(5 KB at 67.9 KB/sec)
Downloading: http://repo.maven.apache.org/maven2/org/apache/maven/doxia/doxia-module-apt/1.2/doxia-module-apt-1.2.pom
Downloaded: http://repo.maven.apache.org/maven2/org/apache/maven/doxia/doxia-module-apt/1.2/doxia-module-apt-1.2.pom
(3 KB at 39.4 KB/sec)
Downloading: http://repo.maven.apache.org/maven2/org/apache/maven/doxia/doxia-module-xdoc/1.2/doxia-module-xdoc-1.2.pom
Downloaded: http://repo.maven.apache.org/maven2/org/apache/maven/doxia/doxia-module-xdoc/1.2/doxia-module-xdoc-1.2.pom
(6 KB at 86.9 KB/sec)
Downloading: http://repo.maven.apache.org/maven2/org/apache/maven/reporting/maven-reporting-exec/1.0.1/maven-reporting-exec-1.0.1.jar
Downloading: http://repo.maven.apache.org/maven2/org/apache/maven/doxia/doxia-module-xdoc/1.2/doxia-module-xdoc-1.2.jar
Downloading: http://repo.maven.apache.org/maven2/org/apache/maven/doxia/doxia-module-apt/1.2/doxia-module-apt-1.2.jar
Downloaded: http://repo.maven.apache.org/maven2/org/apache/maven/doxia/doxia-module-xdoc/1.2/doxia-module-xdoc-1.2.jar
(36 KB at 576.3 KB/sec)
Downloaded: http://repo.maven.apache.org/maven2/org/apache/maven/reporting/maven-reporting-exec/1.0.1/maven-reporting-exec-1.0.1.jar
(22 KB at 318.9 KB/sec)
Downloaded: http://repo.maven.apache.org/maven2/org/apache/maven/doxia/doxia-module-apt/1.2/doxia-module-apt-1.2.jar
(51 KB at 362.3 KB/sec)
[INFO] 
[INFO] --- maven-install-plugin:2.3.1:install (default-install) @ maven-skins-aggregator ---
[INFO] Installing <https://builds.apache.org/job/maven-skins/ws/pom.xml> to f:\jenkins\jenkins-slave\maven-repositories\0\org\apache\maven\skins\maven-skins-aggregator\1-SNAPSHOT\maven-skins-aggregator-1-SNAPSHOT.pom
[INFO] Installing <https://builds.apache.org/job/maven-skins/ws/target\maven-skins-aggregator-1-SNAPSHOT-site.xml>
to f:\jenkins\jenkins-slave\maven-repositories\0\org\apache\maven\skins\maven-skins-aggregator\1-SNAPSHOT\maven-skins-aggregator-1-SNAPSHOT-site.xml
[INFO] ------------------------------------------------------------------------
[INFO] Reactor Summary:
[INFO] 
[INFO] Maven Skins ....................................... SUCCESS [10.005s]
[INFO] Maven Application Skin ............................ SUCCESS [37.981s]
[INFO] Maven Default Skin ................................ SUCCESS [31.350s]
[INFO] Maven Classic Skin ................................ SUCCESS [25.813s]
[INFO] Maven Stylus Skin ................................. SUCCESS [49.320s]
[INFO] Apache Maven Fluido Skin .......................... SUCCESS [6:59.732s]
[INFO] Maven Skins Aggregator ............................ SUCCESS [4.710s]
[INFO] ------------------------------------------------------------------------
[INFO] BUILD SUCCESS
[INFO] ------------------------------------------------------------------------
[INFO] Total time: 9:46.414s
[INFO] Finished at: Thu Nov 28 20:42:58 PST 2013
[INFO] Final Memory: 35M/84M
[INFO] ------------------------------------------------------------------------
Waiting for Jenkins to finish collecting data
[JENKINS] Archiving F:\jenkins\jenkins-slave\workspace\maven-skins\maven-fluido-skin\pom.xml
to org.apache.maven.skins/maven-fluido-skin/1.4.0-SNAPSHOT/maven-fluido-skin-1.4.0-SNAPSHOT.pom
[JENKINS] Archiving F:\jenkins\jenkins-slave\workspace\maven-skins\maven-fluido-skin\target\maven-fluido-skin-1.4.0-SNAPSHOT.jar
to org.apache.maven.skins/maven-fluido-skin/1.4.0-SNAPSHOT/maven-fluido-skin-1.4.0-SNAPSHOT.jar
[JENKINS] Archiving F:\jenkins\jenkins-slave\workspace\maven-skins\maven-skins\pom.xml to
org.apache.maven.skins/maven-skins/8-SNAPSHOT/maven-skins-8-SNAPSHOT.pom
[JENKINS] Archiving F:\jenkins\jenkins-slave\workspace\maven-skins\maven-skins\target\maven-skins-8-SNAPSHOT-site.xml
to org.apache.maven.skins/maven-skins/8-SNAPSHOT/maven-skins-8-SNAPSHOT-site.xml
[JENKINS] Archiving F:\jenkins\jenkins-slave\workspace\maven-skins\maven-default-skin\pom.xml
to org.apache.maven.skins/maven-default-skin/1.2-SNAPSHOT/maven-default-skin-1.2-SNAPSHOT.pom
[JENKINS] Archiving F:\jenkins\jenkins-slave\workspace\maven-skins\maven-default-skin\target\maven-default-skin-1.2-SNAPSHOT.jar
to org.apache.maven.skins/maven-default-skin/1.2-SNAPSHOT/maven-default-skin-1.2-SNAPSHOT.jar
[JENKINS] Archiving F:\jenkins\jenkins-slave\workspace\maven-skins\maven-application-skin\pom.xml
to org.apache.maven.skins/maven-application-skin/1.1-SNAPSHOT/maven-application-skin-1.1-SNAPSHOT.pom
[JENKINS] Archiving F:\jenkins\jenkins-slave\workspace\maven-skins\maven-application-skin\target\maven-application-skin-1.1-SNAPSHOT.jar
to org.apache.maven.skins/maven-application-skin/1.1-SNAPSHOT/maven-application-skin-1.1-SNAPSHOT.jar
[JENKINS] Archiving F:\jenkins\jenkins-slave\workspace\maven-skins\maven-stylus-skin\pom.xml
to org.apache.maven.skins/maven-stylus-skin/1.6-SNAPSHOT/maven-stylus-skin-1.6-SNAPSHOT.pom
[JENKINS] Archiving F:\jenkins\jenkins-slave\workspace\maven-skins\maven-stylus-skin\target\maven-stylus-skin-1.6-SNAPSHOT.jar
to org.apache.maven.skins/maven-stylus-skin/1.6-SNAPSHOT/maven-stylus-skin-1.6-SNAPSHOT.jar
[JENKINS] Archiving F:\jenkins\jenkins-slave\workspace\maven-skins\maven-classic-skin\pom.xml
to org.apache.maven.skins/maven-classic-skin/1.2-SNAPSHOT/maven-classic-skin-1.2-SNAPSHOT.pom
[JENKINS] Archiving F:\jenkins\jenkins-slave\workspace\maven-skins\maven-classic-skin\target\maven-classic-skin-1.2-SNAPSHOT.jar
to org.apache.maven.skins/maven-classic-skin/1.2-SNAPSHOT/maven-classic-skin-1.2-SNAPSHOT.jar
[JENKINS] Archiving <https://builds.apache.org/job/maven-skins/ws/pom.xml> to org.apache.maven.skins/maven-skins-aggregator/1-SNAPSHOT/maven-skins-aggregator-1-SNAPSHOT.pom
[JENKINS] Archiving <https://builds.apache.org/job/maven-skins/ws/target\maven-skins-aggregator-1-SNAPSHOT-site.xml>
to org.apache.maven.skins/maven-skins-aggregator/1-SNAPSHOT/maven-skins-aggregator-1-SNAPSHOT-site.xml
channel stopped
Maven RedeployPublisher use remote windows2 maven settings from : f:\jenkins\jenkins-slave\tools\hudson.tasks.Maven_MavenInstallation\Maven_3.0.5/conf/settings.xml
[INFO] Deployment in https://repository.apache.org/content/repositories/snapshots (id=apache.snapshots.https,uniqueVersion=true)
Deploying the main artifact jenkins-8450739920254319933maven-application-skin-1.1-SNAPSHOT.jar
Downloading: https://repository.apache.org/content/repositories/snapshots/org/apache/maven/skins/maven-application-skin/1.1-SNAPSHOT/maven-metadata.xml
Downloaded: https://repository.apache.org/content/repositories/snapshots/org/apache/maven/skins/maven-application-skin/1.1-SNAPSHOT/maven-metadata.xml
(791 B at 0.8 KB/sec)
Uploading: https://repository.apache.org/content/repositories/snapshots/org/apache/maven/skins/maven-application-skin/1.1-SNAPSHOT/maven-application-skin-1.1-20131129.044312-82.jar
Uploading: https://repository.apache.org/content/repositories/snapshots/org/apache/maven/skins/maven-application-skin/1.1-SNAPSHOT/maven-application-skin-1.1-20131129.044312-82.pom
ERROR: Failed to deploy artifacts: Could not transfer artifact org.apache.maven.skins:maven-application-skin:jar:1.1-20131129.044312-82
from/to apache.snapshots.https (https://repository.apache.org/content/repositories/snapshots):
Failed to transfer file: https://repository.apache.org/content/repositories/snapshots/org/apache/maven/skins/maven-application-skin/1.1-SNAPSHOT/maven-application-skin-1.1-20131129.044312-82.jar.
Return code is: 401, ReasonPhrase: Unauthorized.
org.apache.maven.artifact.deployer.ArtifactDeploymentException: Failed to deploy artifacts:
Could not transfer artifact org.apache.maven.skins:maven-application-skin:jar:1.1-20131129.044312-82
from/to apache.snapshots.https (https://repository.apache.org/content/repositories/snapshots):
Failed to transfer file: https://repository.apache.org/content/repositories/snapshots/org/apache/maven/skins/maven-application-skin/1.1-SNAPSHOT/maven-application-skin-1.1-20131129.044312-82.jar.
Return code is: 401, ReasonPhrase: Unauthorized.
	at org.apache.maven.artifact.deployer.DefaultArtifactDeployer.deploy(DefaultArtifactDeployer.java:143)
	at hudson.maven.reporters.MavenArtifactRecord.deploy(MavenArtifactRecord.java:191)
	at hudson.maven.RedeployPublisher.perform(RedeployPublisher.java:176)
	at hudson.tasks.BuildStepMonitor$1.perform(BuildStepMonitor.java:20)
	at hudson.model.AbstractBuild$AbstractBuildExecution.perform(AbstractBuild.java:785)
	at hudson.model.AbstractBuild$AbstractBuildExecution.performAllBuildSteps(AbstractBuild.java:757)
	at hudson.maven.MavenModuleSetBuild$MavenModuleSetBuildExecution.post2(MavenModuleSetBuild.java:1020)
	at hudson.model.AbstractBuild$AbstractBuildExecution.post(AbstractBuild.java:706)
	at hudson.model.Run.execute(Run.java:1704)
	at hudson.maven.MavenModuleSetBuild.run(MavenModuleSetBuild.java:509)
	at hudson.model.ResourceController.execute(ResourceController.java:88)
	at hudson.model.Executor.run(Executor.java:230)
Caused by: org.eclipse.aether.deployment.DeploymentException: Failed to deploy artifacts:
Could not transfer artifact org.apache.maven.skins:maven-application-skin:jar:1.1-20131129.044312-82
from/to apache.snapshots.https (https://repository.apache.org/content/repositories/snapshots):
Failed to transfer file: https://repository.apache.org/content/repositories/snapshots/org/apache/maven/skins/maven-application-skin/1.1-SNAPSHOT/maven-application-skin-1.1-20131129.044312-82.jar.
Return code is: 401, ReasonPhrase: Unauthorized.
	at org.eclipse.aether.internal.impl.DefaultDeployer.deploy(DefaultDeployer.java:341)
	at org.eclipse.aether.internal.impl.DefaultDeployer.deploy(DefaultDeployer.java:269)
	at org.eclipse.aether.internal.impl.DefaultRepositorySystem.deploy(DefaultRepositorySystem.java:413)
	at org.apache.maven.artifact.deployer.DefaultArtifactDeployer.deploy(DefaultArtifactDeployer.java:139)
	... 11 more
Caused by: org.eclipse.aether.transfer.ArtifactTransferException: Could not transfer artifact
org.apache.maven.skins:maven-application-skin:jar:1.1-20131129.044312-82 from/to apache.snapshots.https
(https://repository.apache.org/content/repositories/snapshots): Failed to transfer file: https://repository.apache.org/content/repositories/snapshots/org/apache/maven/skins/maven-application-skin/1.1-SNAPSHOT/maven-application-skin-1.1-20131129.044312-82.jar.
Return code is: 401, ReasonPhrase: Unauthorized.
	at org.eclipse.aether.connector.wagon.WagonRepositoryConnector$6.wrap(WagonRepositoryConnector.java:1016)
	at org.eclipse.aether.connector.wagon.WagonRepositoryConnector$6.wrap(WagonRepositoryConnector.java:1004)
	at org.eclipse.aether.connector.wagon.WagonRepositoryConnector$PutTask.run(WagonRepositoryConnector.java:895)
	at org.eclipse.aether.connector.wagon.WagonRepositoryConnector.put(WagonRepositoryConnector.java:522)
	at org.eclipse.aether.internal.impl.DefaultDeployer.deploy(DefaultDeployer.java:335)
	... 14 more
Caused by: org.apache.maven.wagon.TransferFailedException: Failed to transfer file: https://repository.apache.org/content/repositories/snapshots/org/apache/maven/skins/maven-application-skin/1.1-SNAPSHOT/maven-application-skin-1.1-20131129.044312-82.jar.
Return code is: 401, ReasonPhrase: Unauthorized.
	at org.apache.maven.wagon.shared.http4.AbstractHttpClientWagon.put(AbstractHttpClientWagon.java:626)
	at org.apache.maven.wagon.shared.http4.AbstractHttpClientWagon.put(AbstractHttpClientWagon.java:524)
	at org.apache.maven.wagon.shared.http4.AbstractHttpClientWagon.put(AbstractHttpClientWagon.java:505)
	at org.apache.maven.wagon.shared.http4.AbstractHttpClientWagon.put(AbstractHttpClientWagon.java:485)
	at org.eclipse.aether.connector.wagon.WagonRepositoryConnector$PutTask.run(WagonRepositoryConnector.java:871)
	... 16 more
[INFO] Deployment failed after 1.2 sec
Build step 'Deploy artifacts to Maven repository' changed build result to FAILURE

Mime
View raw message