maven-notifications mailing list archives

Site index · List index
Message view « Date » · « Thread »
Top « Date » · « Thread »
From Apache Jenkins Server <jenk...@builds.apache.org>
Subject Build failed in Jenkins: maven-plugins-ITs-m3-windows #404
Date Sat, 09 Nov 2013 22:21:01 GMT
See <https://builds.apache.org/job/maven-plugins-ITs-m3-windows/404/changes>

Changes:

[Robert Scholte] [MEAR-149] skinnyWars and SNAPSHOT unique dependencies

------------------------------------------
[...truncated 9456 lines...]
[INFO] --- maven-plugin-plugin:3.2:descriptor (default-descriptor) @ maven-shade-plugin ---
[INFO] Using 'UTF-8' encoding to read mojo metadata.
[INFO] Applying mojo extractor for language: java
[INFO] Mojo extractor for language: java found 0 mojo descriptors.
[INFO] Applying mojo extractor for language: bsh
[INFO] Mojo extractor for language: bsh found 0 mojo descriptors.
[INFO] Applying mojo extractor for language: java-annotations
[INFO] Mojo extractor for language: java-annotations found 0 mojo descriptors.
[INFO] 
[INFO] --- maven-remote-resources-plugin:1.4:process (default) @ maven-shade-plugin ---
[INFO] 
[INFO] --- maven-resources-plugin:2.6:resources (default-resources) @ maven-shade-plugin ---
[INFO] Using 'UTF-8' encoding to copy filtered resources.
[INFO] skip non existing resourceDirectory F:\hudson\hudson-slave\workspace\maven-plugins-ITs-m3-windows\maven-shade-plugin\src\main\resources
[INFO] Copying 3 resources
[INFO] 
[INFO] --- maven-compiler-plugin:3.0:compile (default-compile) @ maven-shade-plugin ---
[INFO] Changes detected - recompiling the module!
[INFO] Compiling 31 source files to F:\hudson\hudson-slave\workspace\maven-plugins-ITs-m3-windows\maven-shade-plugin\target\classes
[INFO] 
[INFO] --- maven-plugin-plugin:3.2:descriptor (mojo-descriptor) @ maven-shade-plugin ---
[INFO] Using 'UTF-8' encoding to read mojo metadata.
[INFO] Applying mojo extractor for language: java
[INFO] Mojo extractor for language: java found 0 mojo descriptors.
[INFO] Applying mojo extractor for language: bsh
[INFO] Mojo extractor for language: bsh found 0 mojo descriptors.
[INFO] Applying mojo extractor for language: java-annotations
[INFO] Mojo extractor for language: java-annotations found 2 mojo descriptors.
[INFO] 
[INFO] --- plexus-component-metadata:1.5.5:generate-metadata (default) @ maven-shade-plugin
---
[INFO] Discovered 1 component descriptors(s)
[INFO] 
[INFO] --- maven-resources-plugin:2.6:testResources (default-testResources) @ maven-shade-plugin
---
[INFO] Using 'UTF-8' encoding to copy filtered resources.
[INFO] Copying 3 resources
[INFO] Copying 3 resources
[INFO] 
[INFO] --- maven-compiler-plugin:3.0:testCompile (default-testCompile) @ maven-shade-plugin
---
[INFO] Changes detected - recompiling the module!
[INFO] Compiling 15 source files to F:\hudson\hudson-slave\workspace\maven-plugins-ITs-m3-windows\maven-shade-plugin\target\test-classes
[INFO] 
[INFO] --- plexus-component-metadata:1.5.5:generate-test-metadata (default) @ maven-shade-plugin
---
[INFO] Discovered 1 component descriptors(s)
[INFO] 
[INFO] --- maven-surefire-plugin:2.12.4:test (default-test) @ maven-shade-plugin ---
[INFO] Surefire report directory: F:\hudson\hudson-slave\workspace\maven-plugins-ITs-m3-windows\maven-shade-plugin\target\surefire-reports

-------------------------------------------------------
 T E S T S
-------------------------------------------------------
Running org.apache.maven.plugins.shade.DefaultShaderTest
Tests run: 4, Failures: 0, Errors: 0, Skipped: 0, Time elapsed: 1.566 sec
Running org.apache.maven.plugins.shade.filter.SimpleFilterTest
Tests run: 1, Failures: 0, Errors: 0, Skipped: 0, Time elapsed: 0 sec
Running org.apache.maven.plugins.shade.mojo.ArtifactIdTest
Tests run: 2, Failures: 0, Errors: 0, Skipped: 0, Time elapsed: 0 sec
Running org.apache.maven.plugins.shade.mojo.ArtifactSelectorTest
Tests run: 1, Failures: 0, Errors: 0, Skipped: 0, Time elapsed: 0.001 sec
Running org.apache.maven.plugins.shade.mojo.RelativizePathTest
Tests run: 1, Failures: 0, Errors: 0, Skipped: 0, Time elapsed: 0.056 sec
Running org.apache.maven.plugins.shade.mojo.ShadeMojoTest
Tests run: 4, Failures: 0, Errors: 0, Skipped: 0, Time elapsed: 1.52 sec
Running org.apache.maven.plugins.shade.relocation.SimpleRelocatorParameterTest
Tests run: 2, Failures: 0, Errors: 0, Skipped: 0, Time elapsed: 0.003 sec
Running org.apache.maven.plugins.shade.relocation.SimpleRelocatorTest
Tests run: 7, Failures: 0, Errors: 0, Skipped: 0, Time elapsed: 0.01 sec
Running org.apache.maven.plugins.shade.resource.ApacheLicenseResourceTransformerTest
Tests run: 1, Failures: 0, Errors: 0, Skipped: 0, Time elapsed: 0.002 sec
Running org.apache.maven.plugins.shade.resource.ApacheNoticeResourceTransformerTest
Tests run: 1, Failures: 0, Errors: 0, Skipped: 0, Time elapsed: 0.056 sec
Running org.apache.maven.plugins.shade.resource.AppendingTransformerTest
Tests run: 1, Failures: 0, Errors: 0, Skipped: 0, Time elapsed: 0 sec
Running org.apache.maven.plugins.shade.resource.ComponentsXmlResourceTransformerTest
Tests run: 1, Failures: 0, Errors: 0, Skipped: 0, Time elapsed: 0.062 sec
Running org.apache.maven.plugins.shade.resource.XmlAppendingTransformerTest
Tests run: 1, Failures: 0, Errors: 0, Skipped: 0, Time elapsed: 0.001 sec

Results :

Tests run: 27, Failures: 0, Errors: 0, Skipped: 0

[INFO] 
[INFO] --- maven-jar-plugin:2.4:jar (default-jar) @ maven-shade-plugin ---
[INFO] Building jar: F:\hudson\hudson-slave\workspace\maven-plugins-ITs-m3-windows\maven-shade-plugin\target\maven-shade-plugin-2.2-SNAPSHOT.jar
[INFO] 
[INFO] --- maven-plugin-plugin:3.2:addPluginArtifactMetadata (default-addPluginArtifactMetadata)
@ maven-shade-plugin ---
[INFO] 
[INFO] --- maven-jar-plugin:2.4:test-jar (default) @ maven-shade-plugin ---
[INFO] Building jar: F:\hudson\hudson-slave\workspace\maven-plugins-ITs-m3-windows\maven-shade-plugin\target\maven-shade-plugin-2.2-SNAPSHOT-tests.jar
[INFO] 
[INFO] --- maven-invoker-plugin:1.8:install (integration-test) @ maven-shade-plugin ---
[INFO] Installing F:\hudson\hudson-slave\workspace\maven-plugins-ITs-m3-windows\maven-plugins\pom.xml
to F:\hudson\hudson-slave\workspace\maven-plugins-ITs-m3-windows\maven-shade-plugin\target\local-repo\org\apache\maven\plugins\maven-plugins\25-SNAPSHOT\maven-plugins-25-SNAPSHOT.pom
[INFO] Installing F:\hudson\hudson-slave\workspace\maven-plugins-ITs-m3-windows\maven-plugins\target\maven-plugins-25-SNAPSHOT-site.xml
to F:\hudson\hudson-slave\workspace\maven-plugins-ITs-m3-windows\maven-shade-plugin\target\local-repo\org\apache\maven\plugins\maven-plugins\25-SNAPSHOT\maven-plugins-25-SNAPSHOT-site.xml
[INFO] Installing F:\hudson\hudson-slave\workspace\maven-plugins-ITs-m3-windows\maven-acr-plugin\pom.xml
to F:\hudson\hudson-slave\workspace\maven-plugins-ITs-m3-windows\maven-shade-plugin\target\local-repo\org\apache\maven\plugins\maven-acr-plugin\1.0.1-SNAPSHOT\maven-acr-plugin-1.0.1-SNAPSHOT.pom
[INFO] Installing F:\hudson\hudson-slave\workspace\maven-plugins-ITs-m3-windows\maven-acr-plugin\target\maven-acr-plugin-1.0.1-SNAPSHOT.jar
to F:\hudson\hudson-slave\workspace\maven-plugins-ITs-m3-windows\maven-shade-plugin\target\local-repo\org\apache\maven\plugins\maven-acr-plugin\1.0.1-SNAPSHOT\maven-acr-plugin-1.0.1-SNAPSHOT.jar
[INFO] Installing F:\hudson\hudson-slave\workspace\maven-plugins-ITs-m3-windows\maven-acr-plugin\pom.xml
to F:\hudson\hudson-slave\workspace\maven-plugins-ITs-m3-windows\maven-shade-plugin\target\local-repo\org\apache\maven\plugins\maven-acr-plugin\1.0.1-SNAPSHOT\maven-acr-plugin-1.0.1-SNAPSHOT.pom
[INFO] Installing F:\hudson\hudson-slave\workspace\maven-plugins-ITs-m3-windows\maven-ant-plugin\pom.xml
to F:\hudson\hudson-slave\workspace\maven-plugins-ITs-m3-windows\maven-shade-plugin\target\local-repo\org\apache\maven\plugins\maven-ant-plugin\2.4-SNAPSHOT\maven-ant-plugin-2.4-SNAPSHOT.pom
[INFO] Installing F:\hudson\hudson-slave\workspace\maven-plugins-ITs-m3-windows\maven-ant-plugin\target\maven-ant-plugin-2.4-SNAPSHOT.jar
to F:\hudson\hudson-slave\workspace\maven-plugins-ITs-m3-windows\maven-shade-plugin\target\local-repo\org\apache\maven\plugins\maven-ant-plugin\2.4-SNAPSHOT\maven-ant-plugin-2.4-SNAPSHOT.jar
[INFO] Installing F:\hudson\hudson-slave\workspace\maven-plugins-ITs-m3-windows\maven-ant-plugin\pom.xml
to F:\hudson\hudson-slave\workspace\maven-plugins-ITs-m3-windows\maven-shade-plugin\target\local-repo\org\apache\maven\plugins\maven-ant-plugin\2.4-SNAPSHOT\maven-ant-plugin-2.4-SNAPSHOT.pom
[INFO] Installing F:\hudson\hudson-slave\workspace\maven-plugins-ITs-m3-windows\maven-antrun-plugin\pom.xml
to F:\hudson\hudson-slave\workspace\maven-plugins-ITs-m3-windows\maven-shade-plugin\target\local-repo\org\apache\maven\plugins\maven-antrun-plugin\1.8-SNAPSHOT\maven-antrun-plugin-1.8-SNAPSHOT.pom
[INFO] Installing F:\hudson\hudson-slave\workspace\maven-plugins-ITs-m3-windows\maven-antrun-plugin\target\maven-antrun-plugin-1.8-SNAPSHOT.jar
to F:\hudson\hudson-slave\workspace\maven-plugins-ITs-m3-windows\maven-shade-plugin\target\local-repo\org\apache\maven\plugins\maven-antrun-plugin\1.8-SNAPSHOT\maven-antrun-plugin-1.8-SNAPSHOT.jar
[INFO] Installing F:\hudson\hudson-slave\workspace\maven-plugins-ITs-m3-windows\maven-antrun-plugin\pom.xml
to F:\hudson\hudson-slave\workspace\maven-plugins-ITs-m3-windows\maven-shade-plugin\target\local-repo\org\apache\maven\plugins\maven-antrun-plugin\1.8-SNAPSHOT\maven-antrun-plugin-1.8-SNAPSHOT.pom
[INFO] Installing F:\hudson\hudson-slave\workspace\maven-plugins-ITs-m3-windows\maven-eclipse-plugin\pom.xml
to F:\hudson\hudson-slave\workspace\maven-plugins-ITs-m3-windows\maven-shade-plugin\target\local-repo\org\apache\maven\plugins\maven-eclipse-plugin\2.10-SNAPSHOT\maven-eclipse-plugin-2.10-SNAPSHOT.pom
[INFO] Installing F:\hudson\hudson-slave\workspace\maven-plugins-ITs-m3-windows\maven-eclipse-plugin\target\maven-eclipse-plugin-2.10-SNAPSHOT.jar
to F:\hudson\hudson-slave\workspace\maven-plugins-ITs-m3-windows\maven-shade-plugin\target\local-repo\org\apache\maven\plugins\maven-eclipse-plugin\2.10-SNAPSHOT\maven-eclipse-plugin-2.10-SNAPSHOT.jar
[INFO] Installing F:\hudson\hudson-slave\workspace\maven-plugins-ITs-m3-windows\maven-eclipse-plugin\pom.xml
to F:\hudson\hudson-slave\workspace\maven-plugins-ITs-m3-windows\maven-shade-plugin\target\local-repo\org\apache\maven\plugins\maven-eclipse-plugin\2.10-SNAPSHOT\maven-eclipse-plugin-2.10-SNAPSHOT.pom
[INFO] Installing F:\hudson\hudson-slave\workspace\maven-plugins-ITs-m3-windows\maven-assembly-plugin\pom.xml
to F:\hudson\hudson-slave\workspace\maven-plugins-ITs-m3-windows\maven-shade-plugin\target\local-repo\org\apache\maven\plugins\maven-assembly-plugin\2.5-SNAPSHOT\maven-assembly-plugin-2.5-SNAPSHOT.pom
[INFO] Installing F:\hudson\hudson-slave\workspace\maven-plugins-ITs-m3-windows\maven-assembly-plugin\target\maven-assembly-plugin-2.5-SNAPSHOT.jar
to F:\hudson\hudson-slave\workspace\maven-plugins-ITs-m3-windows\maven-shade-plugin\target\local-repo\org\apache\maven\plugins\maven-assembly-plugin\2.5-SNAPSHOT\maven-assembly-plugin-2.5-SNAPSHOT.jar
[INFO] Installing F:\hudson\hudson-slave\workspace\maven-plugins-ITs-m3-windows\maven-assembly-plugin\pom.xml
to F:\hudson\hudson-slave\workspace\maven-plugins-ITs-m3-windows\maven-shade-plugin\target\local-repo\org\apache\maven\plugins\maven-assembly-plugin\2.5-SNAPSHOT\maven-assembly-plugin-2.5-SNAPSHOT.pom
[INFO] Installing F:\hudson\hudson-slave\workspace\maven-plugins-ITs-m3-windows\maven-changelog-plugin\pom.xml
to F:\hudson\hudson-slave\workspace\maven-plugins-ITs-m3-windows\maven-shade-plugin\target\local-repo\org\apache\maven\plugins\maven-changelog-plugin\2.3-SNAPSHOT\maven-changelog-plugin-2.3-SNAPSHOT.pom
[INFO] Installing F:\hudson\hudson-slave\workspace\maven-plugins-ITs-m3-windows\maven-changelog-plugin\target\maven-changelog-plugin-2.3-SNAPSHOT.jar
to F:\hudson\hudson-slave\workspace\maven-plugins-ITs-m3-windows\maven-shade-plugin\target\local-repo\org\apache\maven\plugins\maven-changelog-plugin\2.3-SNAPSHOT\maven-changelog-plugin-2.3-SNAPSHOT.jar
[INFO] Installing F:\hudson\hudson-slave\workspace\maven-plugins-ITs-m3-windows\maven-changelog-plugin\pom.xml
to F:\hudson\hudson-slave\workspace\maven-plugins-ITs-m3-windows\maven-shade-plugin\target\local-repo\org\apache\maven\plugins\maven-changelog-plugin\2.3-SNAPSHOT\maven-changelog-plugin-2.3-SNAPSHOT.pom
[INFO] Installing F:\hudson\hudson-slave\workspace\maven-plugins-ITs-m3-windows\maven-changes-plugin\pom.xml
to F:\hudson\hudson-slave\workspace\maven-plugins-ITs-m3-windows\maven-shade-plugin\target\local-repo\org\apache\maven\plugins\maven-changes-plugin\2.10-SNAPSHOT\maven-changes-plugin-2.10-SNAPSHOT.pom
[INFO] Installing F:\hudson\hudson-slave\workspace\maven-plugins-ITs-m3-windows\maven-changes-plugin\target\maven-changes-plugin-2.10-SNAPSHOT.jar
to F:\hudson\hudson-slave\workspace\maven-plugins-ITs-m3-windows\maven-shade-plugin\target\local-repo\org\apache\maven\plugins\maven-changes-plugin\2.10-SNAPSHOT\maven-changes-plugin-2.10-SNAPSHOT.jar
[INFO] Installing F:\hudson\hudson-slave\workspace\maven-plugins-ITs-m3-windows\maven-changes-plugin\pom.xml
to F:\hudson\hudson-slave\workspace\maven-plugins-ITs-m3-windows\maven-shade-plugin\target\local-repo\org\apache\maven\plugins\maven-changes-plugin\2.10-SNAPSHOT\maven-changes-plugin-2.10-SNAPSHOT.pom
[INFO] Installing F:\hudson\hudson-slave\workspace\maven-plugins-ITs-m3-windows\maven-checkstyle-plugin\pom.xml
to F:\hudson\hudson-slave\workspace\maven-plugins-ITs-m3-windows\maven-shade-plugin\target\local-repo\org\apache\maven\plugins\maven-checkstyle-plugin\2.11-SNAPSHOT\maven-checkstyle-plugin-2.11-SNAPSHOT.pom
[INFO] Installing F:\hudson\hudson-slave\workspace\maven-plugins-ITs-m3-windows\maven-checkstyle-plugin\target\maven-checkstyle-plugin-2.11-SNAPSHOT.jar
to F:\hudson\hudson-slave\workspace\maven-plugins-ITs-m3-windows\maven-shade-plugin\target\local-repo\org\apache\maven\plugins\maven-checkstyle-plugin\2.11-SNAPSHOT\maven-checkstyle-plugin-2.11-SNAPSHOT.jar
[INFO] Installing F:\hudson\hudson-slave\workspace\maven-plugins-ITs-m3-windows\maven-checkstyle-plugin\pom.xml
to F:\hudson\hudson-slave\workspace\maven-plugins-ITs-m3-windows\maven-shade-plugin\target\local-repo\org\apache\maven\plugins\maven-checkstyle-plugin\2.11-SNAPSHOT\maven-checkstyle-plugin-2.11-SNAPSHOT.pom
[INFO] Installing F:\hudson\hudson-slave\workspace\maven-plugins-ITs-m3-windows\maven-clean-plugin\pom.xml
to F:\hudson\hudson-slave\workspace\maven-plugins-ITs-m3-windows\maven-shade-plugin\target\local-repo\org\apache\maven\plugins\maven-clean-plugin\2.6-SNAPSHOT\maven-clean-plugin-2.6-SNAPSHOT.pom
[INFO] Installing F:\hudson\hudson-slave\workspace\maven-plugins-ITs-m3-windows\maven-clean-plugin\target\maven-clean-plugin-2.6-SNAPSHOT.jar
to F:\hudson\hudson-slave\workspace\maven-plugins-ITs-m3-windows\maven-shade-plugin\target\local-repo\org\apache\maven\plugins\maven-clean-plugin\2.6-SNAPSHOT\maven-clean-plugin-2.6-SNAPSHOT.jar
[INFO] Installing F:\hudson\hudson-slave\workspace\maven-plugins-ITs-m3-windows\maven-clean-plugin\pom.xml
to F:\hudson\hudson-slave\workspace\maven-plugins-ITs-m3-windows\maven-shade-plugin\target\local-repo\org\apache\maven\plugins\maven-clean-plugin\2.6-SNAPSHOT\maven-clean-plugin-2.6-SNAPSHOT.pom
[INFO] Installing F:\hudson\hudson-slave\workspace\maven-plugins-ITs-m3-windows\maven-compiler-plugin\pom.xml
to F:\hudson\hudson-slave\workspace\maven-plugins-ITs-m3-windows\maven-shade-plugin\target\local-repo\org\apache\maven\plugins\maven-compiler-plugin\3.2-SNAPSHOT\maven-compiler-plugin-3.2-SNAPSHOT.pom
[INFO] Installing F:\hudson\hudson-slave\workspace\maven-plugins-ITs-m3-windows\maven-compiler-plugin\target\maven-compiler-plugin-3.2-SNAPSHOT.jar
to F:\hudson\hudson-slave\workspace\maven-plugins-ITs-m3-windows\maven-shade-plugin\target\local-repo\org\apache\maven\plugins\maven-compiler-plugin\3.2-SNAPSHOT\maven-compiler-plugin-3.2-SNAPSHOT.jar
[INFO] Installing F:\hudson\hudson-slave\workspace\maven-plugins-ITs-m3-windows\maven-compiler-plugin\pom.xml
to F:\hudson\hudson-slave\workspace\maven-plugins-ITs-m3-windows\maven-shade-plugin\target\local-repo\org\apache\maven\plugins\maven-compiler-plugin\3.2-SNAPSHOT\maven-compiler-plugin-3.2-SNAPSHOT.pom
[INFO] Installing F:\hudson\hudson-slave\workspace\maven-plugins-ITs-m3-windows\maven-dependency-plugin\pom.xml
to F:\hudson\hudson-slave\workspace\maven-plugins-ITs-m3-windows\maven-shade-plugin\target\local-repo\org\apache\maven\plugins\maven-dependency-plugin\2.9-SNAPSHOT\maven-dependency-plugin-2.9-SNAPSHOT.pom
[INFO] Installing F:\hudson\hudson-slave\workspace\maven-plugins-ITs-m3-windows\maven-dependency-plugin\target\maven-dependency-plugin-2.9-SNAPSHOT.jar
to F:\hudson\hudson-slave\workspace\maven-plugins-ITs-m3-windows\maven-shade-plugin\target\local-repo\org\apache\maven\plugins\maven-dependency-plugin\2.9-SNAPSHOT\maven-dependency-plugin-2.9-SNAPSHOT.jar
[INFO] Installing F:\hudson\hudson-slave\workspace\maven-plugins-ITs-m3-windows\maven-dependency-plugin\pom.xml
to F:\hudson\hudson-slave\workspace\maven-plugins-ITs-m3-windows\maven-shade-plugin\target\local-repo\org\apache\maven\plugins\maven-dependency-plugin\2.9-SNAPSHOT\maven-dependency-plugin-2.9-SNAPSHOT.pom
[INFO] Installing F:\hudson\hudson-slave\workspace\maven-plugins-ITs-m3-windows\maven-deploy-plugin\pom.xml
to F:\hudson\hudson-slave\workspace\maven-plugins-ITs-m3-windows\maven-shade-plugin\target\local-repo\org\apache\maven\plugins\maven-deploy-plugin\2.9-SNAPSHOT\maven-deploy-plugin-2.9-SNAPSHOT.pom
[INFO] Installing F:\hudson\hudson-slave\workspace\maven-plugins-ITs-m3-windows\maven-deploy-plugin\target\maven-deploy-plugin-2.9-SNAPSHOT.jar
to F:\hudson\hudson-slave\workspace\maven-plugins-ITs-m3-windows\maven-shade-plugin\target\local-repo\org\apache\maven\plugins\maven-deploy-plugin\2.9-SNAPSHOT\maven-deploy-plugin-2.9-SNAPSHOT.jar
[INFO] Installing F:\hudson\hudson-slave\workspace\maven-plugins-ITs-m3-windows\maven-deploy-plugin\pom.xml
to F:\hudson\hudson-slave\workspace\maven-plugins-ITs-m3-windows\maven-shade-plugin\target\local-repo\org\apache\maven\plugins\maven-deploy-plugin\2.9-SNAPSHOT\maven-deploy-plugin-2.9-SNAPSHOT.pom
[INFO] Installing F:\hudson\hudson-slave\workspace\maven-plugins-ITs-m3-windows\maven-doap-plugin\pom.xml
to F:\hudson\hudson-slave\workspace\maven-plugins-ITs-m3-windows\maven-shade-plugin\target\local-repo\org\apache\maven\plugins\maven-doap-plugin\1.2-SNAPSHOT\maven-doap-plugin-1.2-SNAPSHOT.pom
[INFO] Installing F:\hudson\hudson-slave\workspace\maven-plugins-ITs-m3-windows\maven-doap-plugin\target\maven-doap-plugin-1.2-SNAPSHOT.jar
to F:\hudson\hudson-slave\workspace\maven-plugins-ITs-m3-windows\maven-shade-plugin\target\local-repo\org\apache\maven\plugins\maven-doap-plugin\1.2-SNAPSHOT\maven-doap-plugin-1.2-SNAPSHOT.jar
[INFO] Installing F:\hudson\hudson-slave\workspace\maven-plugins-ITs-m3-windows\maven-doap-plugin\pom.xml
to F:\hudson\hudson-slave\workspace\maven-plugins-ITs-m3-windows\maven-shade-plugin\target\local-repo\org\apache\maven\plugins\maven-doap-plugin\1.2-SNAPSHOT\maven-doap-plugin-1.2-SNAPSHOT.pom
[INFO] Installing F:\hudson\hudson-slave\workspace\maven-plugins-ITs-m3-windows\maven-docck-plugin\pom.xml
to F:\hudson\hudson-slave\workspace\maven-plugins-ITs-m3-windows\maven-shade-plugin\target\local-repo\org\apache\maven\plugins\maven-docck-plugin\1.1-SNAPSHOT\maven-docck-plugin-1.1-SNAPSHOT.pom
[INFO] Installing F:\hudson\hudson-slave\workspace\maven-plugins-ITs-m3-windows\maven-docck-plugin\target\maven-docck-plugin-1.1-SNAPSHOT.jar
to F:\hudson\hudson-slave\workspace\maven-plugins-ITs-m3-windows\maven-shade-plugin\target\local-repo\org\apache\maven\plugins\maven-docck-plugin\1.1-SNAPSHOT\maven-docck-plugin-1.1-SNAPSHOT.jar
[INFO] Installing F:\hudson\hudson-slave\workspace\maven-plugins-ITs-m3-windows\maven-docck-plugin\pom.xml
to F:\hudson\hudson-slave\workspace\maven-plugins-ITs-m3-windows\maven-shade-plugin\target\local-repo\org\apache\maven\plugins\maven-docck-plugin\1.1-SNAPSHOT\maven-docck-plugin-1.1-SNAPSHOT.pom
[INFO] Installing F:\hudson\hudson-slave\workspace\maven-plugins-ITs-m3-windows\maven-ear-plugin\pom.xml
to F:\hudson\hudson-slave\workspace\maven-plugins-ITs-m3-windows\maven-shade-plugin\target\local-repo\org\apache\maven\plugins\maven-ear-plugin\2.9-SNAPSHOT\maven-ear-plugin-2.9-SNAPSHOT.pom
[INFO]                                                                         
[INFO] ------------------------------------------------------------------------
[INFO] Building Apache Maven Plugins Aggregator 1-SNAPSHOT
[INFO] ------------------------------------------------------------------------
[INFO] 
[INFO] --- maven-clean-plugin:2.4.1:clean (default-clean) @ maven-plugins-aggregator ---
[INFO] Deleting <https://builds.apache.org/job/maven-plugins-ITs-m3-windows/ws/target>
[INFO] 
[INFO] --- maven-remote-resources-plugin:1.1:process (default) @ maven-plugins-aggregator
---
[INFO] Setting property: classpath.resource.loader.class => 'org.codehaus.plexus.velocity.ContextClassLoaderResourceLoader'.
[INFO] Setting property: velocimacro.messages.on => 'false'.
[INFO] Setting property: resource.loader => 'classpath'.
[INFO] Setting property: resource.manager.logwhenfound => 'false'.
[INFO] 
[INFO] --- maven-install-plugin:2.3.1:install (default-install) @ maven-plugins-aggregator
---
[INFO] Installing <https://builds.apache.org/job/maven-plugins-ITs-m3-windows/ws/pom.xml>
to C:\Users\hudson\.m2\repository\org\apache\maven\plugins\maven-plugins-aggregator\1-SNAPSHOT\maven-plugins-aggregator-1-SNAPSHOT.pom
[INFO] ------------------------------------------------------------------------
[INFO] Reactor Summary:
[INFO] 
[INFO] Apache Maven Plugins .............................. SUCCESS [9.461s]
[INFO] Apache Maven ACR Plugin ........................... SUCCESS [42.782s]
[INFO] Apache Maven Ant Plugin ........................... SUCCESS [2:03.090s]
[INFO] Apache Maven AntRun Plugin ........................ SUCCESS [1:20.830s]
[INFO] Apache Maven Eclipse Plugin ....................... SUCCESS [12:30.015s]
[INFO] Apache Maven Assembly Plugin ...................... SUCCESS [15:00.083s]
[INFO] Apache Maven Changelog Plugin ..................... SUCCESS [1:25.930s]
[INFO] Apache Maven Changes Plugin ....................... SUCCESS [1:42.960s]
[INFO] Apache Maven Checkstyle Plugin .................... SUCCESS [2:46.737s]
[INFO] Apache Maven Clean Plugin ......................... SUCCESS [25.248s]
[INFO] Apache Maven Compiler Plugin ...................... SUCCESS [3:47.606s]
[INFO] Apache Maven Dependency Plugin .................... SUCCESS [4:25.119s]
[INFO] Apache Maven Deploy Plugin ........................ SUCCESS [2:03.018s]
[INFO] Apache Maven DOAP Plugin .......................... SUCCESS [13.373s]
[INFO] Apache Maven Documentation Checker Plugin ......... SUCCESS [13.336s]
[INFO] Apache Maven EAR Plugin ........................... FAILURE [40.632s]
[INFO] Apache Maven EJB Plugin ........................... SUCCESS [44.150s]
[INFO] Apache Maven Help Plugin .......................... FAILURE [9.930s]
[INFO] Apache Maven Install Plugin ....................... SUCCESS [1:34.230s]
[INFO] Apache Maven JAR Plugin ........................... FAILURE [9.541s]
[INFO] Apache Maven Jarsigner Plugin ..................... SUCCESS [37.705s]
[INFO] Apache Maven Javadoc Plugin ....................... FAILURE [2:37.907s]
[INFO] Apache Maven Linkcheck Plugin ..................... SUCCESS [4.246s]
[INFO] Apache Maven Patch Plugin ......................... SUCCESS [8.813s]
[INFO] Apache Maven PDF Plugin ........................... SUCCESS [56.641s]
[INFO] Apache Maven PMD Plugin ........................... SUCCESS [2:41.929s]
[INFO] Apache Maven RAR Plugin ........................... SUCCESS [20.127s]
[INFO] Apache Maven Reactor Plugin ....................... SUCCESS [3.258s]
[INFO] Apache Maven Repository Plugin .................... SUCCESS [1:14.883s]
[INFO] Apache Maven Resources Plugin ..................... SUCCESS [1:20.552s]
[INFO] Apache Maven Site Plugin 3 ........................ FAILURE [1:10.706s]
[INFO] Apache Maven Source Plugin ........................ FAILURE [10.644s]
[INFO] Apache Maven Stage Plugin ......................... SUCCESS [3.207s]
[INFO] Apache Maven Toolchains Plugin .................... SUCCESS [2.455s]
[INFO] Apache Maven Verifier Plugin ...................... SUCCESS [27.178s]
[INFO] Apache Maven WAR Plugin ........................... FAILURE [21.180s]
[INFO] Apache Maven SCM Publish Plugin ................... SUCCESS [2:00.198s]
[INFO] Apache Maven Invoker Plugin ....................... FAILURE [48.154s]
[INFO] Apache Maven Project Info Reports Plugin .......... SUCCESS [2:58.615s]
[INFO] Apache Maven Remote Resources Plugin .............. SUCCESS [1:48.263s]
[INFO] Apache Maven Shade Plugin ......................... FAILURE [39.078s]
[INFO] Apache Maven Plugins Aggregator ................... SUCCESS [1.061s]
[INFO] ------------------------------------------------------------------------
[INFO] BUILD FAILURE
[INFO] ------------------------------------------------------------------------
[INFO] Total time: 1:12:48.060s
[INFO] Finished at: Sat Nov 09 22:14:58 GMT 2013
[INFO] Final Memory: 124M/408M
[INFO] ------------------------------------------------------------------------
[WARNING] The requested profile "apache.snapshots" could not be activated because it does
not exist.
[ERROR] Failed to execute goal org.apache.maven.plugins:maven-compiler-plugin:3.0:testCompile
(default-testCompile) on project maven-ear-plugin: Compilation failure: Compilation failure:
[ERROR] F:\hudson\hudson-slave\workspace\maven-plugins-ITs-m3-windows\maven-ear-plugin\src\test\java\org\apache\maven\plugin\ear\output\TestAbstractFileNameMapping.java:[23,26]
package org.mockito does not exist
[ERROR] F:\hudson\hudson-slave\workspace\maven-plugins-ITs-m3-windows\maven-ear-plugin\src\test\java\org\apache\maven\plugin\ear\output\TestAbstractFileNameMapping.java:[42,34]
cannot find symbol
[ERROR] symbol  : method mock(java.lang.Class<org.apache.maven.artifact.handler.ArtifactHandler>)
[ERROR] location: class org.apache.maven.plugin.ear.output.TestAbstractFileNameMapping
[ERROR] F:\hudson\hudson-slave\workspace\maven-plugins-ITs-m3-windows\maven-ear-plugin\src\test\java\org\apache\maven\plugin\ear\output\TestAbstractFileNameMapping.java:[43,8]
cannot find symbol
[ERROR] symbol  : method when(java.lang.String)
[ERROR] location: class org.apache.maven.plugin.ear.output.TestAbstractFileNameMapping
[ERROR] F:\hudson\hudson-slave\workspace\maven-plugins-ITs-m3-windows\maven-ear-plugin\src\test\java\org\apache\maven\plugin\ear\output\TestAbstractFileNameMapping.java:[45,28]
cannot find symbol
[ERROR] symbol  : method mock(java.lang.Class<org.apache.maven.artifact.Artifact>)
[ERROR] location: class org.apache.maven.plugin.ear.output.TestAbstractFileNameMapping
[ERROR] F:\hudson\hudson-slave\workspace\maven-plugins-ITs-m3-windows\maven-ear-plugin\src\test\java\org\apache\maven\plugin\ear\output\TestAbstractFileNameMapping.java:[46,8]
cannot find symbol
[ERROR] symbol  : method when(org.apache.maven.artifact.handler.ArtifactHandler)
[ERROR] location: class org.apache.maven.plugin.ear.output.TestAbstractFileNameMapping
[ERROR] F:\hudson\hudson-slave\workspace\maven-plugins-ITs-m3-windows\maven-ear-plugin\src\test\java\org\apache\maven\plugin\ear\output\TestAbstractFileNameMapping.java:[47,8]
cannot find symbol
[ERROR] symbol  : method when(java.lang.String)
[ERROR] location: class org.apache.maven.plugin.ear.output.TestAbstractFileNameMapping
[ERROR] F:\hudson\hudson-slave\workspace\maven-plugins-ITs-m3-windows\maven-ear-plugin\src\test\java\org\apache\maven\plugin\ear\output\TestAbstractFileNameMapping.java:[48,8]
cannot find symbol
[ERROR] symbol  : method when(java.lang.String)
[ERROR] location: class org.apache.maven.plugin.ear.output.TestAbstractFileNameMapping
[ERROR] F:\hudson\hudson-slave\workspace\maven-plugins-ITs-m3-windows\maven-ear-plugin\src\test\java\org\apache\maven\plugin\ear\output\TestAbstractFileNameMapping.java:[49,8]
cannot find symbol
[ERROR] symbol  : method when(java.lang.String)
[ERROR] location: class org.apache.maven.plugin.ear.output.TestAbstractFileNameMapping
[ERROR] -> [Help 1]
[ERROR] Failed to execute goal org.apache.maven.plugins:maven-invoker-plugin:1.8:install (integration-test)
on project maven-help-plugin: Failed to install project dependencies: MavenProject: org.apache.maven.plugins:maven-help-plugin:2.2.1-SNAPSHOT
@ F:\hudson\hudson-slave\workspace\maven-plugins-ITs-m3-windows\maven-help-plugin\pom.xml:
Failed to install project artifacts: MavenProject: org.apache.maven.plugins:maven-ear-plugin:2.9-SNAPSHOT
@ F:\hudson\hudson-slave\workspace\maven-plugins-ITs-m3-windows\maven-ear-plugin\pom.xml:
Failed to install artifact: org.apache.maven.plugins:maven-ear-plugin:maven-plugin:2.9-SNAPSHOT:
Artifact is not fully assembled: F:\hudson\hudson-slave\workspace\maven-plugins-ITs-m3-windows\maven-ear-plugin\target\classes
-> [Help 2]
[ERROR] Failed to execute goal org.apache.maven.plugins:maven-invoker-plugin:1.8:install (integration-test)
on project maven-jar-plugin: Failed to install project dependencies: MavenProject: org.apache.maven.plugins:maven-jar-plugin:2.5-SNAPSHOT
@ F:\hudson\hudson-slave\workspace\maven-plugins-ITs-m3-windows\maven-jar-plugin\pom.xml:
Failed to install project artifacts: MavenProject: org.apache.maven.plugins:maven-ear-plugin:2.9-SNAPSHOT
@ F:\hudson\hudson-slave\workspace\maven-plugins-ITs-m3-windows\maven-ear-plugin\pom.xml:
Failed to install artifact: org.apache.maven.plugins:maven-ear-plugin:maven-plugin:2.9-SNAPSHOT:
Artifact is not fully assembled: F:\hudson\hudson-slave\workspace\maven-plugins-ITs-m3-windows\maven-ear-plugin\target\classes
-> [Help 2]
[ERROR] Failed to execute goal org.apache.maven.plugins:maven-invoker-plugin:1.8:install (integration-test)
on project maven-javadoc-plugin: Failed to install project dependencies: MavenProject: org.apache.maven.plugins:maven-javadoc-plugin:2.9.2-SNAPSHOT
@ F:\hudson\hudson-slave\workspace\maven-plugins-ITs-m3-windows\maven-javadoc-plugin\pom.xml:
Failed to install project artifacts: MavenProject: org.apache.maven.plugins:maven-ear-plugin:2.9-SNAPSHOT
@ F:\hudson\hudson-slave\workspace\maven-plugins-ITs-m3-windows\maven-ear-plugin\pom.xml:
Failed to install artifact: org.apache.maven.plugins:maven-ear-plugin:maven-plugin:2.9-SNAPSHOT:
Artifact is not fully assembled: F:\hudson\hudson-slave\workspace\maven-plugins-ITs-m3-windows\maven-ear-plugin\target\classes
-> [Help 2]
[ERROR] Failed to execute goal org.apache.maven.plugins:maven-invoker-plugin:1.8:install (integration-test)
on project maven-site-plugin: Failed to install project dependencies: MavenProject: org.apache.maven.plugins:maven-site-plugin:3.4-SNAPSHOT
@ F:\hudson\hudson-slave\workspace\maven-plugins-ITs-m3-windows\maven-site-plugin\dependency-reduced-pom.xml:
Failed to install project artifacts: MavenProject: org.apache.maven.plugins:maven-ear-plugin:2.9-SNAPSHOT
@ F:\hudson\hudson-slave\workspace\maven-plugins-ITs-m3-windows\maven-ear-plugin\pom.xml:
Failed to install artifact: org.apache.maven.plugins:maven-ear-plugin:maven-plugin:2.9-SNAPSHOT:
Artifact is not fully assembled: F:\hudson\hudson-slave\workspace\maven-plugins-ITs-m3-windows\maven-ear-plugin\target\classes
-> [Help 2]
[ERROR] Failed to execute goal org.apache.maven.plugins:maven-invoker-plugin:1.8:install (integration-test)
on project maven-source-plugin: Failed to install project dependencies: MavenProject: org.apache.maven.plugins:maven-source-plugin:2.3-SNAPSHOT
@ F:\hudson\hudson-slave\workspace\maven-plugins-ITs-m3-windows\maven-source-plugin\pom.xml:
Failed to install project artifacts: MavenProject: org.apache.maven.plugins:maven-ear-plugin:2.9-SNAPSHOT
@ F:\hudson\hudson-slave\workspace\maven-plugins-ITs-m3-windows\maven-ear-plugin\pom.xml:
Failed to install artifact: org.apache.maven.plugins:maven-ear-plugin:maven-plugin:2.9-SNAPSHOT:
Artifact is not fully assembled: F:\hudson\hudson-slave\workspace\maven-plugins-ITs-m3-windows\maven-ear-plugin\target\classes
-> [Help 2]
[ERROR] Failed to execute goal org.apache.maven.plugins:maven-invoker-plugin:1.8:install (integration-test)
on project maven-war-plugin: Failed to install project dependencies: MavenProject: org.apache.maven.plugins:maven-war-plugin:2.5-SNAPSHOT
@ F:\hudson\hudson-slave\workspace\maven-plugins-ITs-m3-windows\maven-war-plugin\pom.xml:
Failed to install project artifacts: MavenProject: org.apache.maven.plugins:maven-ear-plugin:2.9-SNAPSHOT
@ F:\hudson\hudson-slave\workspace\maven-plugins-ITs-m3-windows\maven-ear-plugin\pom.xml:
Failed to install artifact: org.apache.maven.plugins:maven-ear-plugin:maven-plugin:2.9-SNAPSHOT:
Artifact is not fully assembled: F:\hudson\hudson-slave\workspace\maven-plugins-ITs-m3-windows\maven-ear-plugin\target\classes
-> [Help 2]
[ERROR] Failed to execute goal org.apache.maven.plugins:maven-invoker-plugin:1.8:install (integration-test)
on project maven-invoker-plugin: Failed to install project dependencies: MavenProject: org.apache.maven.plugins:maven-invoker-plugin:1.9-SNAPSHOT
@ F:\hudson\hudson-slave\workspace\maven-plugins-ITs-m3-windows\maven-invoker-plugin\pom.xml:
Failed to install project artifacts: MavenProject: org.apache.maven.plugins:maven-ear-plugin:2.9-SNAPSHOT
@ F:\hudson\hudson-slave\workspace\maven-plugins-ITs-m3-windows\maven-ear-plugin\pom.xml:
Failed to install artifact: org.apache.maven.plugins:maven-ear-plugin:maven-plugin:2.9-SNAPSHOT:
Artifact is not fully assembled: F:\hudson\hudson-slave\workspace\maven-plugins-ITs-m3-windows\maven-ear-plugin\target\classes
-> [Help 2]
[ERROR] Failed to execute goal org.apache.maven.plugins:maven-invoker-plugin:1.8:install (integration-test)
on project maven-shade-plugin: Failed to install project dependencies: MavenProject: org.apache.maven.plugins:maven-shade-plugin:2.2-SNAPSHOT
@ F:\hudson\hudson-slave\workspace\maven-plugins-ITs-m3-windows\maven-shade-plugin\pom.xml:
Failed to install project artifacts: MavenProject: org.apache.maven.plugins:maven-ear-plugin:2.9-SNAPSHOT
@ F:\hudson\hudson-slave\workspace\maven-plugins-ITs-m3-windows\maven-ear-plugin\pom.xml:
Failed to install artifact: org.apache.maven.plugins:maven-ear-plugin:maven-plugin:2.9-SNAPSHOT:
Artifact is not fully assembled: F:\hudson\hudson-slave\workspace\maven-plugins-ITs-m3-windows\maven-ear-plugin\target\classes
-> [Help 2]
[ERROR] 
[ERROR] To see the full stack trace of the errors, re-run Maven with the -e switch.
[ERROR] Re-run Maven using the -X switch to enable full debug logging.
[ERROR] 
[ERROR] For more information about the errors and possible solutions, please read the following
articles:
[ERROR] [Help 1] http://cwiki.apache.org/confluence/display/MAVEN/MojoFailureException
[ERROR] [Help 2] http://cwiki.apache.org/confluence/display/MAVEN/MojoExecutionException
[ERROR] 
[ERROR] After correcting the problems, you can resume the build with the command
[ERROR]   mvn <goals> -rf :maven-ear-plugin
Build step 'Invoke top-level Maven targets' marked build as failure
Recording test results

Mime
View raw message