maven-notifications mailing list archives

Site index · List index
Message view « Date » · « Thread »
Top « Date » · « Thread »
From Apache Jenkins Server <jenk...@builds.apache.org>
Subject Build failed in Jenkins: maven-plugin-testing #27
Date Thu, 21 Nov 2013 23:22:07 GMT
See <https://builds.apache.org/job/maven-plugin-testing/27/changes>

Changes:

[olamy] fix scm info

------------------------------------------
[...truncated 391 lines...]
[JENKINS] Recording test results
[INFO] 
[INFO] --- maven-jar-plugin:2.4:jar (default-jar) @ maven-plugin-testing-harness ---
[INFO] Downloading: http://repo.maven.apache.org/maven2/org/codehaus/plexus/plexus-interpolation/1.15/plexus-interpolation-1.15.jar
[INFO] Downloading: http://repo.maven.apache.org/maven2/org/codehaus/plexus/plexus-archiver/2.1/plexus-archiver-2.1.jar
[INFO] Downloading: http://repo.maven.apache.org/maven2/org/codehaus/plexus/plexus-io/2.0.2/plexus-io-2.0.2.jar
[INFO] Downloaded: http://repo.maven.apache.org/maven2/org/codehaus/plexus/plexus-interpolation/1.15/plexus-interpolation-1.15.jar
(60 KB at 413.0 KB/sec)
[INFO] Downloaded: http://repo.maven.apache.org/maven2/org/codehaus/plexus/plexus-io/2.0.2/plexus-io-2.0.2.jar
(57 KB at 403.5 KB/sec)
[INFO] Downloaded: http://repo.maven.apache.org/maven2/org/codehaus/plexus/plexus-archiver/2.1/plexus-archiver-2.1.jar
(181 KB at 1006.2 KB/sec)
[INFO] Building jar: <https://builds.apache.org/job/maven-plugin-testing/ws/maven-plugin-testing-harness/target/maven-plugin-testing-harness-3.0.0-SNAPSHOT.jar>
[INFO] 
[INFO] >>> maven-source-plugin:2.2.1:jar (default) @ maven-plugin-testing-harness
>>>
[WARNING] Failed to getClass for org.apache.maven.plugin.source.SourceJarMojo
[INFO] 
[INFO] <<< maven-source-plugin:2.2.1:jar (default) @ maven-plugin-testing-harness
<<<
[INFO] 
[INFO] --- maven-source-plugin:2.2.1:jar (default) @ maven-plugin-testing-harness ---
[INFO] Downloading: http://repo.maven.apache.org/maven2/org/codehaus/plexus/plexus-utils/3.0.7/plexus-utils-3.0.7.pom
[INFO] Downloaded: http://repo.maven.apache.org/maven2/org/codehaus/plexus/plexus-utils/3.0.7/plexus-utils-3.0.7.pom
(3 KB at 58.4 KB/sec)
[INFO] Building jar: <https://builds.apache.org/job/maven-plugin-testing/ws/maven-plugin-testing-harness/target/maven-plugin-testing-harness-3.0.0-SNAPSHOT-sources.jar>
[INFO] 
[INFO] --- maven-install-plugin:2.3.1:install (default-install) @ maven-plugin-testing-harness
---
[INFO] Installing <https://builds.apache.org/job/maven-plugin-testing/ws/maven-plugin-testing-harness/target/maven-plugin-testing-harness-3.0.0-SNAPSHOT.jar>
to /var/jenkins/hudson-slave/maven-repositories/0/org/apache/maven/plugin-testing/maven-plugin-testing-harness/3.0.0-SNAPSHOT/maven-plugin-testing-harness-3.0.0-SNAPSHOT.jar
[INFO] Installing <https://builds.apache.org/job/maven-plugin-testing/ws/maven-plugin-testing-harness/pom.xml>
to /var/jenkins/hudson-slave/maven-repositories/0/org/apache/maven/plugin-testing/maven-plugin-testing-harness/3.0.0-SNAPSHOT/maven-plugin-testing-harness-3.0.0-SNAPSHOT.pom
[INFO] Installing <https://builds.apache.org/job/maven-plugin-testing/ws/maven-plugin-testing-harness/target/maven-plugin-testing-harness-3.0.0-SNAPSHOT-sources.jar>
to /var/jenkins/hudson-slave/maven-repositories/0/org/apache/maven/plugin-testing/maven-plugin-testing-harness/3.0.0-SNAPSHOT/maven-plugin-testing-harness-3.0.0-SNAPSHOT-sources.jar
[INFO]                                                                         
[INFO] ------------------------------------------------------------------------
[INFO] Building Maven Testing Tools 3.0.0-SNAPSHOT
[INFO] ------------------------------------------------------------------------
[INFO] Downloading: http://repo.maven.apache.org/maven2/org/easymock/easymock/3.2/easymock-3.2.pom
[INFO] Downloaded: http://repo.maven.apache.org/maven2/org/easymock/easymock/3.2/easymock-3.2.pom
(5 KB at 48.1 KB/sec)
[INFO] Downloading: http://repo.maven.apache.org/maven2/org/easymock/easymock-parent/3.2/easymock-parent-3.2.pom
[INFO] Downloaded: http://repo.maven.apache.org/maven2/org/easymock/easymock-parent/3.2/easymock-parent-3.2.pom
(17 KB at 271.3 KB/sec)
[INFO] Downloading: http://repo.maven.apache.org/maven2/cglib/cglib-nodep/2.2.2/cglib-nodep-2.2.2.pom
[INFO] Downloaded: http://repo.maven.apache.org/maven2/cglib/cglib-nodep/2.2.2/cglib-nodep-2.2.2.pom
(2 KB at 27.5 KB/sec)
[INFO] Downloading: http://repo.maven.apache.org/maven2/org/objenesis/objenesis/1.3/objenesis-1.3.pom
[INFO] Downloaded: http://repo.maven.apache.org/maven2/org/objenesis/objenesis/1.3/objenesis-1.3.pom
(3 KB at 57.7 KB/sec)
[INFO] Downloading: http://repo.maven.apache.org/maven2/org/objenesis/objenesis-parent/1.3/objenesis-parent-1.3.pom
[INFO] Downloaded: http://repo.maven.apache.org/maven2/org/objenesis/objenesis-parent/1.3/objenesis-parent-1.3.pom
(14 KB at 310.8 KB/sec)
[INFO] Downloading: http://repo.maven.apache.org/maven2/org/easymock/easymock/3.2/easymock-3.2.jar
[INFO] Downloading: http://repo.maven.apache.org/maven2/org/objenesis/objenesis/1.3/objenesis-1.3.jar
[INFO] Downloading: http://repo.maven.apache.org/maven2/cglib/cglib-nodep/2.2.2/cglib-nodep-2.2.2.jar
[INFO] Downloaded: http://repo.maven.apache.org/maven2/org/objenesis/objenesis/1.3/objenesis-1.3.jar
(40 KB at 426.0 KB/sec)
[INFO] Downloaded: http://repo.maven.apache.org/maven2/org/easymock/easymock/3.2/easymock-3.2.jar
(117 KB at 935.8 KB/sec)
[INFO] Downloaded: http://repo.maven.apache.org/maven2/cglib/cglib-nodep/2.2.2/cglib-nodep-2.2.2.jar
(320 KB at 1444.6 KB/sec)
[INFO] 
[INFO] --- maven-clean-plugin:2.5:clean (default-clean) @ maven-test-tools ---
[INFO] 
[INFO] --- maven-remote-resources-plugin:1.4:process (default) @ maven-test-tools ---
[INFO] 
[INFO] --- maven-resources-plugin:2.6:resources (default-resources) @ maven-test-tools ---
[INFO] Using 'UTF-8' encoding to copy filtered resources.
[INFO] skip non existing resourceDirectory <https://builds.apache.org/job/maven-plugin-testing/ws/maven-test-tools/src/main/resources>
[INFO] Copying 3 resources
[INFO] 
[INFO] --- maven-compiler-plugin:3.1:compile (default-compile) @ maven-test-tools ---
[INFO] Changes detected - recompiling the module!
[INFO] Compiling 4 source files to <https://builds.apache.org/job/maven-plugin-testing/ws/maven-test-tools/target/classes>
[WARNING] Note: <https://builds.apache.org/job/maven-plugin-testing/ws/maven-test-tools/src/main/java/org/apache/maven/shared/tools/easymock/TestFileManager.java>
uses or overrides a deprecated API.
[WARNING] Note: Recompile with -Xlint:deprecation for details.
[INFO] 
[INFO] --- maven-resources-plugin:2.6:testResources (default-testResources) @ maven-test-tools
---
[INFO] Using 'UTF-8' encoding to copy filtered resources.
[INFO] skip non existing resourceDirectory <https://builds.apache.org/job/maven-plugin-testing/ws/maven-test-tools/src/test/resources>
[INFO] Copying 3 resources
[INFO] 
[INFO] --- maven-compiler-plugin:3.1:testCompile (default-testCompile) @ maven-test-tools
---
[INFO] No sources to compile
[INFO] 
[INFO] --- maven-surefire-plugin:2.12.4:test (default-test) @ maven-test-tools ---
[JENKINS] Recording test results
[INFO] 
[INFO] --- maven-jar-plugin:2.4:jar (default-jar) @ maven-test-tools ---
[INFO] Building jar: <https://builds.apache.org/job/maven-plugin-testing/ws/maven-test-tools/target/maven-test-tools-3.0.0-SNAPSHOT.jar>
[INFO] 
[INFO] --- maven-install-plugin:2.3.1:install (default-install) @ maven-test-tools ---
[INFO] Installing <https://builds.apache.org/job/maven-plugin-testing/ws/maven-test-tools/target/maven-test-tools-3.0.0-SNAPSHOT.jar>
to /var/jenkins/hudson-slave/maven-repositories/0/org/apache/maven/plugin-testing/maven-test-tools/3.0.0-SNAPSHOT/maven-test-tools-3.0.0-SNAPSHOT.jar
[INFO] Installing <https://builds.apache.org/job/maven-plugin-testing/ws/maven-test-tools/pom.xml>
to /var/jenkins/hudson-slave/maven-repositories/0/org/apache/maven/plugin-testing/maven-test-tools/3.0.0-SNAPSHOT/maven-test-tools-3.0.0-SNAPSHOT.pom
[INFO]                                                                         
[INFO] ------------------------------------------------------------------------
[INFO] Building Maven Plugin Testing Tools 3.0.0-SNAPSHOT
[INFO] ------------------------------------------------------------------------
[INFO] Downloading: http://repo.maven.apache.org/maven2/org/codehaus/plexus/plexus-component-metadata/1.5.5/plexus-component-metadata-1.5.5.pom
[INFO] Downloaded: http://repo.maven.apache.org/maven2/org/codehaus/plexus/plexus-component-metadata/1.5.5/plexus-component-metadata-1.5.5.pom
(4 KB at 42.3 KB/sec)
[INFO] Downloading: http://repo.maven.apache.org/maven2/org/codehaus/plexus/plexus-component-metadata/1.5.5/plexus-component-metadata-1.5.5.jar
[INFO] Downloaded: http://repo.maven.apache.org/maven2/org/codehaus/plexus/plexus-component-metadata/1.5.5/plexus-component-metadata-1.5.5.jar
(108 KB at 862.4 KB/sec)
[INFO] Downloading: http://repo.maven.apache.org/maven2/org/apache/maven/wagon/wagon-file/2.1/wagon-file-2.1.pom
[INFO] Downloaded: http://repo.maven.apache.org/maven2/org/apache/maven/wagon/wagon-file/2.1/wagon-file-2.1.pom
(2 KB at 34.4 KB/sec)
[INFO] Downloading: http://repo.maven.apache.org/maven2/org/apache/maven/wagon/wagon-providers/2.1/wagon-providers-2.1.pom
[INFO] Downloaded: http://repo.maven.apache.org/maven2/org/apache/maven/wagon/wagon-providers/2.1/wagon-providers-2.1.pom
(3 KB at 69.3 KB/sec)
[INFO] Downloading: http://repo.maven.apache.org/maven2/org/apache/maven/wagon/wagon/2.1/wagon-2.1.pom
[INFO] Downloaded: http://repo.maven.apache.org/maven2/org/apache/maven/wagon/wagon/2.1/wagon-2.1.pom
(16 KB at 385.4 KB/sec)
[INFO] Downloading: http://repo.maven.apache.org/maven2/org/apache/maven/wagon/wagon-provider-api/2.1/wagon-provider-api-2.1.pom
[INFO] Downloaded: http://repo.maven.apache.org/maven2/org/apache/maven/wagon/wagon-provider-api/2.1/wagon-provider-api-2.1.pom
(2 KB at 41.1 KB/sec)
[INFO] Downloading: http://repo.maven.apache.org/maven2/org/apache/maven/wagon/wagon-file/2.1/wagon-file-2.1.jar
[INFO] Downloaded: http://repo.maven.apache.org/maven2/org/apache/maven/wagon/wagon-file/2.1/wagon-file-2.1.jar
(11 KB at 259.1 KB/sec)
[INFO] 
[INFO] --- maven-clean-plugin:2.5:clean (default-clean) @ maven-plugin-testing-tools ---
[INFO] 
[INFO] --- maven-remote-resources-plugin:1.4:process (default) @ maven-plugin-testing-tools
---
[INFO] 
[INFO] --- maven-resources-plugin:2.6:resources (default-resources) @ maven-plugin-testing-tools
---
[INFO] Using 'UTF-8' encoding to copy filtered resources.
[INFO] skip non existing resourceDirectory <https://builds.apache.org/job/maven-plugin-testing/ws/maven-plugin-testing-tools/src/main/resources>
[INFO] Copying 3 resources
[INFO] 
[INFO] --- maven-compiler-plugin:3.1:compile (default-compile) @ maven-plugin-testing-tools
---
[INFO] Changes detected - recompiling the module!
[INFO] Compiling 6 source files to <https://builds.apache.org/job/maven-plugin-testing/ws/maven-plugin-testing-tools/target/classes>
[WARNING] Note: Some input files use or override a deprecated API.
[WARNING] Note: Recompile with -Xlint:deprecation for details.
[INFO] 
[INFO] --- plexus-component-metadata:1.5.5:generate-metadata (default) @ maven-plugin-testing-tools
---
[INFO] Downloading: http://repo.maven.apache.org/maven2/com/thoughtworks/qdox/qdox/1.9.2/qdox-1.9.2.pom
[INFO] Downloaded: http://repo.maven.apache.org/maven2/com/thoughtworks/qdox/qdox/1.9.2/qdox-1.9.2.pom
(17 KB at 334.9 KB/sec)
[INFO] Downloading: http://repo.maven.apache.org/maven2/org/codehaus/plexus/plexus-cli/1.2/plexus-cli-1.2.pom
[INFO] Downloaded: http://repo.maven.apache.org/maven2/org/codehaus/plexus/plexus-cli/1.2/plexus-cli-1.2.pom
(2 KB at 40.7 KB/sec)
[INFO] Downloading: http://repo.maven.apache.org/maven2/org/codehaus/plexus/plexus-tools/1.0.8/plexus-tools-1.0.8.pom
[INFO] Downloaded: http://repo.maven.apache.org/maven2/org/codehaus/plexus/plexus-tools/1.0.8/plexus-tools-1.0.8.pom
(953 B at 22.7 KB/sec)
[INFO] Downloading: http://repo.maven.apache.org/maven2/commons-lang/commons-lang/1.0/commons-lang-1.0.pom
[INFO] Downloaded: http://repo.maven.apache.org/maven2/commons-lang/commons-lang/1.0/commons-lang-1.0.pom
(3 KB at 60.0 KB/sec)
[INFO] Downloading: http://repo.maven.apache.org/maven2/asm/asm/3.1/asm-3.1.pom
[INFO] Downloaded: http://repo.maven.apache.org/maven2/asm/asm/3.1/asm-3.1.pom (278 B at 7.0
KB/sec)
[INFO] Downloading: http://repo.maven.apache.org/maven2/asm/asm-parent/3.1/asm-parent-3.1.pom
[INFO] Downloaded: http://repo.maven.apache.org/maven2/asm/asm-parent/3.1/asm-parent-3.1.pom
(5 KB at 101.4 KB/sec)
[INFO] Downloading: http://repo.maven.apache.org/maven2/org/codehaus/plexus/plexus-utils/1.4.5/plexus-utils-1.4.5.jar
[INFO] Downloading: http://repo.maven.apache.org/maven2/org/codehaus/plexus/plexus-cli/1.2/plexus-cli-1.2.jar
[INFO] Downloading: http://repo.maven.apache.org/maven2/com/thoughtworks/qdox/qdox/1.9.2/qdox-1.9.2.jar
[INFO] Downloading: http://repo.maven.apache.org/maven2/commons-logging/commons-logging/1.0/commons-logging-1.0.jar
[INFO] Downloading: http://repo.maven.apache.org/maven2/commons-lang/commons-lang/1.0/commons-lang-1.0.jar
[INFO] Downloaded: http://repo.maven.apache.org/maven2/org/codehaus/plexus/plexus-cli/1.2/plexus-cli-1.2.jar
(8 KB at 182.6 KB/sec)
[INFO] Downloading: http://repo.maven.apache.org/maven2/asm/asm/3.1/asm-3.1.jar
[INFO] Downloaded: http://repo.maven.apache.org/maven2/commons-logging/commons-logging/1.0/commons-logging-1.0.jar
(22 KB at 282.0 KB/sec)
[INFO] Downloaded: http://repo.maven.apache.org/maven2/asm/asm/3.1/asm-3.1.jar (43 KB at 764.1
KB/sec)
[INFO] Downloaded: http://repo.maven.apache.org/maven2/commons-lang/commons-lang/1.0/commons-lang-1.0.jar
(63 KB at 605.5 KB/sec)
[INFO] Downloaded: http://repo.maven.apache.org/maven2/com/thoughtworks/qdox/qdox/1.9.2/qdox-1.9.2.jar
(167 KB at 1161.4 KB/sec)
[INFO] Downloaded: http://repo.maven.apache.org/maven2/org/codehaus/plexus/plexus-utils/1.4.5/plexus-utils-1.4.5.jar
(201 KB at 1213.6 KB/sec)
[INFO] Discovered 5 component descriptors(s)
[INFO] 
[INFO] --- maven-resources-plugin:2.6:testResources (default-testResources) @ maven-plugin-testing-tools
---
[INFO] Using 'UTF-8' encoding to copy filtered resources.
[INFO] Copying 2 resources
[INFO] Copying 3 resources
[INFO] 
[INFO] --- maven-compiler-plugin:3.1:testCompile (default-testCompile) @ maven-plugin-testing-tools
---
[INFO] Changes detected - recompiling the module!
[INFO] Compiling 2 source files to <https://builds.apache.org/job/maven-plugin-testing/ws/maven-plugin-testing-tools/target/test-classes>
[WARNING] Note: Some input files use or override a deprecated API.
[WARNING] Note: Recompile with -Xlint:deprecation for details.
[INFO] 
[INFO] --- maven-surefire-plugin:2.12.4:test (default-test) @ maven-plugin-testing-tools ---
[INFO] Surefire report directory: <https://builds.apache.org/job/maven-plugin-testing/ws/maven-plugin-testing-tools/target/surefire-reports>

-------------------------------------------------------
 T E S T S
-------------------------------------------------------
Running org.apache.maven.shared.test.plugin.ProjectToolTest
Using target/it-build-target and target/it-build-target/classes to build IT version of plugin
Now Building test version of the plugin...
Using staged plugin-pom: <https://builds.apache.org/job/maven-plugin-testing/ws/maven-plugin-testing-tools/target/unit/projects/basic/pom-test.xml>
Using IT Plugin Jar: <https://builds.apache.org/job/maven-plugin-testing/ws/maven-plugin-testing-tools/target/unit/projects/basic/target/it-build-target/maven-it-plugin-test.jar>
Using target/it-build-target and target/it-build-target/classes to build IT version of plugin
Now Building test version of the plugin...
Using staged plugin-pom: <https://builds.apache.org/job/maven-plugin-testing/ws/maven-plugin-testing-tools/target/unit/projects/basic/pom-test.xml>
Using IT Plugin Jar: <https://builds.apache.org/job/maven-plugin-testing/ws/maven-plugin-testing-tools/target/unit/projects/basic/target/it-build-target/maven-it-plugin-test.jar>
Using target/it-build-target and target/it-build-target/classes to build IT version of plugin
Tests run: 3, Failures: 0, Errors: 0, Skipped: 0, Time elapsed: 30.368 sec
Running org.apache.maven.shared.test.plugin.RepositoryToolTest
Tests run: 1, Failures: 0, Errors: 0, Skipped: 0, Time elapsed: 0.238 sec

Results :

Tests run: 4, Failures: 0, Errors: 0, Skipped: 0

[JENKINS] Recording test results
[INFO] 
[INFO] --- maven-jar-plugin:2.4:jar (default-jar) @ maven-plugin-testing-tools ---
[INFO] Building jar: <https://builds.apache.org/job/maven-plugin-testing/ws/maven-plugin-testing-tools/target/maven-plugin-testing-tools-3.0.0-SNAPSHOT.jar>
[INFO] 
[INFO] --- maven-install-plugin:2.3.1:install (default-install) @ maven-plugin-testing-tools
---
[INFO] Installing <https://builds.apache.org/job/maven-plugin-testing/ws/maven-plugin-testing-tools/target/maven-plugin-testing-tools-3.0.0-SNAPSHOT.jar>
to /var/jenkins/hudson-slave/maven-repositories/0/org/apache/maven/plugin-testing/maven-plugin-testing-tools/3.0.0-SNAPSHOT/maven-plugin-testing-tools-3.0.0-SNAPSHOT.jar
[INFO] Installing <https://builds.apache.org/job/maven-plugin-testing/ws/maven-plugin-testing-tools/pom.xml>
to /var/jenkins/hudson-slave/maven-repositories/0/org/apache/maven/plugin-testing/maven-plugin-testing-tools/3.0.0-SNAPSHOT/maven-plugin-testing-tools-3.0.0-SNAPSHOT.pom
[INFO] ------------------------------------------------------------------------
[INFO] Reactor Summary:
[INFO] 
[INFO] Maven Plugin Testing .............................. SUCCESS [2:32.576s]
[INFO] Maven Plugin Testing Mechanism .................... SUCCESS [1:20.349s]
[INFO] Maven Testing Tools ............................... SUCCESS [15.286s]
[INFO] Maven Plugin Testing Tools ........................ SUCCESS [53.981s]
[INFO] ------------------------------------------------------------------------
[INFO] BUILD SUCCESS
[INFO] ------------------------------------------------------------------------
[INFO] Total time: 12:31.892s
[INFO] Finished at: Fri Nov 22 00:21:02 CET 2013
[INFO] Final Memory: 22M/75M
[INFO] ------------------------------------------------------------------------
Waiting for Jenkins to finish collecting data
[JENKINS] Archiving <https://builds.apache.org/job/maven-plugin-testing/ws/pom.xml>
to org.apache.maven.plugin-testing/maven-plugin-testing/3.0.0-SNAPSHOT/maven-plugin-testing-3.0.0-SNAPSHOT.pom
[JENKINS] Archiving <https://builds.apache.org/job/maven-plugin-testing/ws/target/maven-plugin-testing-3.0.0-SNAPSHOT-site.xml>
to org.apache.maven.plugin-testing/maven-plugin-testing/3.0.0-SNAPSHOT/maven-plugin-testing-3.0.0-SNAPSHOT-site.xml
[JENKINS] Archiving <https://builds.apache.org/job/maven-plugin-testing/ws/maven-test-tools/pom.xml>
to org.apache.maven.plugin-testing/maven-test-tools/3.0.0-SNAPSHOT/maven-test-tools-3.0.0-SNAPSHOT.pom
[JENKINS] Archiving <https://builds.apache.org/job/maven-plugin-testing/ws/maven-test-tools/target/maven-test-tools-3.0.0-SNAPSHOT.jar>
to org.apache.maven.plugin-testing/maven-test-tools/3.0.0-SNAPSHOT/maven-test-tools-3.0.0-SNAPSHOT.jar
[JENKINS] Archiving <https://builds.apache.org/job/maven-plugin-testing/ws/maven-plugin-testing-tools/pom.xml>
to org.apache.maven.plugin-testing/maven-plugin-testing-tools/3.0.0-SNAPSHOT/maven-plugin-testing-tools-3.0.0-SNAPSHOT.pom
[JENKINS] Archiving <https://builds.apache.org/job/maven-plugin-testing/ws/maven-plugin-testing-tools/target/maven-plugin-testing-tools-3.0.0-SNAPSHOT.jar>
to org.apache.maven.plugin-testing/maven-plugin-testing-tools/3.0.0-SNAPSHOT/maven-plugin-testing-tools-3.0.0-SNAPSHOT.jar
[JENKINS] Archiving <https://builds.apache.org/job/maven-plugin-testing/ws/maven-plugin-testing-harness/pom.xml>
to org.apache.maven.plugin-testing/maven-plugin-testing-harness/3.0.0-SNAPSHOT/maven-plugin-testing-harness-3.0.0-SNAPSHOT.pom
[JENKINS] Archiving <https://builds.apache.org/job/maven-plugin-testing/ws/maven-plugin-testing-harness/target/maven-plugin-testing-harness-3.0.0-SNAPSHOT.jar>
to org.apache.maven.plugin-testing/maven-plugin-testing-harness/3.0.0-SNAPSHOT/maven-plugin-testing-harness-3.0.0-SNAPSHOT.jar
[JENKINS] Archiving <https://builds.apache.org/job/maven-plugin-testing/ws/maven-plugin-testing-harness/target/maven-plugin-testing-harness-3.0.0-SNAPSHOT-sources.jar>
to org.apache.maven.plugin-testing/maven-plugin-testing-harness/3.0.0-SNAPSHOT/maven-plugin-testing-harness-3.0.0-SNAPSHOT-sources.jar
channel stopped
Maven RedeployPublisher use remote tapestry maven settings from : /var/jenkins/hudson-slave/tools/hudson.tasks.Maven_MavenInstallation/maven-3.1.0/conf/settings.xml
[INFO] Deployment in https://repository.apache.org/content/repositories/snapshots (id=apache.snapshots.https,uniqueVersion=true)
Deploying the main artifact jenkins-4145024822816823424maven-plugin-testing-3.0.0-SNAPSHOT.pom
Downloading: https://repository.apache.org/content/repositories/snapshots/org/apache/maven/plugin-testing/maven-plugin-testing/3.0.0-SNAPSHOT/maven-metadata.xml
Downloaded: https://repository.apache.org/content/repositories/snapshots/org/apache/maven/plugin-testing/maven-plugin-testing/3.0.0-SNAPSHOT/maven-metadata.xml
(839 B at 1.6 KB/sec)
Uploading: https://repository.apache.org/content/repositories/snapshots/org/apache/maven/plugin-testing/maven-plugin-testing/3.0.0-SNAPSHOT/maven-plugin-testing-3.0.0-20131121.232206-3.pom
ERROR: Failed to deploy artifacts: Could not transfer artifact org.apache.maven.plugin-testing:maven-plugin-testing:pom:3.0.0-20131121.232206-3
from/to apache.snapshots.https (https://repository.apache.org/content/repositories/snapshots):
Failed to transfer file: https://repository.apache.org/content/repositories/snapshots/org/apache/maven/plugin-testing/maven-plugin-testing/3.0.0-SNAPSHOT/maven-plugin-testing-3.0.0-20131121.232206-3.pom.
Return code is: 401, ReasonPhrase: Unauthorized.
org.apache.maven.artifact.deployer.ArtifactDeploymentException: Failed to deploy artifacts:
Could not transfer artifact org.apache.maven.plugin-testing:maven-plugin-testing:pom:3.0.0-20131121.232206-3
from/to apache.snapshots.https (https://repository.apache.org/content/repositories/snapshots):
Failed to transfer file: https://repository.apache.org/content/repositories/snapshots/org/apache/maven/plugin-testing/maven-plugin-testing/3.0.0-SNAPSHOT/maven-plugin-testing-3.0.0-20131121.232206-3.pom.
Return code is: 401, ReasonPhrase: Unauthorized.
	at org.apache.maven.artifact.deployer.DefaultArtifactDeployer.deploy(DefaultArtifactDeployer.java:143)
	at hudson.maven.reporters.MavenArtifactRecord.deploy(MavenArtifactRecord.java:191)
	at hudson.maven.RedeployPublisher.perform(RedeployPublisher.java:176)
	at hudson.tasks.BuildStepMonitor$1.perform(BuildStepMonitor.java:20)
	at hudson.model.AbstractBuild$AbstractBuildExecution.perform(AbstractBuild.java:785)
	at hudson.model.AbstractBuild$AbstractBuildExecution.performAllBuildSteps(AbstractBuild.java:757)
	at hudson.maven.MavenModuleSetBuild$MavenModuleSetBuildExecution.post2(MavenModuleSetBuild.java:1020)
	at hudson.model.AbstractBuild$AbstractBuildExecution.post(AbstractBuild.java:706)
	at hudson.model.Run.execute(Run.java:1704)
	at hudson.maven.MavenModuleSetBuild.run(MavenModuleSetBuild.java:509)
	at hudson.model.ResourceController.execute(ResourceController.java:88)
	at hudson.model.Executor.run(Executor.java:230)
Caused by: org.eclipse.aether.deployment.DeploymentException: Failed to deploy artifacts:
Could not transfer artifact org.apache.maven.plugin-testing:maven-plugin-testing:pom:3.0.0-20131121.232206-3
from/to apache.snapshots.https (https://repository.apache.org/content/repositories/snapshots):
Failed to transfer file: https://repository.apache.org/content/repositories/snapshots/org/apache/maven/plugin-testing/maven-plugin-testing/3.0.0-SNAPSHOT/maven-plugin-testing-3.0.0-20131121.232206-3.pom.
Return code is: 401, ReasonPhrase: Unauthorized.
	at org.eclipse.aether.internal.impl.DefaultDeployer.deploy(DefaultDeployer.java:341)
	at org.eclipse.aether.internal.impl.DefaultDeployer.deploy(DefaultDeployer.java:269)
	at org.eclipse.aether.internal.impl.DefaultRepositorySystem.deploy(DefaultRepositorySystem.java:413)
	at org.apache.maven.artifact.deployer.DefaultArtifactDeployer.deploy(DefaultArtifactDeployer.java:139)
	... 11 more
Caused by: org.eclipse.aether.transfer.ArtifactTransferException: Could not transfer artifact
org.apache.maven.plugin-testing:maven-plugin-testing:pom:3.0.0-20131121.232206-3 from/to apache.snapshots.https
(https://repository.apache.org/content/repositories/snapshots): Failed to transfer file: https://repository.apache.org/content/repositories/snapshots/org/apache/maven/plugin-testing/maven-plugin-testing/3.0.0-SNAPSHOT/maven-plugin-testing-3.0.0-20131121.232206-3.pom.
Return code is: 401, ReasonPhrase: Unauthorized.
	at org.eclipse.aether.connector.wagon.WagonRepositoryConnector$6.wrap(WagonRepositoryConnector.java:1016)
	at org.eclipse.aether.connector.wagon.WagonRepositoryConnector$6.wrap(WagonRepositoryConnector.java:1004)
	at org.eclipse.aether.connector.wagon.WagonRepositoryConnector$PutTask.run(WagonRepositoryConnector.java:895)
	at org.eclipse.aether.connector.wagon.WagonRepositoryConnector.put(WagonRepositoryConnector.java:522)
	at org.eclipse.aether.internal.impl.DefaultDeployer.deploy(DefaultDeployer.java:335)
	... 14 more
Caused by: org.apache.maven.wagon.TransferFailedException: Failed to transfer file: https://repository.apache.org/content/repositories/snapshots/org/apache/maven/plugin-testing/maven-plugin-testing/3.0.0-SNAPSHOT/maven-plugin-testing-3.0.0-20131121.232206-3.pom.
Return code is: 401, ReasonPhrase: Unauthorized.
	at org.apache.maven.wagon.shared.http4.AbstractHttpClientWagon.put(AbstractHttpClientWagon.java:626)
	at org.apache.maven.wagon.shared.http4.AbstractHttpClientWagon.put(AbstractHttpClientWagon.java:524)
	at org.apache.maven.wagon.shared.http4.AbstractHttpClientWagon.put(AbstractHttpClientWagon.java:505)
	at org.apache.maven.wagon.shared.http4.AbstractHttpClientWagon.put(AbstractHttpClientWagon.java:485)
	at org.eclipse.aether.connector.wagon.WagonRepositoryConnector$PutTask.run(WagonRepositoryConnector.java:871)
	... 16 more
[INFO] Deployment failed after 4.5 sec
Build step 'Deploy artifacts to Maven repository' changed build result to FAILURE

Mime
View raw message