maven-notifications mailing list archives

Site index · List index
Message view « Date » · « Thread »
Top « Date » · « Thread »
From Apache Jenkins Server <jenk...@builds.apache.org>
Subject Build failed in Jenkins: maven-plugins-ITs-m3 #1165
Date Sat, 09 Nov 2013 20:40:07 GMT
See <https://builds.apache.org/job/maven-plugins-ITs-m3/1165/changes>

Changes:

[Robert Scholte] [MEAR-149] skinnyWars and SNAPSHOT unique dependencies

[Robert Scholte] [MDEPLOY-172] Concurrency problem with deployAtEnd in parallel builds
Patch contributed by Hermann Josef Hill, verified and adjusted by Robert Scholte

[Robert Scholte] [MINSTALL-103] Concurrency problem with installAtEnd in parallel builds
Patch contributed by Hermann Josef Hill, verified by Robert Scholte

------------------------------------------
[...truncated 9578 lines...]
[INFO] Building jar: /x1/jenkins/jenkins-slave/workspace/maven-plugins-ITs-m3/maven-shade-plugin/target/maven-shade-plugin-2.2-SNAPSHOT-tests.jar
[INFO] 
[INFO] --- maven-invoker-plugin:1.8:install (integration-test) @ maven-shade-plugin ---
[INFO] Installing /x1/jenkins/jenkins-slave/workspace/maven-plugins-ITs-m3/maven-plugins/pom.xml
to /x1/jenkins/jenkins-slave/workspace/maven-plugins-ITs-m3/maven-shade-plugin/target/local-repo/org/apache/maven/plugins/maven-plugins/25-SNAPSHOT/maven-plugins-25-SNAPSHOT.pom
[INFO] Installing /x1/jenkins/jenkins-slave/workspace/maven-plugins-ITs-m3/maven-plugins/target/maven-plugins-25-SNAPSHOT-site.xml
to /x1/jenkins/jenkins-slave/workspace/maven-plugins-ITs-m3/maven-shade-plugin/target/local-repo/org/apache/maven/plugins/maven-plugins/25-SNAPSHOT/maven-plugins-25-SNAPSHOT-site.xml
[INFO] Installing /x1/jenkins/jenkins-slave/workspace/maven-plugins-ITs-m3/maven-acr-plugin/pom.xml
to /x1/jenkins/jenkins-slave/workspace/maven-plugins-ITs-m3/maven-shade-plugin/target/local-repo/org/apache/maven/plugins/maven-acr-plugin/1.0.1-SNAPSHOT/maven-acr-plugin-1.0.1-SNAPSHOT.pom
[INFO] Installing /x1/jenkins/jenkins-slave/workspace/maven-plugins-ITs-m3/maven-acr-plugin/target/maven-acr-plugin-1.0.1-SNAPSHOT.jar
to /x1/jenkins/jenkins-slave/workspace/maven-plugins-ITs-m3/maven-shade-plugin/target/local-repo/org/apache/maven/plugins/maven-acr-plugin/1.0.1-SNAPSHOT/maven-acr-plugin-1.0.1-SNAPSHOT.jar
[INFO] Installing /x1/jenkins/jenkins-slave/workspace/maven-plugins-ITs-m3/maven-acr-plugin/pom.xml
to /x1/jenkins/jenkins-slave/workspace/maven-plugins-ITs-m3/maven-shade-plugin/target/local-repo/org/apache/maven/plugins/maven-acr-plugin/1.0.1-SNAPSHOT/maven-acr-plugin-1.0.1-SNAPSHOT.pom
[INFO] Installing /x1/jenkins/jenkins-slave/workspace/maven-plugins-ITs-m3/maven-ant-plugin/pom.xml
to /x1/jenkins/jenkins-slave/workspace/maven-plugins-ITs-m3/maven-shade-plugin/target/local-repo/org/apache/maven/plugins/maven-ant-plugin/2.4-SNAPSHOT/maven-ant-plugin-2.4-SNAPSHOT.pom
[INFO] Installing /x1/jenkins/jenkins-slave/workspace/maven-plugins-ITs-m3/maven-ant-plugin/target/maven-ant-plugin-2.4-SNAPSHOT.jar
to /x1/jenkins/jenkins-slave/workspace/maven-plugins-ITs-m3/maven-shade-plugin/target/local-repo/org/apache/maven/plugins/maven-ant-plugin/2.4-SNAPSHOT/maven-ant-plugin-2.4-SNAPSHOT.jar
[INFO] Installing /x1/jenkins/jenkins-slave/workspace/maven-plugins-ITs-m3/maven-ant-plugin/pom.xml
to /x1/jenkins/jenkins-slave/workspace/maven-plugins-ITs-m3/maven-shade-plugin/target/local-repo/org/apache/maven/plugins/maven-ant-plugin/2.4-SNAPSHOT/maven-ant-plugin-2.4-SNAPSHOT.pom
[INFO] Installing /x1/jenkins/jenkins-slave/workspace/maven-plugins-ITs-m3/maven-antrun-plugin/pom.xml
to /x1/jenkins/jenkins-slave/workspace/maven-plugins-ITs-m3/maven-shade-plugin/target/local-repo/org/apache/maven/plugins/maven-antrun-plugin/1.8-SNAPSHOT/maven-antrun-plugin-1.8-SNAPSHOT.pom
[INFO] Installing /x1/jenkins/jenkins-slave/workspace/maven-plugins-ITs-m3/maven-antrun-plugin/target/maven-antrun-plugin-1.8-SNAPSHOT.jar
to /x1/jenkins/jenkins-slave/workspace/maven-plugins-ITs-m3/maven-shade-plugin/target/local-repo/org/apache/maven/plugins/maven-antrun-plugin/1.8-SNAPSHOT/maven-antrun-plugin-1.8-SNAPSHOT.jar
[INFO] Installing /x1/jenkins/jenkins-slave/workspace/maven-plugins-ITs-m3/maven-antrun-plugin/pom.xml
to /x1/jenkins/jenkins-slave/workspace/maven-plugins-ITs-m3/maven-shade-plugin/target/local-repo/org/apache/maven/plugins/maven-antrun-plugin/1.8-SNAPSHOT/maven-antrun-plugin-1.8-SNAPSHOT.pom
[INFO] Installing /x1/jenkins/jenkins-slave/workspace/maven-plugins-ITs-m3/maven-eclipse-plugin/pom.xml
to /x1/jenkins/jenkins-slave/workspace/maven-plugins-ITs-m3/maven-shade-plugin/target/local-repo/org/apache/maven/plugins/maven-eclipse-plugin/2.10-SNAPSHOT/maven-eclipse-plugin-2.10-SNAPSHOT.pom
[INFO] Installing /x1/jenkins/jenkins-slave/workspace/maven-plugins-ITs-m3/maven-eclipse-plugin/target/maven-eclipse-plugin-2.10-SNAPSHOT.jar
to /x1/jenkins/jenkins-slave/workspace/maven-plugins-ITs-m3/maven-shade-plugin/target/local-repo/org/apache/maven/plugins/maven-eclipse-plugin/2.10-SNAPSHOT/maven-eclipse-plugin-2.10-SNAPSHOT.jar
[INFO] Installing /x1/jenkins/jenkins-slave/workspace/maven-plugins-ITs-m3/maven-eclipse-plugin/pom.xml
to /x1/jenkins/jenkins-slave/workspace/maven-plugins-ITs-m3/maven-shade-plugin/target/local-repo/org/apache/maven/plugins/maven-eclipse-plugin/2.10-SNAPSHOT/maven-eclipse-plugin-2.10-SNAPSHOT.pom
[INFO] Installing /x1/jenkins/jenkins-slave/workspace/maven-plugins-ITs-m3/maven-assembly-plugin/pom.xml
to /x1/jenkins/jenkins-slave/workspace/maven-plugins-ITs-m3/maven-shade-plugin/target/local-repo/org/apache/maven/plugins/maven-assembly-plugin/2.5-SNAPSHOT/maven-assembly-plugin-2.5-SNAPSHOT.pom
[INFO] Installing /x1/jenkins/jenkins-slave/workspace/maven-plugins-ITs-m3/maven-assembly-plugin/target/maven-assembly-plugin-2.5-SNAPSHOT.jar
to /x1/jenkins/jenkins-slave/workspace/maven-plugins-ITs-m3/maven-shade-plugin/target/local-repo/org/apache/maven/plugins/maven-assembly-plugin/2.5-SNAPSHOT/maven-assembly-plugin-2.5-SNAPSHOT.jar
[INFO] Installing /x1/jenkins/jenkins-slave/workspace/maven-plugins-ITs-m3/maven-assembly-plugin/pom.xml
to /x1/jenkins/jenkins-slave/workspace/maven-plugins-ITs-m3/maven-shade-plugin/target/local-repo/org/apache/maven/plugins/maven-assembly-plugin/2.5-SNAPSHOT/maven-assembly-plugin-2.5-SNAPSHOT.pom
[INFO] Installing /x1/jenkins/jenkins-slave/workspace/maven-plugins-ITs-m3/maven-changelog-plugin/pom.xml
to /x1/jenkins/jenkins-slave/workspace/maven-plugins-ITs-m3/maven-shade-plugin/target/local-repo/org/apache/maven/plugins/maven-changelog-plugin/2.3-SNAPSHOT/maven-changelog-plugin-2.3-SNAPSHOT.pom
[INFO] Installing /x1/jenkins/jenkins-slave/workspace/maven-plugins-ITs-m3/maven-changelog-plugin/target/maven-changelog-plugin-2.3-SNAPSHOT.jar
to /x1/jenkins/jenkins-slave/workspace/maven-plugins-ITs-m3/maven-shade-plugin/target/local-repo/org/apache/maven/plugins/maven-changelog-plugin/2.3-SNAPSHOT/maven-changelog-plugin-2.3-SNAPSHOT.jar
[INFO] Installing /x1/jenkins/jenkins-slave/workspace/maven-plugins-ITs-m3/maven-changelog-plugin/pom.xml
to /x1/jenkins/jenkins-slave/workspace/maven-plugins-ITs-m3/maven-shade-plugin/target/local-repo/org/apache/maven/plugins/maven-changelog-plugin/2.3-SNAPSHOT/maven-changelog-plugin-2.3-SNAPSHOT.pom
[INFO] Installing /x1/jenkins/jenkins-slave/workspace/maven-plugins-ITs-m3/maven-changes-plugin/pom.xml
to /x1/jenkins/jenkins-slave/workspace/maven-plugins-ITs-m3/maven-shade-plugin/target/local-repo/org/apache/maven/plugins/maven-changes-plugin/2.10-SNAPSHOT/maven-changes-plugin-2.10-SNAPSHOT.pom
[INFO] Installing /x1/jenkins/jenkins-slave/workspace/maven-plugins-ITs-m3/maven-changes-plugin/target/maven-changes-plugin-2.10-SNAPSHOT.jar
to /x1/jenkins/jenkins-slave/workspace/maven-plugins-ITs-m3/maven-shade-plugin/target/local-repo/org/apache/maven/plugins/maven-changes-plugin/2.10-SNAPSHOT/maven-changes-plugin-2.10-SNAPSHOT.jar
[INFO] Installing /x1/jenkins/jenkins-slave/workspace/maven-plugins-ITs-m3/maven-changes-plugin/pom.xml
to /x1/jenkins/jenkins-slave/workspace/maven-plugins-ITs-m3/maven-shade-plugin/target/local-repo/org/apache/maven/plugins/maven-changes-plugin/2.10-SNAPSHOT/maven-changes-plugin-2.10-SNAPSHOT.pom
[INFO] Installing /x1/jenkins/jenkins-slave/workspace/maven-plugins-ITs-m3/maven-checkstyle-plugin/pom.xml
to /x1/jenkins/jenkins-slave/workspace/maven-plugins-ITs-m3/maven-shade-plugin/target/local-repo/org/apache/maven/plugins/maven-checkstyle-plugin/2.11-SNAPSHOT/maven-checkstyle-plugin-2.11-SNAPSHOT.pom
[INFO] Installing /x1/jenkins/jenkins-slave/workspace/maven-plugins-ITs-m3/maven-checkstyle-plugin/target/maven-checkstyle-plugin-2.11-SNAPSHOT.jar
to /x1/jenkins/jenkins-slave/workspace/maven-plugins-ITs-m3/maven-shade-plugin/target/local-repo/org/apache/maven/plugins/maven-checkstyle-plugin/2.11-SNAPSHOT/maven-checkstyle-plugin-2.11-SNAPSHOT.jar
[INFO] Installing /x1/jenkins/jenkins-slave/workspace/maven-plugins-ITs-m3/maven-checkstyle-plugin/pom.xml
to /x1/jenkins/jenkins-slave/workspace/maven-plugins-ITs-m3/maven-shade-plugin/target/local-repo/org/apache/maven/plugins/maven-checkstyle-plugin/2.11-SNAPSHOT/maven-checkstyle-plugin-2.11-SNAPSHOT.pom
[INFO] Installing /x1/jenkins/jenkins-slave/workspace/maven-plugins-ITs-m3/maven-clean-plugin/pom.xml
to /x1/jenkins/jenkins-slave/workspace/maven-plugins-ITs-m3/maven-shade-plugin/target/local-repo/org/apache/maven/plugins/maven-clean-plugin/2.6-SNAPSHOT/maven-clean-plugin-2.6-SNAPSHOT.pom
[INFO] Installing /x1/jenkins/jenkins-slave/workspace/maven-plugins-ITs-m3/maven-clean-plugin/target/maven-clean-plugin-2.6-SNAPSHOT.jar
to /x1/jenkins/jenkins-slave/workspace/maven-plugins-ITs-m3/maven-shade-plugin/target/local-repo/org/apache/maven/plugins/maven-clean-plugin/2.6-SNAPSHOT/maven-clean-plugin-2.6-SNAPSHOT.jar
[INFO] Installing /x1/jenkins/jenkins-slave/workspace/maven-plugins-ITs-m3/maven-clean-plugin/pom.xml
to /x1/jenkins/jenkins-slave/workspace/maven-plugins-ITs-m3/maven-shade-plugin/target/local-repo/org/apache/maven/plugins/maven-clean-plugin/2.6-SNAPSHOT/maven-clean-plugin-2.6-SNAPSHOT.pom
[INFO] Installing /x1/jenkins/jenkins-slave/workspace/maven-plugins-ITs-m3/maven-compiler-plugin/pom.xml
to /x1/jenkins/jenkins-slave/workspace/maven-plugins-ITs-m3/maven-shade-plugin/target/local-repo/org/apache/maven/plugins/maven-compiler-plugin/3.2-SNAPSHOT/maven-compiler-plugin-3.2-SNAPSHOT.pom
[INFO] Installing /x1/jenkins/jenkins-slave/workspace/maven-plugins-ITs-m3/maven-compiler-plugin/target/maven-compiler-plugin-3.2-SNAPSHOT.jar
to /x1/jenkins/jenkins-slave/workspace/maven-plugins-ITs-m3/maven-shade-plugin/target/local-repo/org/apache/maven/plugins/maven-compiler-plugin/3.2-SNAPSHOT/maven-compiler-plugin-3.2-SNAPSHOT.jar
[INFO] Installing /x1/jenkins/jenkins-slave/workspace/maven-plugins-ITs-m3/maven-compiler-plugin/pom.xml
to /x1/jenkins/jenkins-slave/workspace/maven-plugins-ITs-m3/maven-shade-plugin/target/local-repo/org/apache/maven/plugins/maven-compiler-plugin/3.2-SNAPSHOT/maven-compiler-plugin-3.2-SNAPSHOT.pom
[INFO] Installing /x1/jenkins/jenkins-slave/workspace/maven-plugins-ITs-m3/maven-dependency-plugin/pom.xml
to /x1/jenkins/jenkins-slave/workspace/maven-plugins-ITs-m3/maven-shade-plugin/target/local-repo/org/apache/maven/plugins/maven-dependency-plugin/2.9-SNAPSHOT/maven-dependency-plugin-2.9-SNAPSHOT.pom
[INFO] Installing /x1/jenkins/jenkins-slave/workspace/maven-plugins-ITs-m3/maven-dependency-plugin/target/maven-dependency-plugin-2.9-SNAPSHOT.jar
to /x1/jenkins/jenkins-slave/workspace/maven-plugins-ITs-m3/maven-shade-plugin/target/local-repo/org/apache/maven/plugins/maven-dependency-plugin/2.9-SNAPSHOT/maven-dependency-plugin-2.9-SNAPSHOT.jar
[INFO] Installing /x1/jenkins/jenkins-slave/workspace/maven-plugins-ITs-m3/maven-dependency-plugin/pom.xml
to /x1/jenkins/jenkins-slave/workspace/maven-plugins-ITs-m3/maven-shade-plugin/target/local-repo/org/apache/maven/plugins/maven-dependency-plugin/2.9-SNAPSHOT/maven-dependency-plugin-2.9-SNAPSHOT.pom
[INFO] Installing /x1/jenkins/jenkins-slave/workspace/maven-plugins-ITs-m3/maven-deploy-plugin/pom.xml
to /x1/jenkins/jenkins-slave/workspace/maven-plugins-ITs-m3/maven-shade-plugin/target/local-repo/org/apache/maven/plugins/maven-deploy-plugin/2.9-SNAPSHOT/maven-deploy-plugin-2.9-SNAPSHOT.pom
[INFO] Installing /x1/jenkins/jenkins-slave/workspace/maven-plugins-ITs-m3/maven-deploy-plugin/target/maven-deploy-plugin-2.9-SNAPSHOT.jar
to /x1/jenkins/jenkins-slave/workspace/maven-plugins-ITs-m3/maven-shade-plugin/target/local-repo/org/apache/maven/plugins/maven-deploy-plugin/2.9-SNAPSHOT/maven-deploy-plugin-2.9-SNAPSHOT.jar
[INFO] Installing /x1/jenkins/jenkins-slave/workspace/maven-plugins-ITs-m3/maven-deploy-plugin/pom.xml
to /x1/jenkins/jenkins-slave/workspace/maven-plugins-ITs-m3/maven-shade-plugin/target/local-repo/org/apache/maven/plugins/maven-deploy-plugin/2.9-SNAPSHOT/maven-deploy-plugin-2.9-SNAPSHOT.pom
[INFO] Installing /x1/jenkins/jenkins-slave/workspace/maven-plugins-ITs-m3/maven-doap-plugin/pom.xml
to /x1/jenkins/jenkins-slave/workspace/maven-plugins-ITs-m3/maven-shade-plugin/target/local-repo/org/apache/maven/plugins/maven-doap-plugin/1.2-SNAPSHOT/maven-doap-plugin-1.2-SNAPSHOT.pom
[INFO] Installing /x1/jenkins/jenkins-slave/workspace/maven-plugins-ITs-m3/maven-doap-plugin/target/maven-doap-plugin-1.2-SNAPSHOT.jar
to /x1/jenkins/jenkins-slave/workspace/maven-plugins-ITs-m3/maven-shade-plugin/target/local-repo/org/apache/maven/plugins/maven-doap-plugin/1.2-SNAPSHOT/maven-doap-plugin-1.2-SNAPSHOT.jar
[INFO] Installing /x1/jenkins/jenkins-slave/workspace/maven-plugins-ITs-m3/maven-doap-plugin/pom.xml
to /x1/jenkins/jenkins-slave/workspace/maven-plugins-ITs-m3/maven-shade-plugin/target/local-repo/org/apache/maven/plugins/maven-doap-plugin/1.2-SNAPSHOT/maven-doap-plugin-1.2-SNAPSHOT.pom
[INFO] Installing /x1/jenkins/jenkins-slave/workspace/maven-plugins-ITs-m3/maven-docck-plugin/pom.xml
to /x1/jenkins/jenkins-slave/workspace/maven-plugins-ITs-m3/maven-shade-plugin/target/local-repo/org/apache/maven/plugins/maven-docck-plugin/1.1-SNAPSHOT/maven-docck-plugin-1.1-SNAPSHOT.pom
[INFO] Installing /x1/jenkins/jenkins-slave/workspace/maven-plugins-ITs-m3/maven-docck-plugin/target/maven-docck-plugin-1.1-SNAPSHOT.jar
to /x1/jenkins/jenkins-slave/workspace/maven-plugins-ITs-m3/maven-shade-plugin/target/local-repo/org/apache/maven/plugins/maven-docck-plugin/1.1-SNAPSHOT/maven-docck-plugin-1.1-SNAPSHOT.jar
[INFO] Installing /x1/jenkins/jenkins-slave/workspace/maven-plugins-ITs-m3/maven-docck-plugin/pom.xml
to /x1/jenkins/jenkins-slave/workspace/maven-plugins-ITs-m3/maven-shade-plugin/target/local-repo/org/apache/maven/plugins/maven-docck-plugin/1.1-SNAPSHOT/maven-docck-plugin-1.1-SNAPSHOT.pom
[INFO] Installing /x1/jenkins/jenkins-slave/workspace/maven-plugins-ITs-m3/maven-ear-plugin/pom.xml
to /x1/jenkins/jenkins-slave/workspace/maven-plugins-ITs-m3/maven-shade-plugin/target/local-repo/org/apache/maven/plugins/maven-ear-plugin/2.9-SNAPSHOT/maven-ear-plugin-2.9-SNAPSHOT.pom
[INFO]                                                                         
[INFO] ------------------------------------------------------------------------
[INFO] Building Apache Maven GPG Plugin 1.5-SNAPSHOT
[INFO] ------------------------------------------------------------------------
[INFO] 
[INFO] --- maven-clean-plugin:2.5:clean (default-clean) @ maven-gpg-plugin ---
[INFO] Deleting /x1/jenkins/jenkins-slave/workspace/maven-plugins-ITs-m3/maven-gpg-plugin/target
[INFO] 
[INFO] --- maven-enforcer-plugin:1.0.1:enforce (ensure-no-container-api) @ maven-gpg-plugin
---
[INFO] 
[INFO] --- maven-plugin-plugin:3.2:helpmojo (generated-helpmojo) @ maven-gpg-plugin ---
[INFO] Using 'UTF-8' encoding to read mojo metadata.
[INFO] Applying mojo extractor for language: java
[INFO] Mojo extractor for language: java found 0 mojo descriptors.
[INFO] Applying mojo extractor for language: bsh
[INFO] Mojo extractor for language: bsh found 0 mojo descriptors.
[INFO] Applying mojo extractor for language: java-annotations
[INFO] Mojo extractor for language: java-annotations found 0 mojo descriptors.
[INFO] 
[INFO] --- maven-plugin-plugin:3.2:descriptor (default-descriptor) @ maven-gpg-plugin ---
[INFO] Using 'UTF-8' encoding to read mojo metadata.
[INFO] Applying mojo extractor for language: java
[INFO] Mojo extractor for language: java found 0 mojo descriptors.
[INFO] Applying mojo extractor for language: bsh
[INFO] Mojo extractor for language: bsh found 0 mojo descriptors.
[INFO] Applying mojo extractor for language: java-annotations
[INFO] Mojo extractor for language: java-annotations found 0 mojo descriptors.
[INFO] 
[INFO] --- maven-remote-resources-plugin:1.4:process (default) @ maven-gpg-plugin ---
[INFO] 
[INFO] --- maven-resources-plugin:2.6:resources (default-resources) @ maven-gpg-plugin ---
[INFO] Using 'UTF-8' encoding to copy filtered resources.
[INFO] skip non existing resourceDirectory /x1/jenkins/jenkins-slave/workspace/maven-plugins-ITs-m3/maven-gpg-plugin/src/main/resources
[INFO] Copying 3 resources
[INFO] 
[INFO] --- maven-compiler-plugin:3.0:compile (default-compile) @ maven-gpg-plugin ---
[INFO] Changes detected - recompiling the module!
[INFO] Compiling 9 source files to /x1/jenkins/jenkins-slave/workspace/maven-plugins-ITs-m3/maven-gpg-plugin/target/classes
[INFO] 
[INFO] --- maven-plugin-plugin:3.2:descriptor (generate-descriptor) @ maven-gpg-plugin ---
[INFO] Using 'UTF-8' encoding to read mojo metadata.
[INFO] Applying mojo extractor for language: java
[INFO] Mojo extractor for language: java found 0 mojo descriptors.
[INFO] Applying mojo extractor for language: bsh
[INFO] Mojo extractor for language: bsh found 0 mojo descriptors.
[INFO] Applying mojo extractor for language: java-annotations
[INFO] Mojo extractor for language: java-annotations found 3 mojo descriptors.
[INFO] 
[INFO] --- maven-resources-plugin:2.6:testResources (default-testResources) @ maven-gpg-plugin
---
[INFO] Using 'UTF-8' encoding to copy filtered resources.
[INFO] Copying 8 resources
[INFO] Copying 3 resources
[INFO] 
[INFO] --- maven-compiler-plugin:3.0:testCompile (default-testCompile) @ maven-gpg-plugin
---
[INFO] No sources to compile
[INFO] 
[INFO] --- maven-surefire-plugin:2.12.4:test (default-test) @ maven-gpg-plugin ---
[INFO] 
[INFO] --- maven-jar-plugin:2.4:jar (default-jar) @ maven-gpg-plugin ---
[INFO] Building jar: /x1/jenkins/jenkins-slave/workspace/maven-plugins-ITs-m3/maven-gpg-plugin/target/maven-gpg-plugin-1.5-SNAPSHOT.jar
[INFO] 
[INFO] --- maven-plugin-plugin:3.2:addPluginArtifactMetadata (default-addPluginArtifactMetadata)
@ maven-gpg-plugin ---
[INFO] 
[INFO] --- maven-invoker-plugin:1.7:install (integration-test) @ maven-gpg-plugin ---
[INFO] Installing /x1/jenkins/jenkins-slave/workspace/maven-plugins-ITs-m3/maven-gpg-plugin/pom.xml
to /x1/jenkins/jenkins-slave/workspace/maven-plugins-ITs-m3/maven-gpg-plugin/target/local-repo/org/apache/maven/plugins/maven-gpg-plugin/1.5-SNAPSHOT/maven-gpg-plugin-1.5-SNAPSHOT.pom
[INFO] Installing /x1/jenkins/jenkins-slave/workspace/maven-plugins-ITs-m3/maven-gpg-plugin/target/maven-gpg-plugin-1.5-SNAPSHOT.jar
to /x1/jenkins/jenkins-slave/workspace/maven-plugins-ITs-m3/maven-gpg-plugin/target/local-repo/org/apache/maven/plugins/maven-gpg-plugin/1.5-SNAPSHOT/maven-gpg-plugin-1.5-SNAPSHOT.jar
[INFO] 
[INFO] --- maven-invoker-plugin:1.7:integration-test (integration-test) @ maven-gpg-plugin
---
[INFO] Building: alternative-secret-keyring/pom.xml
[INFO] run script verify.bsh
[INFO] ..SUCCESS (3.1 s)
[INFO] Building: no-main-artifact/pom.xml
[INFO] run script verify.bsh
[INFO] ..SUCCESS (2.4 s)
[INFO] Building: sign-release/pom.xml
[INFO] run script verify.bsh
[INFO] ..SUCCESS (2.6 s)
[INFO] 
[INFO] --- maven-invoker-plugin:1.7:verify (integration-test) @ maven-gpg-plugin ---
[INFO] -------------------------------------------------
[INFO] Build Summary:
[INFO]   Passed: 3, Failed: 0, Errors: 0, Skipped: 0
[INFO] -------------------------------------------------
[INFO] 
[INFO] --- maven-install-plugin:2.3.1:install (default-install) @ maven-gpg-plugin ---
[INFO] Installing /x1/jenkins/jenkins-slave/workspace/maven-plugins-ITs-m3/maven-gpg-plugin/target/maven-gpg-plugin-1.5-SNAPSHOT.jar
to /home/jenkins/.m2/repository/org/apache/maven/plugins/maven-gpg-plugin/1.5-SNAPSHOT/maven-gpg-plugin-1.5-SNAPSHOT.jar
[INFO] Installing /x1/jenkins/jenkins-slave/workspace/maven-plugins-ITs-m3/maven-gpg-plugin/pom.xml
to /home/jenkins/.m2/repository/org/apache/maven/plugins/maven-gpg-plugin/1.5-SNAPSHOT/maven-gpg-plugin-1.5-SNAPSHOT.pom
[INFO]                                                                         
[INFO] ------------------------------------------------------------------------
[INFO] Building Apache Maven Plugins Aggregator 1-SNAPSHOT
[INFO] ------------------------------------------------------------------------
[INFO] 
[INFO] --- maven-clean-plugin:2.4.1:clean (default-clean) @ maven-plugins-aggregator ---
[INFO] Deleting /x1/jenkins/jenkins-slave/workspace/maven-plugins-ITs-m3/target
[INFO] 
[INFO] --- maven-remote-resources-plugin:1.1:process (default) @ maven-plugins-aggregator
---
[INFO] Setting property: classpath.resource.loader.class => 'org.codehaus.plexus.velocity.ContextClassLoaderResourceLoader'.
[INFO] Setting property: velocimacro.messages.on => 'false'.
[INFO] Setting property: resource.loader => 'classpath'.
[INFO] Setting property: resource.manager.logwhenfound => 'false'.
[INFO] 
[INFO] --- maven-install-plugin:2.3.1:install (default-install) @ maven-plugins-aggregator
---
[INFO] Installing /x1/jenkins/jenkins-slave/workspace/maven-plugins-ITs-m3/pom.xml to /home/jenkins/.m2/repository/org/apache/maven/plugins/maven-plugins-aggregator/1-SNAPSHOT/maven-plugins-aggregator-1-SNAPSHOT.pom
[INFO] ------------------------------------------------------------------------
[INFO] Reactor Summary:
[INFO] 
[INFO] Apache Maven Plugins .............................. SUCCESS [8.822s]
[INFO] Apache Maven ACR Plugin ........................... SUCCESS [24.477s]
[INFO] Apache Maven Ant Plugin ........................... SUCCESS [1:13.398s]
[INFO] Apache Maven AntRun Plugin ........................ SUCCESS [51.488s]
[INFO] Apache Maven Eclipse Plugin ....................... SUCCESS [6:49.199s]
[INFO] Apache Maven Assembly Plugin ...................... SUCCESS [9:48.991s]
[INFO] Apache Maven Changelog Plugin ..................... SUCCESS [42.218s]
[INFO] Apache Maven Changes Plugin ....................... SUCCESS [58.223s]
[INFO] Apache Maven Checkstyle Plugin .................... SUCCESS [1:40.161s]
[INFO] Apache Maven Clean Plugin ......................... SUCCESS [20.654s]
[INFO] Apache Maven Compiler Plugin ...................... SUCCESS [1:14.843s]
[INFO] Apache Maven Dependency Plugin .................... SUCCESS [2:38.888s]
[INFO] Apache Maven Deploy Plugin ........................ SUCCESS [1:15.458s]
[INFO] Apache Maven DOAP Plugin .......................... SUCCESS [6.453s]
[INFO] Apache Maven Documentation Checker Plugin ......... SUCCESS [7.906s]
[INFO] Apache Maven EAR Plugin ........................... FAILURE [5.605s]
[INFO] Apache Maven EJB Plugin ........................... SUCCESS [23.569s]
[INFO] Apache Maven Help Plugin .......................... FAILURE [3.589s]
[INFO] Apache Maven Install Plugin ....................... SUCCESS [56.563s]
[INFO] Apache Maven JAR Plugin ........................... FAILURE [5.198s]
[INFO] Apache Maven Jarsigner Plugin ..................... SUCCESS [25.036s]
[INFO] Apache Maven Javadoc Plugin ....................... FAILURE [1:37.945s]
[INFO] Apache Maven Linkcheck Plugin ..................... SUCCESS [2.770s]
[INFO] Apache Maven Patch Plugin ......................... SUCCESS [13.426s]
[INFO] Apache Maven PDF Plugin ........................... SUCCESS [1:36.244s]
[INFO] Apache Maven PMD Plugin ........................... SUCCESS [1:33.769s]
[INFO] Apache Maven RAR Plugin ........................... SUCCESS [9.674s]
[INFO] Apache Maven Reactor Plugin ....................... SUCCESS [2.349s]
[INFO] Apache Maven Repository Plugin .................... SUCCESS [46.645s]
[INFO] Apache Maven Resources Plugin ..................... SUCCESS [52.975s]
[INFO] Apache Maven Site Plugin 3 ........................ FAILURE [16.987s]
[INFO] Apache Maven Source Plugin ........................ FAILURE [4.337s]
[INFO] Apache Maven Stage Plugin ......................... SUCCESS [2.071s]
[INFO] Apache Maven Toolchains Plugin .................... SUCCESS [1.485s]
[INFO] Apache Maven Verifier Plugin ...................... SUCCESS [14.197s]
[INFO] Apache Maven WAR Plugin ........................... FAILURE [13.179s]
[INFO] Apache Maven SCM Publish Plugin ................... SUCCESS [45.628s]
[INFO] Apache Maven Invoker Plugin ....................... FAILURE [13.532s]
[INFO] Apache Maven Project Info Reports Plugin .......... SUCCESS [2:04.494s]
[INFO] Apache Maven Remote Resources Plugin .............. SUCCESS [1:04.503s]
[INFO] Apache Maven Shade Plugin ......................... FAILURE [8.376s]
[INFO] Apache Maven GPG Plugin ........................... SUCCESS [9.830s]
[INFO] Apache Maven Plugins Aggregator ................... SUCCESS [0.411s]
[INFO] ------------------------------------------------------------------------
[INFO] BUILD FAILURE
[INFO] ------------------------------------------------------------------------
[INFO] Total time: 42:38.549s
[INFO] Finished at: Sat Nov 09 20:39:44 GMT 2013
[INFO] Final Memory: 84M/204M
[INFO] ------------------------------------------------------------------------
[WARNING] The requested profile "apache.snapshots" could not be activated because it does
not exist.
[ERROR] Failed to execute goal org.apache.maven.plugins:maven-compiler-plugin:3.0:testCompile
(default-testCompile) on project maven-ear-plugin: Compilation failure: Compilation failure:
[ERROR] /x1/jenkins/jenkins-slave/workspace/maven-plugins-ITs-m3/maven-ear-plugin/src/test/java/org/apache/maven/plugin/ear/output/TestAbstractFileNameMapping.java:[23,26]
package org.mockito does not exist
[ERROR] /x1/jenkins/jenkins-slave/workspace/maven-plugins-ITs-m3/maven-ear-plugin/src/test/java/org/apache/maven/plugin/ear/output/TestAbstractFileNameMapping.java:[42,34]
cannot find symbol
[ERROR] symbol  : method mock(java.lang.Class<org.apache.maven.artifact.handler.ArtifactHandler>)
[ERROR] location: class org.apache.maven.plugin.ear.output.TestAbstractFileNameMapping
[ERROR] /x1/jenkins/jenkins-slave/workspace/maven-plugins-ITs-m3/maven-ear-plugin/src/test/java/org/apache/maven/plugin/ear/output/TestAbstractFileNameMapping.java:[43,8]
cannot find symbol
[ERROR] symbol  : method when(java.lang.String)
[ERROR] location: class org.apache.maven.plugin.ear.output.TestAbstractFileNameMapping
[ERROR] /x1/jenkins/jenkins-slave/workspace/maven-plugins-ITs-m3/maven-ear-plugin/src/test/java/org/apache/maven/plugin/ear/output/TestAbstractFileNameMapping.java:[45,28]
cannot find symbol
[ERROR] symbol  : method mock(java.lang.Class<org.apache.maven.artifact.Artifact>)
[ERROR] location: class org.apache.maven.plugin.ear.output.TestAbstractFileNameMapping
[ERROR] /x1/jenkins/jenkins-slave/workspace/maven-plugins-ITs-m3/maven-ear-plugin/src/test/java/org/apache/maven/plugin/ear/output/TestAbstractFileNameMapping.java:[46,8]
cannot find symbol
[ERROR] symbol  : method when(org.apache.maven.artifact.handler.ArtifactHandler)
[ERROR] location: class org.apache.maven.plugin.ear.output.TestAbstractFileNameMapping
[ERROR] /x1/jenkins/jenkins-slave/workspace/maven-plugins-ITs-m3/maven-ear-plugin/src/test/java/org/apache/maven/plugin/ear/output/TestAbstractFileNameMapping.java:[47,8]
cannot find symbol
[ERROR] symbol  : method when(java.lang.String)
[ERROR] location: class org.apache.maven.plugin.ear.output.TestAbstractFileNameMapping
[ERROR] /x1/jenkins/jenkins-slave/workspace/maven-plugins-ITs-m3/maven-ear-plugin/src/test/java/org/apache/maven/plugin/ear/output/TestAbstractFileNameMapping.java:[48,8]
cannot find symbol
[ERROR] symbol  : method when(java.lang.String)
[ERROR] location: class org.apache.maven.plugin.ear.output.TestAbstractFileNameMapping
[ERROR] /x1/jenkins/jenkins-slave/workspace/maven-plugins-ITs-m3/maven-ear-plugin/src/test/java/org/apache/maven/plugin/ear/output/TestAbstractFileNameMapping.java:[49,8]
cannot find symbol
[ERROR] symbol  : method when(java.lang.String)
[ERROR] location: class org.apache.maven.plugin.ear.output.TestAbstractFileNameMapping
[ERROR] -> [Help 1]
[ERROR] Failed to execute goal org.apache.maven.plugins:maven-invoker-plugin:1.8:install (integration-test)
on project maven-help-plugin: Failed to install project dependencies: MavenProject: org.apache.maven.plugins:maven-help-plugin:2.2.1-SNAPSHOT
@ /x1/jenkins/jenkins-slave/workspace/maven-plugins-ITs-m3/maven-help-plugin/pom.xml: Failed
to install project artifacts: MavenProject: org.apache.maven.plugins:maven-ear-plugin:2.9-SNAPSHOT
@ /x1/jenkins/jenkins-slave/workspace/maven-plugins-ITs-m3/maven-ear-plugin/pom.xml: Failed
to install artifact: org.apache.maven.plugins:maven-ear-plugin:maven-plugin:2.9-SNAPSHOT:
Artifact is not fully assembled: /x1/jenkins/jenkins-slave/workspace/maven-plugins-ITs-m3/maven-ear-plugin/target/classes
-> [Help 2]
[ERROR] Failed to execute goal org.apache.maven.plugins:maven-invoker-plugin:1.8:install (integration-test)
on project maven-jar-plugin: Failed to install project dependencies: MavenProject: org.apache.maven.plugins:maven-jar-plugin:2.5-SNAPSHOT
@ /x1/jenkins/jenkins-slave/workspace/maven-plugins-ITs-m3/maven-jar-plugin/pom.xml: Failed
to install project artifacts: MavenProject: org.apache.maven.plugins:maven-ear-plugin:2.9-SNAPSHOT
@ /x1/jenkins/jenkins-slave/workspace/maven-plugins-ITs-m3/maven-ear-plugin/pom.xml: Failed
to install artifact: org.apache.maven.plugins:maven-ear-plugin:maven-plugin:2.9-SNAPSHOT:
Artifact is not fully assembled: /x1/jenkins/jenkins-slave/workspace/maven-plugins-ITs-m3/maven-ear-plugin/target/classes
-> [Help 2]
[ERROR] Failed to execute goal org.apache.maven.plugins:maven-invoker-plugin:1.8:install (integration-test)
on project maven-javadoc-plugin: Failed to install project dependencies: MavenProject: org.apache.maven.plugins:maven-javadoc-plugin:2.9.2-SNAPSHOT
@ /x1/jenkins/jenkins-slave/workspace/maven-plugins-ITs-m3/maven-javadoc-plugin/pom.xml: Failed
to install project artifacts: MavenProject: org.apache.maven.plugins:maven-ear-plugin:2.9-SNAPSHOT
@ /x1/jenkins/jenkins-slave/workspace/maven-plugins-ITs-m3/maven-ear-plugin/pom.xml: Failed
to install artifact: org.apache.maven.plugins:maven-ear-plugin:maven-plugin:2.9-SNAPSHOT:
Artifact is not fully assembled: /x1/jenkins/jenkins-slave/workspace/maven-plugins-ITs-m3/maven-ear-plugin/target/classes
-> [Help 2]
[ERROR] Failed to execute goal org.apache.maven.plugins:maven-invoker-plugin:1.8:install (integration-test)
on project maven-site-plugin: Failed to install project dependencies: MavenProject: org.apache.maven.plugins:maven-site-plugin:3.4-SNAPSHOT
@ /x1/jenkins/jenkins-slave/workspace/maven-plugins-ITs-m3/maven-site-plugin/dependency-reduced-pom.xml:
Failed to install project artifacts: MavenProject: org.apache.maven.plugins:maven-ear-plugin:2.9-SNAPSHOT
@ /x1/jenkins/jenkins-slave/workspace/maven-plugins-ITs-m3/maven-ear-plugin/pom.xml: Failed
to install artifact: org.apache.maven.plugins:maven-ear-plugin:maven-plugin:2.9-SNAPSHOT:
Artifact is not fully assembled: /x1/jenkins/jenkins-slave/workspace/maven-plugins-ITs-m3/maven-ear-plugin/target/classes
-> [Help 2]
[ERROR] Failed to execute goal org.apache.maven.plugins:maven-invoker-plugin:1.8:install (integration-test)
on project maven-source-plugin: Failed to install project dependencies: MavenProject: org.apache.maven.plugins:maven-source-plugin:2.3-SNAPSHOT
@ /x1/jenkins/jenkins-slave/workspace/maven-plugins-ITs-m3/maven-source-plugin/pom.xml: Failed
to install project artifacts: MavenProject: org.apache.maven.plugins:maven-ear-plugin:2.9-SNAPSHOT
@ /x1/jenkins/jenkins-slave/workspace/maven-plugins-ITs-m3/maven-ear-plugin/pom.xml: Failed
to install artifact: org.apache.maven.plugins:maven-ear-plugin:maven-plugin:2.9-SNAPSHOT:
Artifact is not fully assembled: /x1/jenkins/jenkins-slave/workspace/maven-plugins-ITs-m3/maven-ear-plugin/target/classes
-> [Help 2]
[ERROR] Failed to execute goal org.apache.maven.plugins:maven-invoker-plugin:1.8:install (integration-test)
on project maven-war-plugin: Failed to install project dependencies: MavenProject: org.apache.maven.plugins:maven-war-plugin:2.5-SNAPSHOT
@ /x1/jenkins/jenkins-slave/workspace/maven-plugins-ITs-m3/maven-war-plugin/pom.xml: Failed
to install project artifacts: MavenProject: org.apache.maven.plugins:maven-ear-plugin:2.9-SNAPSHOT
@ /x1/jenkins/jenkins-slave/workspace/maven-plugins-ITs-m3/maven-ear-plugin/pom.xml: Failed
to install artifact: org.apache.maven.plugins:maven-ear-plugin:maven-plugin:2.9-SNAPSHOT:
Artifact is not fully assembled: /x1/jenkins/jenkins-slave/workspace/maven-plugins-ITs-m3/maven-ear-plugin/target/classes
-> [Help 2]
[ERROR] Failed to execute goal org.apache.maven.plugins:maven-invoker-plugin:1.8:install (integration-test)
on project maven-invoker-plugin: Failed to install project dependencies: MavenProject: org.apache.maven.plugins:maven-invoker-plugin:1.9-SNAPSHOT
@ /x1/jenkins/jenkins-slave/workspace/maven-plugins-ITs-m3/maven-invoker-plugin/pom.xml: Failed
to install project artifacts: MavenProject: org.apache.maven.plugins:maven-ear-plugin:2.9-SNAPSHOT
@ /x1/jenkins/jenkins-slave/workspace/maven-plugins-ITs-m3/maven-ear-plugin/pom.xml: Failed
to install artifact: org.apache.maven.plugins:maven-ear-plugin:maven-plugin:2.9-SNAPSHOT:
Artifact is not fully assembled: /x1/jenkins/jenkins-slave/workspace/maven-plugins-ITs-m3/maven-ear-plugin/target/classes
-> [Help 2]
[ERROR] Failed to execute goal org.apache.maven.plugins:maven-invoker-plugin:1.8:install (integration-test)
on project maven-shade-plugin: Failed to install project dependencies: MavenProject: org.apache.maven.plugins:maven-shade-plugin:2.2-SNAPSHOT
@ /x1/jenkins/jenkins-slave/workspace/maven-plugins-ITs-m3/maven-shade-plugin/pom.xml: Failed
to install project artifacts: MavenProject: org.apache.maven.plugins:maven-ear-plugin:2.9-SNAPSHOT
@ /x1/jenkins/jenkins-slave/workspace/maven-plugins-ITs-m3/maven-ear-plugin/pom.xml: Failed
to install artifact: org.apache.maven.plugins:maven-ear-plugin:maven-plugin:2.9-SNAPSHOT:
Artifact is not fully assembled: /x1/jenkins/jenkins-slave/workspace/maven-plugins-ITs-m3/maven-ear-plugin/target/classes
-> [Help 2]
[ERROR] 
[ERROR] To see the full stack trace of the errors, re-run Maven with the -e switch.
[ERROR] Re-run Maven using the -X switch to enable full debug logging.
[ERROR] 
[ERROR] For more information about the errors and possible solutions, please read the following
articles:
[ERROR] [Help 1] http://cwiki.apache.org/confluence/display/MAVEN/MojoFailureException
[ERROR] [Help 2] http://cwiki.apache.org/confluence/display/MAVEN/MojoExecutionException
[ERROR] 
[ERROR] After correcting the problems, you can resume the build with the command
[ERROR]   mvn <goals> -rf :maven-ear-plugin
Build step 'Invoke top-level Maven targets' marked build as failure
Recording test results

Mime
View raw message