maven-notifications mailing list archives

Site index · List index
Message view « Date » · « Thread »
Top « Date » · « Thread »
From Apache Jenkins Server <jenk...@builds.apache.org>
Subject Build failed in Jenkins: dist-tool-plugin #288
Date Wed, 06 Nov 2013 17:16:55 GMT
See <https://builds.apache.org/job/dist-tool-plugin/288/>

------------------------------------------
[...truncated 375 lines...]
Generating <https://builds.apache.org/job/dist-tool-plugin/ws/target/site/apidocs/index.html...>
Generating <https://builds.apache.org/job/dist-tool-plugin/ws/target/site/apidocs/overview-summary.html...>
Generating <https://builds.apache.org/job/dist-tool-plugin/ws/target/site/apidocs/help-doc.html...>
Note: Custom tags that could override future standard tags:  @requiresDependencyResolution,
@requiresReports, @execute, @configurator, @aggregator, @instantiationStrategy, @threadSafe,
@executionStrategy, @goal, @requiresOnline, @parameter, @requiresDirectInvocation, @component,
@inheritByDefault, @requiresProject, @required, @readonly, @phase, @requiresDependencyCollection.
To avoid potential overrides, use at least one period character (.) in custom tag names.
3 warnings
[WARNING] Javadoc Warnings
[WARNING] javadoc: warning - Error fetching URL: http://commons.apache.org/collections/apidocs-COLLECTIONS_3_0/package-list
[WARNING] <https://builds.apache.org/job/dist-tool-plugin/ws/target/generated-sources/plugin/org/apache/maven/dist/tools/HelpMojo.java>:30:
warning - @author tag has no arguments.
[WARNING] <https://builds.apache.org/job/dist-tool-plugin/ws/target/generated-sources/plugin/org/apache/maven/dist/tools/HelpMojo.java>:30:
warning - @version tag has no arguments.
[INFO] Generating "Test JavaDocs" report    --- maven-javadoc-plugin:2.9
[ERROR] Error fetching link: http://www.eclipse.org/aether/aether-api/apidocs/package-list.
Ignored it.
[ERROR] Error fetching link: http://www.eclipse.org/aether/aether-util/apidocs/package-list.
Ignored it.
[ERROR] Error fetching link: http://xml.apache.org/commons/components/external/apidocs/package-list.
Ignored it.
[ERROR] Error fetching link: http://selenium.googlecode.com/selenium-firefox-driver/apidocs/package-list.
Ignored it.
[ERROR] Error fetching link: http://junit.org/apidocs/package-list. Ignored it.
[ERROR] Error fetching link: http://hc.apache.org/httpcomponents-client/apidocs/package-list.
Ignored it.
[INFO] 
Loading source files for package org.apache.maven.dist.tools...
Constructing Javadoc information...
Registered Taglet org.apache.maven.tools.plugin.javadoc.MojoRequiresDirectInvocationTypeTaglet
...
Registered Taglet org.apache.maven.tools.plugin.javadoc.MojoParameterFieldTaglet ...
Registered Taglet org.apache.maven.tools.plugin.javadoc.MojoGoalTypeTaglet ...
Registered Taglet org.apache.maven.tools.plugin.javadoc.MojoInheritByDefaultTypeTaglet ...
Registered Taglet org.apache.maven.tools.plugin.javadoc.MojoExecuteTypeTaglet ...
Registered Taglet org.apache.maven.tools.plugin.javadoc.MojoRequiresDependencyCollectionTypeTaglet
...
Registered Taglet org.apache.maven.tools.plugin.javadoc.MojoConfiguratorTypeTaglet ...
Registered Taglet org.apache.maven.tools.plugin.javadoc.MojoRequiresDependencyResolutionTypeTaglet
...
Registered Taglet org.apache.maven.tools.plugin.javadoc.MojoRequiresReportsTypeTaglet ...
Registered Taglet org.apache.maven.tools.plugin.javadoc.MojoThreadSafeTypeTaglet ...
Registered Taglet org.apache.maven.tools.plugin.javadoc.MojoAggregatorTypeTaglet ...
Registered Taglet org.apache.maven.tools.plugin.javadoc.MojoRequiresOnLineTypeTaglet ...
Registered Taglet org.apache.maven.tools.plugin.javadoc.MojoRequiredFieldTaglet ...
Registered Taglet org.apache.maven.tools.plugin.javadoc.MojoPhaseTypeTaglet ...
Registered Taglet org.apache.maven.tools.plugin.javadoc.MojoReadOnlyFieldTaglet ...
Registered Taglet org.apache.maven.tools.plugin.javadoc.MojoComponentFieldTaglet ...
Registered Taglet org.apache.maven.tools.plugin.javadoc.MojoInstantiationStrategyTypeTaglet
...
Registered Taglet org.apache.maven.tools.plugin.javadoc.MojoRequiresProjectTypeTaglet ...
Registered Taglet org.apache.maven.tools.plugin.javadoc.MojoExecutionStrategyTypeTaglet ...
Registered Taglet org.codehaus.plexus.javadoc.PlexusConfigurationTaglet ...
Registered Taglet org.codehaus.plexus.javadoc.PlexusRequirementTaglet ...
Registered Taglet org.codehaus.plexus.javadoc.PlexusComponentTaglet ...
Standard Doclet version 1.7.0_25
Building tree for all the packages and classes...
Generating <https://builds.apache.org/job/dist-tool-plugin/ws/target/site/testapidocs/org/apache/maven/dist/tools/PatternTest.html...>
Generating <https://builds.apache.org/job/dist-tool-plugin/ws/target/site/testapidocs/org/apache/maven/dist/tools/package-frame.html...>
Generating <https://builds.apache.org/job/dist-tool-plugin/ws/target/site/testapidocs/org/apache/maven/dist/tools/package-summary.html...>
Generating <https://builds.apache.org/job/dist-tool-plugin/ws/target/site/testapidocs/org/apache/maven/dist/tools/package-tree.html...>
Generating <https://builds.apache.org/job/dist-tool-plugin/ws/target/site/testapidocs/constant-values.html...>
Generating <https://builds.apache.org/job/dist-tool-plugin/ws/target/site/testapidocs/org/apache/maven/dist/tools/class-use/PatternTest.html...>
Generating <https://builds.apache.org/job/dist-tool-plugin/ws/target/site/testapidocs/org/apache/maven/dist/tools/package-use.html...>
Building index for all the packages and classes...
Generating <https://builds.apache.org/job/dist-tool-plugin/ws/target/site/testapidocs/overview-tree.html...>
Generating <https://builds.apache.org/job/dist-tool-plugin/ws/target/site/testapidocs/index-all.html...>
Generating <https://builds.apache.org/job/dist-tool-plugin/ws/target/site/testapidocs/deprecated-list.html...>
Building index for all classes...
Generating <https://builds.apache.org/job/dist-tool-plugin/ws/target/site/testapidocs/allclasses-frame.html...>
Generating <https://builds.apache.org/job/dist-tool-plugin/ws/target/site/testapidocs/allclasses-noframe.html...>
Generating <https://builds.apache.org/job/dist-tool-plugin/ws/target/site/testapidocs/index.html...>
Generating <https://builds.apache.org/job/dist-tool-plugin/ws/target/site/testapidocs/help-doc.html...>
Note: Custom tags that could override future standard tags:  @requiresDependencyResolution,
@requiresReports, @execute, @configurator, @aggregator, @instantiationStrategy, @threadSafe,
@executionStrategy, @goal, @requiresOnline, @parameter, @requiresDirectInvocation, @component,
@inheritByDefault, @requiresProject, @required, @readonly, @phase, @requiresDependencyCollection.
To avoid potential overrides, use at least one period character (.) in custom tag names.
Note: Custom tags that were not seen:  @plexus.requirement, @parameter, @component, @plexus.configuration,
@required, @readonly
1 warning
[WARNING] Javadoc Warnings
[WARNING] javadoc: warning - Error fetching URL: http://commons.apache.org/collections/apidocs-COLLECTIONS_3_0/package-list
[INFO] Generating "FindBugs Report" report    --- findbugs-maven-plugin:2.5.2
[INFO] Locale is en
[INFO] Fork Value is true
     [java] The following classes needed for analysis were missing:
     [java]   org.apache.maven.artifact.repository.Authentication
     [java]   org.apache.maven.repository.Proxy
     [java] Warnings generated: 15
[INFO] Done FindBugs Analysis....
[warn] [XHTML Sink] Modified invalid anchor name: 'org.apache.maven.dist.tools.DistCheckSiteMojo$CheckSiteResult'
to 'org.apache.maven.dist.tools.DistCheckSiteMojoCheckSiteResult'
[INFO] Generating "Sonar" report    --- maven-report:0.1
[INFO] Generating "Dist Tool> Sites" report    --- dist-tool-plugin:0.0.1-SNAPSHOT
[WARNING] HTTP result code: 404 for apache-incubator-disclaimer-resource-bundle site = http://maven.apache.org/apache-resource-bundles/apache-incubator-disclaimer-resource-bundle/
[WARNING] HTTP result code: 404 for file-management site = http://maven.apache.org/shared/file-management/
[INFO] Generating "Dist Tool> Source Release" report    --- dist-tool-plugin:0.0.1-SNAPSHOT
[WARNING] Missing file for doxia-linkcheck in http://repo.maven.apache.org/maven2/org/apache/maven/doxia/doxia-linkcheck/1.2
[WARNING]  > doxia-linkcheck-1.2-source-release.zip <
[WARNING]  > doxia-linkcheck-1.2-source-release.zip.asc <
[WARNING]  > doxia-linkcheck-1.2-source-release.zip.md5 <
[WARNING] Missing file for doxia-linkcheck in http://www.apache.org/dist/maven/doxia
[WARNING]  > doxia-linkcheck-1.2-source-release.zip <
[WARNING]  > doxia-linkcheck-1.2-source-release.zip.asc <
[WARNING]  > doxia-linkcheck-1.2-source-release.zip.md5 <
[WARNING] Missing file for apache-maven in http://repo.maven.apache.org/maven2/org/apache/maven/apache-maven/2.0.11
[WARNING]  > apache-maven-2.0.11-src.zip <
[WARNING]  > apache-maven-2.0.11-src.zip.asc <
[WARNING]  > apache-maven-2.0.11-src.zip.md5 <
[WARNING] Missing file for maven-docck-plugin in http://repo.maven.apache.org/maven2/org/apache/maven/plugins/maven-docck-plugin/1.0
[WARNING]  > maven-docck-plugin-1.0-source-release.zip <
[WARNING]  > maven-docck-plugin-1.0-source-release.zip.asc <
[WARNING]  > maven-docck-plugin-1.0-source-release.zip.md5 <
[WARNING] Missing file for maven-docck-plugin in http://www.apache.org/dist/maven/plugins
[WARNING]  > maven-docck-plugin-1.0-source-release.zip <
[WARNING]  > maven-docck-plugin-1.0-source-release.zip.asc <
[WARNING]  > maven-docck-plugin-1.0-source-release.zip.md5 <
[WARNING] Missing file for maven-reactor-plugin in http://repo.maven.apache.org/maven2/org/apache/maven/plugins/maven-reactor-plugin/1.0
[WARNING]  > maven-reactor-plugin-1.0-source-release.zip <
[WARNING]  > maven-reactor-plugin-1.0-source-release.zip.asc <
[WARNING]  > maven-reactor-plugin-1.0-source-release.zip.md5 <
[WARNING] Missing file for maven-reactor-plugin in http://www.apache.org/dist/maven/plugins
[WARNING]  > maven-reactor-plugin-1.0-source-release.zip <
[WARNING]  > maven-reactor-plugin-1.0-source-release.zip.asc <
[WARNING]  > maven-reactor-plugin-1.0-source-release.zip.md5 <
[WARNING] Missing file for apache-incubator-disclaimer-resource-bundle in http://repo.maven.apache.org/maven2/org/apache/apache-incubator-disclaimer-resource-bundle/1.1
[WARNING]  > apache-incubator-disclaimer-resource-bundle-1.1-source-release.zip <
[WARNING]  > apache-incubator-disclaimer-resource-bundle-1.1-source-release.zip.asc <
[WARNING]  > apache-incubator-disclaimer-resource-bundle-1.1-source-release.zip.md5 <
[WARNING] Missing file for apache-incubator-disclaimer-resource-bundle in http://www.apache.org/dist/maven/resources
[WARNING]  > apache-incubator-disclaimer-resource-bundle-1.1-source-release.zip <
[WARNING]  > apache-incubator-disclaimer-resource-bundle-1.1-source-release.zip.asc <
[WARNING]  > apache-incubator-disclaimer-resource-bundle-1.1-source-release.zip.md5 <
[WARNING] Missing file for apache-jar-resource-bundle in http://repo.maven.apache.org/maven2/org/apache/apache-jar-resource-bundle/1.4
[WARNING]  > apache-jar-resource-bundle-1.4-source-release.zip <
[WARNING]  > apache-jar-resource-bundle-1.4-source-release.zip.asc <
[WARNING]  > apache-jar-resource-bundle-1.4-source-release.zip.md5 <
[WARNING] Missing file for apache-jar-resource-bundle in http://www.apache.org/dist/maven/resources
[WARNING]  > apache-jar-resource-bundle-1.4-source-release.zip <
[WARNING]  > apache-jar-resource-bundle-1.4-source-release.zip.asc <
[WARNING]  > apache-jar-resource-bundle-1.4-source-release.zip.md5 <
[WARNING] Missing file for apache-license-header-resource-bundle in http://repo.maven.apache.org/maven2/org/apache/apache-license-header-resource-bundle/1.1
[WARNING]  > apache-license-header-resource-bundle-1.1-source-release.zip <
[WARNING]  > apache-license-header-resource-bundle-1.1-source-release.zip.asc <
[WARNING]  > apache-license-header-resource-bundle-1.1-source-release.zip.md5 <
[WARNING] Missing file for apache-license-header-resource-bundle in http://www.apache.org/dist/maven/resources
[WARNING]  > apache-license-header-resource-bundle-1.1-source-release.zip <
[WARNING]  > apache-license-header-resource-bundle-1.1-source-release.zip.asc <
[WARNING]  > apache-license-header-resource-bundle-1.1-source-release.zip.md5 <
[WARNING] Missing file for file-management in http://repo.maven.apache.org/maven2/org/apache/maven/shared/file-management/1.2.1
[WARNING]  > file-management-1.2.1-source-release.zip <
[WARNING]  > file-management-1.2.1-source-release.zip.asc <
[WARNING]  > file-management-1.2.1-source-release.zip.md5 <
[WARNING] Missing file for file-management in http://www.apache.org/dist/maven/shared
[WARNING]  > file-management-1.2.1-source-release.zip <
[WARNING]  > file-management-1.2.1-source-release.zip.asc <
[WARNING]  > file-management-1.2.1-source-release.zip.md5 <
[WARNING] Missing file for maven-repository-builder in http://repo.maven.apache.org/maven2/org/apache/maven/shared/maven-repository-builder/1.0-alpha-2
[WARNING]  > maven-repository-builder-1.0-alpha-2-source-release.zip <
[WARNING]  > maven-repository-builder-1.0-alpha-2-source-release.zip.asc <
[WARNING]  > maven-repository-builder-1.0-alpha-2-source-release.zip.md5 <
[WARNING] Missing file for maven-repository-builder in http://www.apache.org/dist/maven/shared
[WARNING]  > maven-repository-builder-1.0-alpha-2-source-release.zip <
[WARNING]  > maven-repository-builder-1.0-alpha-2-source-release.zip.asc <
[WARNING]  > maven-repository-builder-1.0-alpha-2-source-release.zip.md5 <
[INFO] Generating "Dist Tool> Index Pages" report    --- dist-tool-plugin:0.0.1-SNAPSHOT
[warn] [XHTML Sink] Modified invalid anchor name: '_not_in_distribution_area_' to 'a_not_in_distribution_area_'
[INFO] Generating "Failure Hack" report    --- dist-tool-plugin:0.0.1-SNAPSHOT
[INFO] Generating "Plugin Documentation" report    --- maven-plugin-plugin:3.2
[INFO] Applying mojo extractor for language: java-annotations
[INFO] Mojo extractor for language: java-annotations found 5 mojo descriptors.
[INFO] Applying mojo extractor for language: java
[INFO] Mojo extractor for language: java found 0 mojo descriptors.
[INFO] Applying mojo extractor for language: bsh
[INFO] Mojo extractor for language: bsh found 0 mojo descriptors.
[INFO] ------------------------------------------------------------------------
[INFO] BUILD FAILURE
[INFO] ------------------------------------------------------------------------
[INFO] Total time: 7:32.129s
[INFO] Finished at: Wed Nov 06 17:16:35 UTC 2013
[INFO] Final Memory: 59M/423M
[INFO] ------------------------------------------------------------------------
Waiting for Jenkins to finish collecting data
[ERROR] Internal error: hudson.remoting.RemotingSystemException: java.io.UTFDataFormatException
-> [Help 1]
org.apache.maven.InternalErrorException: Internal error: hudson.remoting.RemotingSystemException:
java.io.UTFDataFormatException
	at org.apache.maven.lifecycle.internal.BuilderCommon.handleBuildError(BuilderCommon.java:128)
	at org.apache.maven.lifecycle.internal.LifecycleModuleBuilder.buildProject(LifecycleModuleBuilder.java:95)
	at org.apache.maven.lifecycle.internal.LifecycleModuleBuilder.buildProject(LifecycleModuleBuilder.java:59)
	at org.apache.maven.lifecycle.internal.LifecycleStarter.singleThreadedBuild(LifecycleStarter.java:183)
	at org.apache.maven.lifecycle.internal.LifecycleStarter.execute(LifecycleStarter.java:161)
	at org.apache.maven.DefaultMaven.doExecute(DefaultMaven.java:320)
	at org.apache.maven.DefaultMaven.execute(DefaultMaven.java:156)
	at org.jvnet.hudson.maven3.launcher.Maven3Launcher.main(Maven3Launcher.java:117)
	at sun.reflect.NativeMethodAccessorImpl.invoke0(Native Method)
	at sun.reflect.NativeMethodAccessorImpl.invoke(NativeMethodAccessorImpl.java:57)
	at sun.reflect.DelegatingMethodAccessorImpl.invoke(DelegatingMethodAccessorImpl.java:43)
	at java.lang.reflect.Method.invoke(Method.java:606)
	at org.codehaus.plexus.classworlds.launcher.Launcher.launchStandard(Launcher.java:329)
	at org.codehaus.plexus.classworlds.launcher.Launcher.launch(Launcher.java:239)
	at org.jvnet.hudson.maven3.agent.Maven3Main.launch(Maven3Main.java:178)
	at sun.reflect.NativeMethodAccessorImpl.invoke0(Native Method)
	at sun.reflect.NativeMethodAccessorImpl.invoke(NativeMethodAccessorImpl.java:57)
	at sun.reflect.DelegatingMethodAccessorImpl.invoke(DelegatingMethodAccessorImpl.java:43)
	at java.lang.reflect.Method.invoke(Method.java:606)
	at hudson.maven.Maven3Builder.call(Maven3Builder.java:134)
	at hudson.maven.Maven3Builder.call(Maven3Builder.java:69)
	at hudson.remoting.UserRequest.perform(UserRequest.java:118)
	at hudson.remoting.UserRequest.perform(UserRequest.java:48)
	at hudson.remoting.Request$2.run(Request.java:326)
	at hudson.remoting.InterceptingExecutorService$1.call(InterceptingExecutorService.java:72)
	at java.util.concurrent.FutureTask$Sync.innerRun(FutureTask.java:334)
	at java.util.concurrent.FutureTask.run(FutureTask.java:166)
	at java.util.concurrent.ThreadPoolExecutor.runWorker(ThreadPoolExecutor.java:1145)
	at java.util.concurrent.ThreadPoolExecutor$Worker.run(ThreadPoolExecutor.java:615)
	at java.lang.Thread.run(Thread.java:724)
Caused by: hudson.remoting.RemotingSystemException: java.io.UTFDataFormatException
	at hudson.remoting.RemoteInvocationHandler.invoke(RemoteInvocationHandler.java:183)
	at com.sun.proxy.$Proxy7.setExecutedMojos(Unknown Source)
	at hudson.maven.MavenBuildProxy$Filter.setExecutedMojos(MavenBuildProxy.java:257)
	at hudson.maven.Maven3Builder$MavenExecutionListener.recordMojoEnded(Maven3Builder.java:624)
	at hudson.maven.Maven3Builder$MavenExecutionListener.mojoSucceeded(Maven3Builder.java:610)
	at org.apache.maven.lifecycle.internal.DefaultExecutionEventCatapult.fire(DefaultExecutionEventCatapult.java:87)
	at org.apache.maven.lifecycle.internal.DefaultExecutionEventCatapult.fire(DefaultExecutionEventCatapult.java:42)
	at org.apache.maven.lifecycle.internal.MojoExecutor.execute(MojoExecutor.java:228)
	at org.apache.maven.lifecycle.internal.MojoExecutor.execute(MojoExecutor.java:153)
	at org.apache.maven.lifecycle.internal.MojoExecutor.execute(MojoExecutor.java:145)
	at org.apache.maven.lifecycle.internal.LifecycleModuleBuilder.buildProject(LifecycleModuleBuilder.java:84)
	... 28 more
Caused by: java.io.UTFDataFormatException
	at java.io.ObjectInputStream$BlockDataInputStream.readUTFSpan(ObjectInputStream.java:3124)
	at java.io.ObjectInputStream$BlockDataInputStream.readUTFBody(ObjectInputStream.java:3049)
	at java.io.ObjectInputStream$BlockDataInputStream.readUTF(ObjectInputStream.java:2862)
	at java.io.ObjectInputStream.readString(ObjectInputStream.java:1636)
	at java.io.ObjectInputStream.readObject0(ObjectInputStream.java:1339)
	at java.io.ObjectInputStream.defaultReadFields(ObjectInputStream.java:1989)
	at java.io.ObjectInputStream.readSerialData(ObjectInputStream.java:1913)
	at java.io.ObjectInputStream.readOrdinaryObject(ObjectInputStream.java:1796)
	at java.io.ObjectInputStream.readObject0(ObjectInputStream.java:1348)
	at java.io.ObjectInputStream.readArray(ObjectInputStream.java:1704)
	at java.io.ObjectInputStream.readObject0(ObjectInputStream.java:1342)
	at java.io.ObjectInputStream.defaultReadFields(ObjectInputStream.java:1989)
	at java.io.ObjectInputStream.defaultReadObject(ObjectInputStream.java:499)
	at java.lang.Throwable.readObject(Throwable.java:913)
	at sun.reflect.GeneratedMethodAccessor163.invoke(Unknown Source)
	at sun.reflect.DelegatingMethodAccessorImpl.invoke(DelegatingMethodAccessorImpl.java:43)
	at java.lang.reflect.Method.invoke(Method.java:606)
	at java.io.ObjectStreamClass.invokeReadObject(ObjectStreamClass.java:1017)
	at java.io.ObjectInputStream.readSerialData(ObjectInputStream.java:1891)
	at java.io.ObjectInputStream.readOrdinaryObject(ObjectInputStream.java:1796)
	at java.io.ObjectInputStream.readObject0(ObjectInputStream.java:1348)
	at java.io.ObjectInputStream.defaultReadFields(ObjectInputStream.java:1989)
	at java.io.ObjectInputStream.readSerialData(ObjectInputStream.java:1913)
	at java.io.ObjectInputStream.readOrdinaryObject(ObjectInputStream.java:1796)
	at java.io.ObjectInputStream.readObject0(ObjectInputStream.java:1348)
	at java.io.ObjectInputStream.readObject(ObjectInputStream.java:370)
	at hudson.remoting.UserRequest.deserialize(UserRequest.java:182)
	at hudson.remoting.UserRequest.perform(UserRequest.java:98)
	... 8 more
[JENKINS] Archiving <https://builds.apache.org/job/dist-tool-plugin/ws/pom.xml> to org.apache.maven.dist.tools/dist-tool-plugin/0.0.1-SNAPSHOT/dist-tool-plugin-0.0.1-SNAPSHOT.pom
[JENKINS] Archiving <https://builds.apache.org/job/dist-tool-plugin/ws/target/dist-tool-plugin-0.0.1-SNAPSHOT.jar>
to org.apache.maven.dist.tools/dist-tool-plugin/0.0.1-SNAPSHOT/dist-tool-plugin-0.0.1-SNAPSHOT.jar
[ERROR] 
[ERROR] To see the full stack trace of the errors, re-run Maven with the -e switch.
[ERROR] Re-run Maven using the -X switch to enable full debug logging.
[ERROR] 
[ERROR] For more information about the errors and possible solutions, please read the following
articles:
[ERROR] [Help 1] http://cwiki.apache.org/confluence/display/MAVEN/InternalErrorException
Sending e-mails to: notifications@maven.apache.org null@apache.org
channel stopped

Mime
View raw message