maven-notifications mailing list archives

Site index · List index
Message view « Date » · « Thread »
Top « Date » · « Thread »
From Apache Jenkins Server <jenk...@builds.apache.org>
Subject Build failed in Jenkins: maven-plugins-ITs-m2 #1269
Date Sat, 09 Nov 2013 21:20:18 GMT
See <https://builds.apache.org/job/maven-plugins-ITs-m2/1269/changes>

Changes:

[Robert Scholte] [MEAR-149] skinnyWars and SNAPSHOT unique dependencies

[Robert Scholte] [MDEPLOY-172] Concurrency problem with deployAtEnd in parallel builds
Patch contributed by Hermann Josef Hill, verified and adjusted by Robert Scholte

[Robert Scholte] [MINSTALL-103] Concurrency problem with installAtEnd in parallel builds
Patch contributed by Hermann Josef Hill, verified by Robert Scholte

------------------------------------------
[...truncated 9304 lines...]
-------------------------------------------------------
 T E S T S
-------------------------------------------------------
Running org.apache.maven.plugin.verifier.VerifierMojoTest
[debug] Verifying existence of c:/some/path/src/test/resources/Dummy.xml
[debug] Verifying existence of /x1/jenkins/jenkins-slave/workspace/maven-plugins-ITs-m2/maven-verifier-plugin/target/test-classes/File
Exists.xml
[debug] Verifying absence of c:/some/path/src/test/resources/Dummy.xml
[debug] Verifying absence of /x1/jenkins/jenkins-slave/workspace/maven-plugins-ITs-m2/maven-verifier-plugin/target/test-classes/InexistentFileThatExists.xml
[debug] Verifying existence of /x1/jenkins/jenkins-slave/workspace/maven-plugins-ITs-m2/maven-verifier-plugin/target/test-classes/FileExistsValidContent.xml
[debug] Verifying contents of /x1/jenkins/jenkins-slave/workspace/maven-plugins-ITs-m2/maven-verifier-plugin/target/test-classes/FileExistsValidContent.xml
[debug] Verifying existence of /x1/jenkins/jenkins-slave/workspace/maven-plugins-ITs-m2/maven-verifier-plugin/target/test-classes/FileExistsValidContent.xml
[debug] Verifying contents of /x1/jenkins/jenkins-slave/workspace/maven-plugins-ITs-m2/maven-verifier-plugin/target/test-classes/FileExistsValidContent.xml
Tests run: 8, Failures: 0, Errors: 0, Skipped: 0, Time elapsed: 0.077 sec

Results :

Tests run: 8, Failures: 0, Errors: 0, Skipped: 0

[INFO] [jar:jar {execution: default-jar}]
[INFO] Building jar: /x1/jenkins/jenkins-slave/workspace/maven-plugins-ITs-m2/maven-verifier-plugin/target/maven-verifier-plugin-1.1-SNAPSHOT.jar
[INFO] [plugin:addPluginArtifactMetadata {execution: default-addPluginArtifactMetadata}]
[INFO] [invoker:install {execution: integration-test}]
[INFO] Installing /x1/jenkins/jenkins-slave/workspace/maven-plugins-ITs-m2/maven-verifier-plugin/pom.xml
to /x1/jenkins/jenkins-slave/workspace/maven-plugins-ITs-m2/maven-verifier-plugin/target/local-repo/org/apache/maven/plugins/maven-verifier-plugin/1.1-SNAPSHOT/maven-verifier-plugin-1.1-SNAPSHOT.pom
[INFO] Installing /x1/jenkins/jenkins-slave/workspace/maven-plugins-ITs-m2/maven-verifier-plugin/target/maven-verifier-plugin-1.1-SNAPSHOT.jar
to /x1/jenkins/jenkins-slave/workspace/maven-plugins-ITs-m2/maven-verifier-plugin/target/local-repo/org/apache/maven/plugins/maven-verifier-plugin/1.1-SNAPSHOT/maven-verifier-plugin-1.1-SNAPSHOT.jar
[INFO] [invoker:run {execution: integration-test}]
[INFO] Building: simple/pom.xml
[INFO] ..SUCCESS (2.3 s)
[INFO] Building: default/pom.xml
[INFO] ..SUCCESS (1.9 s)
[INFO] ---------------------------------------
[INFO] Execution Summary:
[INFO]   Builds Passing: 2
[INFO]   Builds Failing: 0
[INFO]   Builds Skipped: 0
[INFO] ---------------------------------------
[INFO] [invoker:integration-test {execution: integration-test}]
[INFO] Building: simple/pom.xml
[INFO] ..SUCCESS (1.8 s)
[INFO] Building: default/pom.xml
[INFO] ..SUCCESS (1.8 s)
[INFO] [invoker:verify {execution: integration-test}]
[INFO] ---------------------------------------
[INFO] Execution Summary:
[INFO]   Builds Passing: 2
[INFO]   Builds Failing: 0
[INFO]   Builds Skipped: 0
[INFO] ---------------------------------------
[INFO] [install:install {execution: default-install}]
[INFO] Installing /x1/jenkins/jenkins-slave/workspace/maven-plugins-ITs-m2/maven-verifier-plugin/target/maven-verifier-plugin-1.1-SNAPSHOT.jar
to /home/jenkins/.m2/repository/org/apache/maven/plugins/maven-verifier-plugin/1.1-SNAPSHOT/maven-verifier-plugin-1.1-SNAPSHOT.jar
[INFO] ------------------------------------------------------------------------
[INFO] SKIPPING Apache Maven WAR Plugin
[INFO]    task-segment: [clean, install]
[INFO] This project has been banned from further executions due to previous failures.
[INFO] ------------------------------------------------------------------------
[INFO] ------------------------------------------------------------------------
[INFO] Building Apache Maven GPG Plugin
[INFO]    task-segment: [clean, install]
[INFO] ------------------------------------------------------------------------
[INFO] [clean:clean {execution: default-clean}]
[INFO] Deleting /x1/jenkins/jenkins-slave/workspace/maven-plugins-ITs-m2/maven-gpg-plugin/target
[INFO] [enforcer:enforce {execution: ensure-no-container-api}]
[INFO] [plugin:helpmojo {execution: generated-helpmojo}]
[INFO] Using 'UTF-8' encoding to read mojo metadata.
[INFO] Applying mojo extractor for language: java-annotations
[INFO] Mojo extractor for language: java-annotations found 0 mojo descriptors.
[INFO] Applying mojo extractor for language: java
[INFO] Mojo extractor for language: java found 0 mojo descriptors.
[INFO] Applying mojo extractor for language: bsh
[INFO] Mojo extractor for language: bsh found 0 mojo descriptors.
[INFO] [plugin:descriptor {execution: default-descriptor}]
[INFO] Using 'UTF-8' encoding to read mojo metadata.
[INFO] Applying mojo extractor for language: java-annotations
[INFO] Mojo extractor for language: java-annotations found 0 mojo descriptors.
[INFO] Applying mojo extractor for language: java
[INFO] Mojo extractor for language: java found 0 mojo descriptors.
[INFO] Applying mojo extractor for language: bsh
[INFO] Mojo extractor for language: bsh found 0 mojo descriptors.
[INFO] [remote-resources:process {execution: default}]
[INFO] [resources:resources {execution: default-resources}]
[INFO] Using 'UTF-8' encoding to copy filtered resources.
[INFO] skip non existing resourceDirectory /x1/jenkins/jenkins-slave/workspace/maven-plugins-ITs-m2/maven-gpg-plugin/src/main/resources
[INFO] Copying 3 resources
[INFO] [compiler:compile {execution: default-compile}]
[INFO] Changes detected - recompiling the module!
[INFO] Compiling 9 source files to /x1/jenkins/jenkins-slave/workspace/maven-plugins-ITs-m2/maven-gpg-plugin/target/classes
[WARNING] Note: Some input files use unchecked or unsafe operations.
[WARNING] Note: Recompile with -Xlint:unchecked for details.
[INFO] [plugin:descriptor {execution: generate-descriptor}]
[INFO] Using 'UTF-8' encoding to read mojo metadata.
[INFO] Applying mojo extractor for language: java-annotations
[INFO] Mojo extractor for language: java-annotations found 3 mojo descriptors.
[INFO] Applying mojo extractor for language: java
[INFO] Mojo extractor for language: java found 0 mojo descriptors.
[INFO] Applying mojo extractor for language: bsh
[INFO] Mojo extractor for language: bsh found 0 mojo descriptors.
[INFO] [resources:testResources {execution: default-testResources}]
[INFO] Using 'UTF-8' encoding to copy filtered resources.
[INFO] Copying 8 resources
[INFO] Copying 3 resources
[INFO] [compiler:testCompile {execution: default-testCompile}]
[INFO] No sources to compile
[INFO] [surefire:test {execution: default-test}]
[INFO] [jar:jar {execution: default-jar}]
[INFO] Building jar: /x1/jenkins/jenkins-slave/workspace/maven-plugins-ITs-m2/maven-gpg-plugin/target/maven-gpg-plugin-1.5-SNAPSHOT.jar
[INFO] [plugin:addPluginArtifactMetadata {execution: default-addPluginArtifactMetadata}]
[INFO] [invoker:install {execution: integration-test}]
[INFO] Installing /x1/jenkins/jenkins-slave/workspace/maven-plugins-ITs-m2/maven-gpg-plugin/pom.xml
to /x1/jenkins/jenkins-slave/workspace/maven-plugins-ITs-m2/maven-gpg-plugin/target/local-repo/org/apache/maven/plugins/maven-gpg-plugin/1.5-SNAPSHOT/maven-gpg-plugin-1.5-SNAPSHOT.pom
[INFO] Installing /x1/jenkins/jenkins-slave/workspace/maven-plugins-ITs-m2/maven-gpg-plugin/target/maven-gpg-plugin-1.5-SNAPSHOT.jar
to /x1/jenkins/jenkins-slave/workspace/maven-plugins-ITs-m2/maven-gpg-plugin/target/local-repo/org/apache/maven/plugins/maven-gpg-plugin/1.5-SNAPSHOT/maven-gpg-plugin-1.5-SNAPSHOT.jar
[INFO] [invoker:integration-test {execution: integration-test}]
[INFO] Building: alternative-secret-keyring/pom.xml
[INFO] run script verify.bsh
[INFO] ..SUCCESS (2.0 s)
[INFO] Building: no-main-artifact/pom.xml
[INFO] run script verify.bsh
[INFO] ..SUCCESS (1.9 s)
[INFO] Building: sign-release/pom.xml
[INFO] run script verify.bsh
[INFO] ..SUCCESS (1.9 s)
[INFO] [invoker:verify {execution: integration-test}]
[INFO] -------------------------------------------------
[INFO] Build Summary:
[INFO]   Passed: 3, Failed: 0, Errors: 0, Skipped: 0
[INFO] -------------------------------------------------
[INFO] [install:install {execution: default-install}]
[INFO] Installing /x1/jenkins/jenkins-slave/workspace/maven-plugins-ITs-m2/maven-gpg-plugin/target/maven-gpg-plugin-1.5-SNAPSHOT.jar
to /home/jenkins/.m2/repository/org/apache/maven/plugins/maven-gpg-plugin/1.5-SNAPSHOT/maven-gpg-plugin-1.5-SNAPSHOT.jar
[INFO] ------------------------------------------------------------------------
[INFO] Building Apache Maven Plugins Aggregator
[INFO]    task-segment: [clean, install]
[INFO] ------------------------------------------------------------------------
[INFO] [clean:clean {execution: default-clean}]
[INFO] Deleting /x1/jenkins/jenkins-slave/workspace/maven-plugins-ITs-m2/target
[INFO] Setting property: classpath.resource.loader.class => 'org.codehaus.plexus.velocity.ContextClassLoaderResourceLoader'.
[INFO] Setting property: velocimacro.messages.on => 'false'.
[INFO] Setting property: resource.loader => 'classpath'.
[INFO] Setting property: resource.manager.logwhenfound => 'false'.
[INFO] [remote-resources:process {execution: default}]
[INFO] [site:attach-descriptor {execution: default-attach-descriptor}]
[INFO] [install:install {execution: default-install}]
[INFO] Installing /x1/jenkins/jenkins-slave/workspace/maven-plugins-ITs-m2/pom.xml to /home/jenkins/.m2/repository/org/apache/maven/plugins/maven-plugins-aggregator/1-SNAPSHOT/maven-plugins-aggregator-1-SNAPSHOT.pom
[INFO] 
[INFO] 
[INFO] ------------------------------------------------------------------------
[INFO] Reactor Summary:
[INFO] ------------------------------------------------------------------------
[INFO] Apache Maven Plugins .................................. SUCCESS [5.163s]
[INFO] Apache Maven SCM Publish Plugin ....................... SUCCESS [1:02.766s]
[INFO] Apache Maven ACR Plugin ............................... SUCCESS [16.699s]
[INFO] Apache Maven Ant Plugin ............................... SUCCESS [56.101s]
[INFO] Apache Maven AntRun Plugin ............................ SUCCESS [39.145s]
[INFO] Apache Maven Eclipse Plugin ........................... SUCCESS [5:54.320s]
[INFO] Apache Maven Assembly Plugin .......................... SUCCESS [8:25.159s]
[INFO] Apache Maven Changelog Plugin ......................... SUCCESS [37.845s]
[INFO] Apache Maven Compiler Plugin .......................... SUCCESS [1:14.075s]
[INFO] Apache Maven Changes Plugin ........................... SUCCESS [1:03.604s]
[INFO] Apache Maven Checkstyle Plugin ........................ SUCCESS [1:35.066s]
[INFO] Apache Maven Clean Plugin ............................. SUCCESS [10.969s]
[INFO] Apache Maven Dependency Plugin ........................ SUCCESS [2:28.735s]
[INFO] Apache Maven Javadoc Plugin ........................... SUCCESS [3:57.284s]
[INFO] Apache Maven Deploy Plugin ............................ SUCCESS [52.238s]
[INFO] Apache Maven DOAP Plugin .............................. SUCCESS [15.616s]
[INFO] Apache Maven Documentation Checker Plugin ............. SUCCESS [4.736s]
[INFO] Apache Maven EAR Plugin ............................... FAILED [4.799s]
[INFO] Apache Maven EJB Plugin ............................... SUCCESS [19.006s]
[INFO] Apache Maven Help Plugin .............................. FAILED [2.564s]
[INFO] Apache Maven Install Plugin ........................... SUCCESS [40.508s]
[INFO] Apache Maven JAR Plugin ............................... FAILED [2.349s]
[INFO] Apache Maven Jarsigner Plugin ......................... SUCCESS [18.773s]
[INFO] Apache Maven Linkcheck Plugin ......................... SUCCESS [1.626s]
[INFO] Apache Maven Patch Plugin ............................. SUCCESS [7.573s]
[INFO] Apache Maven PDF Plugin ............................... SUCCESS [29.328s]
[INFO] Apache Maven Site Plugin 3 ............................ FAILED [9.826s]
[INFO] Apache Maven PMD Plugin ............................... SKIPPED (dependency build failed
or was skipped)
[INFO] Apache Maven RAR Plugin ............................... SUCCESS [6.559s]
[INFO] Apache Maven Reactor Plugin ........................... SUCCESS [1.344s]
[INFO] Apache Maven Repository Plugin ........................ SUCCESS [45.783s]
[INFO] Apache Maven Resources Plugin ......................... SKIPPED (dependency build failed
or was skipped)
[INFO] Apache Maven Source Plugin ............................ FAILED [3.291s]
[INFO] Apache Maven Stage Plugin ............................. SUCCESS [1.192s]
[INFO] Apache Maven Toolchains Plugin ........................ SUCCESS [1.004s]
[INFO] Apache Maven Verifier Plugin .......................... SUCCESS [9.520s]
[INFO] Apache Maven WAR Plugin ............................... SKIPPED (dependency build failed
or was skipped)
[INFO] Apache Maven GPG Plugin ............................... SUCCESS [6.614s]
[INFO] Apache Maven Plugins Aggregator ....................... SUCCESS [1.054s]
[INFO] ------------------------------------------------------------------------
[INFO] Error for project: Apache Maven EAR Plugin (during install)
[INFO] ------------------------------------------------------------------------
[INFO] Compilation failure

/x1/jenkins/jenkins-slave/workspace/maven-plugins-ITs-m2/maven-ear-plugin/src/test/java/org/apache/maven/plugin/ear/output/TestAbstractFileNameMapping.java:[23,26]
package org.mockito does not exist
/x1/jenkins/jenkins-slave/workspace/maven-plugins-ITs-m2/maven-ear-plugin/src/test/java/org/apache/maven/plugin/ear/output/TestAbstractFileNameMapping.java:[42,35]
cannot find symbol
symbol  : method mock(java.lang.Class<org.apache.maven.artifact.handler.ArtifactHandler>)
location: class org.apache.maven.plugin.ear.output.TestAbstractFileNameMapping
/x1/jenkins/jenkins-slave/workspace/maven-plugins-ITs-m2/maven-ear-plugin/src/test/java/org/apache/maven/plugin/ear/output/TestAbstractFileNameMapping.java:[43,9]
cannot find symbol
symbol  : method when(java.lang.String)
location: class org.apache.maven.plugin.ear.output.TestAbstractFileNameMapping
/x1/jenkins/jenkins-slave/workspace/maven-plugins-ITs-m2/maven-ear-plugin/src/test/java/org/apache/maven/plugin/ear/output/TestAbstractFileNameMapping.java:[45,29]
cannot find symbol
symbol  : method mock(java.lang.Class<org.apache.maven.artifact.Artifact>)
location: class org.apache.maven.plugin.ear.output.TestAbstractFileNameMapping
/x1/jenkins/jenkins-slave/workspace/maven-plugins-ITs-m2/maven-ear-plugin/src/test/java/org/apache/maven/plugin/ear/output/TestAbstractFileNameMapping.java:[46,9]
cannot find symbol
symbol  : method when(org.apache.maven.artifact.handler.ArtifactHandler)
location: class org.apache.maven.plugin.ear.output.TestAbstractFileNameMapping
/x1/jenkins/jenkins-slave/workspace/maven-plugins-ITs-m2/maven-ear-plugin/src/test/java/org/apache/maven/plugin/ear/output/TestAbstractFileNameMapping.java:[47,9]
cannot find symbol
symbol  : method when(java.lang.String)
location: class org.apache.maven.plugin.ear.output.TestAbstractFileNameMapping
/x1/jenkins/jenkins-slave/workspace/maven-plugins-ITs-m2/maven-ear-plugin/src/test/java/org/apache/maven/plugin/ear/output/TestAbstractFileNameMapping.java:[48,9]
cannot find symbol
symbol  : method when(java.lang.String)
location: class org.apache.maven.plugin.ear.output.TestAbstractFileNameMapping
/x1/jenkins/jenkins-slave/workspace/maven-plugins-ITs-m2/maven-ear-plugin/src/test/java/org/apache/maven/plugin/ear/output/TestAbstractFileNameMapping.java:[49,9]
cannot find symbol
symbol  : method when(java.lang.String)
location: class org.apache.maven.plugin.ear.output.TestAbstractFileNameMapping

[INFO] ------------------------------------------------------------------------
[INFO] Error for project: Apache Maven Help Plugin (during install)
[INFO] ------------------------------------------------------------------------
[INFO] Failed to install project dependencies: MavenProject: org.apache.maven.plugins:maven-help-plugin:2.2.1-SNAPSHOT
@ /x1/jenkins/jenkins-slave/workspace/maven-plugins-ITs-m2/maven-help-plugin/pom.xml

Embedded error: Failed to install project artifacts: MavenProject: org.apache.maven.plugins:maven-ear-plugin:2.9-SNAPSHOT
@ /x1/jenkins/jenkins-slave/workspace/maven-plugins-ITs-m2/maven-ear-plugin/pom.xml
Artifact is not fully assembled: /x1/jenkins/jenkins-slave/workspace/maven-plugins-ITs-m2/maven-ear-plugin/target/classes
[INFO] ------------------------------------------------------------------------
[INFO] Error for project: Apache Maven JAR Plugin (during install)
[INFO] ------------------------------------------------------------------------
[INFO] Failed to install project dependencies: MavenProject: org.apache.maven.plugins:maven-jar-plugin:2.5-SNAPSHOT
@ /x1/jenkins/jenkins-slave/workspace/maven-plugins-ITs-m2/maven-jar-plugin/pom.xml

Embedded error: Failed to install project artifacts: MavenProject: org.apache.maven.plugins:maven-ear-plugin:2.9-SNAPSHOT
@ /x1/jenkins/jenkins-slave/workspace/maven-plugins-ITs-m2/maven-ear-plugin/pom.xml
Artifact is not fully assembled: /x1/jenkins/jenkins-slave/workspace/maven-plugins-ITs-m2/maven-ear-plugin/target/classes
[INFO] ------------------------------------------------------------------------
[INFO] Error for project: Apache Maven Site Plugin 3 (during install)
[INFO] ------------------------------------------------------------------------
[INFO] Failed to install project dependencies: MavenProject: org.apache.maven.plugins:maven-site-plugin:3.4-SNAPSHOT
@ /x1/jenkins/jenkins-slave/workspace/maven-plugins-ITs-m2/maven-site-plugin/dependency-reduced-pom.xml

Embedded error: Failed to install project artifacts: MavenProject: org.apache.maven.plugins:maven-ear-plugin:2.9-SNAPSHOT
@ /x1/jenkins/jenkins-slave/workspace/maven-plugins-ITs-m2/maven-ear-plugin/pom.xml
Artifact is not fully assembled: /x1/jenkins/jenkins-slave/workspace/maven-plugins-ITs-m2/maven-ear-plugin/target/classes
[INFO] ------------------------------------------------------------------------
[INFO] Error for project: Apache Maven Source Plugin (during install)
[INFO] ------------------------------------------------------------------------
[INFO] Failed to install project dependencies: MavenProject: org.apache.maven.plugins:maven-source-plugin:2.3-SNAPSHOT
@ /x1/jenkins/jenkins-slave/workspace/maven-plugins-ITs-m2/maven-source-plugin/pom.xml

Embedded error: Failed to install project artifacts: MavenProject: org.apache.maven.plugins:maven-ear-plugin:2.9-SNAPSHOT
@ /x1/jenkins/jenkins-slave/workspace/maven-plugins-ITs-m2/maven-ear-plugin/pom.xml
Artifact is not fully assembled: /x1/jenkins/jenkins-slave/workspace/maven-plugins-ITs-m2/maven-ear-plugin/target/classes
[INFO] ------------------------------------------------------------------------
[INFO] For more information, run Maven with the -e switch
[INFO] ------------------------------------------------------------------------
[INFO] BUILD ERRORS
[INFO] ------------------------------------------------------------------------
[INFO] Total time: 33 minutes 14 seconds
[INFO] Finished at: Sat Nov 09 21:20:01 UTC 2013
[INFO] Final Memory: 267M/529M
[INFO] ------------------------------------------------------------------------
Build step 'Invoke top-level Maven targets' marked build as failure

Mime
View raw message