maven-notifications mailing list archives

Site index · List index
Message view « Date » · « Thread »
Top « Date » · « Thread »
From Apache Jenkins Server <jenk...@builds.apache.org>
Subject Build failed in Jenkins: dist-tool-plugin #280
Date Sun, 03 Nov 2013 03:34:11 GMT
See <https://builds.apache.org/job/dist-tool-plugin/280/changes>

Changes:

[hboutemy] fail in case of wrong version in index page (but stay tolerant with date)

[hboutemy] improved hack for poms index page

[hboutemy] removed "IPn" syntax from config file: index page url written once in group definition
is more expressive

[hboutemy] new syntax for parent-pom artifactId, to define this special artifact in another
place

[hboutemy] added resources artifacts, both released version in old groupId and in target groupId
for future release

[hboutemy] maven-doxia-tools replaced by doxia-integration-tools

[hboutemy] renamed mavendb.txt to dist-tool.conf

[hboutemy] o improved message when range restriction defined
o changed level from info to debug this restriction message

[hboutemy] removed unused import

[hboutemy] cache data read from distribution area to avoid reading it multiple times (a lot)

[hboutemy] improved mavendb.txt format to better show that every group is a directory from
distribution area

[hboutemy] replaced hardcoded distribution area url with info from mavendb.txt

[hboutemy] removed old code commented out

[hboutemy] improve mavendb.txt readability: support empty lines

[hboutemy] replaced "three spaces" convention with asterisk

[hboutemy] improved explanations

[hboutemy] no need to force (nor restrict) maven-release-plugin version since the probem with
release parrent pom version 3, 4 and 5 don't apply here

[hboutemy] formatting

[hboutemy] code improvement: introduced IndexPage class to replace Object[]

[Robert Scholte] verify both Maven 3.0.x and Maven 3.1.x+

[Robert Scholte] update db with restrictions

[Robert Scholte] Improve message

[Robert Scholte] Support ranges

[Robert Scholte] metadata is set, not added

------------------------------------------
[...truncated 2933 lines...]
Downloading: http://repo.maven.apache.org/maven2/org/apache/maven/apache-maven/2.0.11/apache-maven-2.0.11.pom
Downloaded: http://repo.maven.apache.org/maven2/org/apache/maven/apache-maven/2.0.11/apache-maven-2.0.11.pom
(7 KB at 821.0 KB/sec)
Downloading: http://repo.maven.apache.org/maven2/org/apache/maven/maven/2.0.11/maven-2.0.11.pom
Downloaded: http://repo.maven.apache.org/maven2/org/apache/maven/maven/2.0.11/maven-2.0.11.pom
(22 KB at 2132.4 KB/sec)
Downloading: http://repo.maven.apache.org/maven2/org/apache/maven/maven-parent/12/maven-parent-12.pom
Downloaded: http://repo.maven.apache.org/maven2/org/apache/maven/maven-parent/12/maven-parent-12.pom
(22 KB at 2123.1 KB/sec)
[WARNING] HTTP result code: 404 for apache-maven site = http://maven.apache.org/apache-maven
Downloading: http://repo.maven.apache.org/maven2/org/apache/maven/apache-maven/2.2.1/apache-maven-2.2.1.pom
Downloaded: http://repo.maven.apache.org/maven2/org/apache/maven/apache-maven/2.2.1/apache-maven-2.2.1.pom
(8 KB at 858.1 KB/sec)
[WARNING] HTTP result code: 404 for apache-maven site = http://maven.apache.org/apache-maven
Downloading: http://repo.maven.apache.org/maven2/org/apache/maven/apache-maven/3.0.5/apache-maven-3.0.5.pom
Downloaded: http://repo.maven.apache.org/maven2/org/apache/maven/apache-maven/3.0.5/apache-maven-3.0.5.pom
(6 KB at 532.0 KB/sec)
Downloading: http://repo.maven.apache.org/maven2/org/apache/maven/maven/3.0.5/maven-3.0.5.pom
Downloaded: http://repo.maven.apache.org/maven2/org/apache/maven/maven/3.0.5/maven-3.0.5.pom
(22 KB at 2431.7 KB/sec)
Downloading: http://repo.maven.apache.org/maven2/org/apache/maven/apache-maven/3.1.1/apache-maven-3.1.1.pom
Downloaded: http://repo.maven.apache.org/maven2/org/apache/maven/apache-maven/3.1.1/apache-maven-3.1.1.pom
(7 KB at 737.4 KB/sec)
Downloading: http://repo.maven.apache.org/maven2/org/apache/maven/maven/3.1.1/maven-3.1.1.pom
Downloaded: http://repo.maven.apache.org/maven2/org/apache/maven/maven/3.1.1/maven-3.1.1.pom
(22 KB at 1961.6 KB/sec)
Downloading: http://repo.maven.apache.org/maven2/org/apache/maven/plugin-testing/maven-plugin-testing/2.1/maven-plugin-testing-2.1.pom
Downloaded: http://repo.maven.apache.org/maven2/org/apache/maven/plugin-testing/maven-plugin-testing/2.1/maven-plugin-testing-2.1.pom
(10 KB at 891.9 KB/sec)
Downloading: http://repo.maven.apache.org/maven2/org/apache/maven/plugins/maven-acr-plugin/1.0/maven-acr-plugin-1.0.pom
Downloaded: http://repo.maven.apache.org/maven2/org/apache/maven/plugins/maven-acr-plugin/1.0/maven-acr-plugin-1.0.pom
(6 KB at 511.1 KB/sec)
Downloading: http://repo.maven.apache.org/maven2/org/apache/maven/plugins/maven-ant-plugin/2.3/maven-ant-plugin-2.3.pom
Downloaded: http://repo.maven.apache.org/maven2/org/apache/maven/plugins/maven-ant-plugin/2.3/maven-ant-plugin-2.3.pom
(6 KB at 30.0 KB/sec)
Downloading: http://repo.maven.apache.org/maven2/org/apache/maven/plugins/maven-plugins/16/maven-plugins-16.pom
Downloaded: http://repo.maven.apache.org/maven2/org/apache/maven/plugins/maven-plugins/16/maven-plugins-16.pom
(13 KB at 1149.6 KB/sec)
Downloading: http://repo.maven.apache.org/maven2/org/apache/maven/plugins/maven-antrun-plugin/1.7/maven-antrun-plugin-1.7.pom
Downloaded: http://repo.maven.apache.org/maven2/org/apache/maven/plugins/maven-antrun-plugin/1.7/maven-antrun-plugin-1.7.pom
(5 KB at 447.5 KB/sec)
Downloading: http://repo.maven.apache.org/maven2/org/apache/maven/plugins/maven-assembly-plugin/2.4/maven-assembly-plugin-2.4.pom
Downloaded: http://repo.maven.apache.org/maven2/org/apache/maven/plugins/maven-assembly-plugin/2.4/maven-assembly-plugin-2.4.pom
(17 KB at 1827.5 KB/sec)
Downloading: http://repo.maven.apache.org/maven2/org/apache/maven/plugins/maven-changelog-plugin/2.2/maven-changelog-plugin-2.2.pom
Downloaded: http://repo.maven.apache.org/maven2/org/apache/maven/plugins/maven-changelog-plugin/2.2/maven-changelog-plugin-2.2.pom
(13 KB at 246.3 KB/sec)
Downloading: http://repo.maven.apache.org/maven2/org/apache/maven/plugins/maven-changes-plugin/2.9/maven-changes-plugin-2.9.pom
Downloaded: http://repo.maven.apache.org/maven2/org/apache/maven/plugins/maven-changes-plugin/2.9/maven-changes-plugin-2.9.pom
(19 KB at 1840.5 KB/sec)
Downloading: http://repo.maven.apache.org/maven2/org/apache/maven/plugins/maven-dependency-plugin/2.8/maven-dependency-plugin-2.8.pom
Downloaded: http://repo.maven.apache.org/maven2/org/apache/maven/plugins/maven-dependency-plugin/2.8/maven-dependency-plugin-2.8.pom
(12 KB at 1398.2 KB/sec)
Downloading: http://repo.maven.apache.org/maven2/org/apache/maven/plugins/maven-deploy-plugin/2.8.1/maven-deploy-plugin-2.8.1.pom
Downloaded: http://repo.maven.apache.org/maven2/org/apache/maven/plugins/maven-deploy-plugin/2.8.1/maven-deploy-plugin-2.8.1.pom
(8 KB at 862.3 KB/sec)
Downloading: http://repo.maven.apache.org/maven2/org/apache/maven/plugins/maven-doap-plugin/1.1/maven-doap-plugin-1.1.pom
Downloaded: http://repo.maven.apache.org/maven2/org/apache/maven/plugins/maven-doap-plugin/1.1/maven-doap-plugin-1.1.pom
(9 KB at 809.3 KB/sec)
Downloading: http://repo.maven.apache.org/maven2/org/apache/maven/plugins/maven-ear-plugin/2.8/maven-ear-plugin-2.8.pom
Downloaded: http://repo.maven.apache.org/maven2/org/apache/maven/plugins/maven-ear-plugin/2.8/maven-ear-plugin-2.8.pom
(9 KB at 100.2 KB/sec)
Downloading: http://repo.maven.apache.org/maven2/org/apache/maven/plugins/maven-eclipse-plugin/2.9/maven-eclipse-plugin-2.9.pom
Downloaded: http://repo.maven.apache.org/maven2/org/apache/maven/plugins/maven-eclipse-plugin/2.9/maven-eclipse-plugin-2.9.pom
(15 KB at 1637.7 KB/sec)
Downloading: http://repo.maven.apache.org/maven2/org/apache/maven/plugins/maven-ejb-plugin/2.3/maven-ejb-plugin-2.3.pom
Downloaded: http://repo.maven.apache.org/maven2/org/apache/maven/plugins/maven-ejb-plugin/2.3/maven-ejb-plugin-2.3.pom
(6 KB at 571.7 KB/sec)
Downloading: http://repo.maven.apache.org/maven2/org/apache/maven/plugins/maven-help-plugin/2.2/maven-help-plugin-2.2.pom
Downloaded: http://repo.maven.apache.org/maven2/org/apache/maven/plugins/maven-help-plugin/2.2/maven-help-plugin-2.2.pom
(9 KB at 946.3 KB/sec)
Downloading: http://repo.maven.apache.org/maven2/org/apache/maven/plugins/maven-idea-plugin/2.2.1/maven-idea-plugin-2.2.1.pom
Downloaded: http://repo.maven.apache.org/maven2/org/apache/maven/plugins/maven-idea-plugin/2.2.1/maven-idea-plugin-2.2.1.pom
(7 KB at 47.1 KB/sec)
Downloading: http://repo.maven.apache.org/maven2/org/apache/maven/plugins/maven-install-plugin/2.5.1/maven-install-plugin-2.5.1.pom
Downloaded: http://repo.maven.apache.org/maven2/org/apache/maven/plugins/maven-install-plugin/2.5.1/maven-install-plugin-2.5.1.pom
(8 KB at 790.5 KB/sec)
Downloading: http://repo.maven.apache.org/maven2/org/apache/maven/plugins/maven-invoker-plugin/1.8/maven-invoker-plugin-1.8.pom
Downloaded: http://repo.maven.apache.org/maven2/org/apache/maven/plugins/maven-invoker-plugin/1.8/maven-invoker-plugin-1.8.pom
(13 KB at 191.8 KB/sec)
Downloading: http://repo.maven.apache.org/maven2/org/apache/maven/plugins/maven-jarsigner-plugin/1.2/maven-jarsigner-plugin-1.2.pom
Downloaded: http://repo.maven.apache.org/maven2/org/apache/maven/plugins/maven-jarsigner-plugin/1.2/maven-jarsigner-plugin-1.2.pom
(6 KB at 527.8 KB/sec)
Downloading: http://repo.maven.apache.org/maven2/org/apache/maven/plugins/maven-plugins/14/maven-plugins-14.pom
Downloaded: http://repo.maven.apache.org/maven2/org/apache/maven/plugins/maven-plugins/14/maven-plugins-14.pom
(13 KB at 1360.4 KB/sec)
Downloading: http://repo.maven.apache.org/maven2/org/apache/maven/plugins/maven-javadoc-plugin/2.9.1/maven-javadoc-plugin-2.9.1.pom
Downloaded: http://repo.maven.apache.org/maven2/org/apache/maven/plugins/maven-javadoc-plugin/2.9.1/maven-javadoc-plugin-2.9.1.pom
(16 KB at 1525.3 KB/sec)
Downloading: http://repo.maven.apache.org/maven2/org/apache/maven/plugins/maven-linkcheck-plugin/1.1/maven-linkcheck-plugin-1.1.pom
Downloaded: http://repo.maven.apache.org/maven2/org/apache/maven/plugins/maven-linkcheck-plugin/1.1/maven-linkcheck-plugin-1.1.pom
(7 KB at 680.5 KB/sec)
Downloading: http://repo.maven.apache.org/maven2/org/apache/maven/plugins/maven-one-plugin/1.3/maven-one-plugin-1.3.pom
Downloaded: http://repo.maven.apache.org/maven2/org/apache/maven/plugins/maven-one-plugin/1.3/maven-one-plugin-1.3.pom
(6 KB at 63.8 KB/sec)
Downloading: http://repo.maven.apache.org/maven2/org/apache/maven/plugins/maven-patch-plugin/1.1.1/maven-patch-plugin-1.1.1.pom
Downloaded: http://repo.maven.apache.org/maven2/org/apache/maven/plugins/maven-patch-plugin/1.1.1/maven-patch-plugin-1.1.1.pom
(4 KB at 384.5 KB/sec)
Downloading: http://repo.maven.apache.org/maven2/org/apache/maven/plugins/maven-pdf-plugin/1.2/maven-pdf-plugin-1.2.pom
Downloaded: http://repo.maven.apache.org/maven2/org/apache/maven/plugins/maven-pdf-plugin/1.2/maven-pdf-plugin-1.2.pom
(17 KB at 1683.0 KB/sec)
Downloading: http://repo.maven.apache.org/maven2/org/apache/maven/plugins/maven-rar-plugin/2.3/maven-rar-plugin-2.3.pom
Downloaded: http://repo.maven.apache.org/maven2/org/apache/maven/plugins/maven-rar-plugin/2.3/maven-rar-plugin-2.3.pom
(6 KB at 655.6 KB/sec)
Downloading: http://repo.maven.apache.org/maven2/org/apache/maven/plugins/maven-reactor-plugin/1.0/maven-reactor-plugin-1.0.pom
Downloaded: http://repo.maven.apache.org/maven2/org/apache/maven/plugins/maven-reactor-plugin/1.0/maven-reactor-plugin-1.0.pom
(4 KB at 40.4 KB/sec)
Downloading: http://repo.maven.apache.org/maven2/org/apache/maven/plugins/maven-remote-resources-plugin/1.5/maven-remote-resources-plugin-1.5.pom
Downloaded: http://repo.maven.apache.org/maven2/org/apache/maven/plugins/maven-remote-resources-plugin/1.5/maven-remote-resources-plugin-1.5.pom
(14 KB at 1185.5 KB/sec)
Downloading: http://repo.maven.apache.org/maven2/org/apache/maven/plugins/maven-repository-plugin/2.3.1/maven-repository-plugin-2.3.1.pom
Downloaded: http://repo.maven.apache.org/maven2/org/apache/maven/plugins/maven-repository-plugin/2.3.1/maven-repository-plugin-2.3.1.pom
(9 KB at 797.4 KB/sec)
Downloading: http://repo.maven.apache.org/maven2/org/apache/maven/plugins/maven-shade-plugin/2.1/maven-shade-plugin-2.1.pom
Downloaded: http://repo.maven.apache.org/maven2/org/apache/maven/plugins/maven-shade-plugin/2.1/maven-shade-plugin-2.1.pom
(8 KB at 817.1 KB/sec)
Downloading: http://repo.maven.apache.org/maven2/org/apache/maven/plugins/maven-stage-plugin/1.0-alpha-2/maven-stage-plugin-1.0-alpha-2.pom
Downloaded: http://repo.maven.apache.org/maven2/org/apache/maven/plugins/maven-stage-plugin/1.0-alpha-2/maven-stage-plugin-1.0-alpha-2.pom
(8 KB at 661.1 KB/sec)
Downloading: http://repo.maven.apache.org/maven2/org/apache/maven/plugins/maven-plugins/13/maven-plugins-13.pom
Downloaded: http://repo.maven.apache.org/maven2/org/apache/maven/plugins/maven-plugins/13/maven-plugins-13.pom
(12 KB at 1278.8 KB/sec)
Downloading: http://repo.maven.apache.org/maven2/org/apache/maven/plugins/maven-toolchains-plugin/1.0/maven-toolchains-plugin-1.0.pom
Downloaded: http://repo.maven.apache.org/maven2/org/apache/maven/plugins/maven-toolchains-plugin/1.0/maven-toolchains-plugin-1.0.pom
(4 KB at 42.6 KB/sec)
Downloading: http://repo.maven.apache.org/maven2/org/apache/maven/plugins/maven-verifier-plugin/1.0/maven-verifier-plugin-1.0.pom
Downloaded: http://repo.maven.apache.org/maven2/org/apache/maven/plugins/maven-verifier-plugin/1.0/maven-verifier-plugin-1.0.pom
(5 KB at 446.8 KB/sec)
Downloading: http://repo.maven.apache.org/maven2/org/apache/maven/plugins/maven-war-plugin/2.4/maven-war-plugin-2.4.pom
Downloaded: http://repo.maven.apache.org/maven2/org/apache/maven/plugins/maven-war-plugin/2.4/maven-war-plugin-2.4.pom
(10 KB at 1001.1 KB/sec)
Downloading: http://repo.maven.apache.org/maven2/org/apache/maven/release/maven-release/2.4.2/maven-release-2.4.2.pom
Downloaded: http://repo.maven.apache.org/maven2/org/apache/maven/release/maven-release/2.4.2/maven-release-2.4.2.pom
(5 KB at 468.8 KB/sec)
Downloading: http://repo.maven.apache.org/maven2/org/apache/apache/resources/apache-resource-bundles/4/apache-resource-bundles-4.pom
Downloaded: http://repo.maven.apache.org/maven2/org/apache/apache/resources/apache-resource-bundles/4/apache-resource-bundles-4.pom
(3 KB at 264.6 KB/sec)
Downloading: http://repo.maven.apache.org/maven2/org/apache/apache/resources/apache-source-release-assembly-descriptor/1.0.4/apache-source-release-assembly-descriptor-1.0.4.pom
Downloaded: http://repo.maven.apache.org/maven2/org/apache/apache/resources/apache-source-release-assembly-descriptor/1.0.4/apache-source-release-assembly-descriptor-1.0.4.pom
(8 KB at 661.7 KB/sec)
Downloading: http://repo.maven.apache.org/maven2/org/apache/apache-incubator-disclaimer-resource-bundle/1.1/apache-incubator-disclaimer-resource-bundle-1.1.pom
[WARNING] Checksum validation failed, expected da39a3ee5e6b4b0d3255bfef95601890afd80709 but
is 6e0b74ff3d2da9bfe1126608f7e937537e628a5f for http://repo.maven.apache.org/maven2/org/apache/apache-incubator-disclaimer-resource-bundle/1.1/apache-incubator-disclaimer-resource-bundle-1.1.pom
[WARNING] Checksum validation failed, expected da39a3ee5e6b4b0d3255bfef95601890afd80709 but
is 6e0b74ff3d2da9bfe1126608f7e937537e628a5f for http://repo.maven.apache.org/maven2/org/apache/apache-incubator-disclaimer-resource-bundle/1.1/apache-incubator-disclaimer-resource-bundle-1.1.pom
Downloaded: http://repo.maven.apache.org/maven2/org/apache/apache-incubator-disclaimer-resource-bundle/1.1/apache-incubator-disclaimer-resource-bundle-1.1.pom
(722 B at 4.2 KB/sec)
Downloading: http://repo.maven.apache.org/maven2/org/apache/apache-resource-bundles/2/apache-resource-bundles-2.pom
[WARNING] Checksum validation failed, expected da39a3ee5e6b4b0d3255bfef95601890afd80709 but
is bfadc7db5b215805d531144732c80692de9780e1 for http://repo.maven.apache.org/maven2/org/apache/apache-resource-bundles/2/apache-resource-bundles-2.pom
[WARNING] Checksum validation failed, expected da39a3ee5e6b4b0d3255bfef95601890afd80709 but
is bfadc7db5b215805d531144732c80692de9780e1 for http://repo.maven.apache.org/maven2/org/apache/apache-resource-bundles/2/apache-resource-bundles-2.pom
Downloaded: http://repo.maven.apache.org/maven2/org/apache/apache-resource-bundles/2/apache-resource-bundles-2.pom
(2 KB at 11.5 KB/sec)
[WARNING] HTTP result code: 404 for apache-incubator-disclaimer-resource-bundle site = http://maven.apache.org/apache-resource-bundles/apache-incubator-disclaimer-resource-bundle/
Downloading: http://repo.maven.apache.org/maven2/org/apache/apache-jar-resource-bundle/1.4/apache-jar-resource-bundle-1.4.pom
Downloaded: http://repo.maven.apache.org/maven2/org/apache/apache-jar-resource-bundle/1.4/apache-jar-resource-bundle-1.4.pom
(2 KB at 13.1 KB/sec)
Downloading: http://repo.maven.apache.org/maven2/org/apache/apache-license-header-resource-bundle/1.1/apache-license-header-resource-bundle-1.1.pom
[WARNING] Checksum validation failed, expected da39a3ee5e6b4b0d3255bfef95601890afd80709 but
is 923c05b225d7a5a8a614b5fca846b1776e18b98a for http://repo.maven.apache.org/maven2/org/apache/apache-license-header-resource-bundle/1.1/apache-license-header-resource-bundle-1.1.pom
[WARNING] Checksum validation failed, expected da39a3ee5e6b4b0d3255bfef95601890afd80709 but
is 923c05b225d7a5a8a614b5fca846b1776e18b98a for http://repo.maven.apache.org/maven2/org/apache/apache-license-header-resource-bundle/1.1/apache-license-header-resource-bundle-1.1.pom
Downloaded: http://repo.maven.apache.org/maven2/org/apache/apache-license-header-resource-bundle/1.1/apache-license-header-resource-bundle-1.1.pom
(694 B at 4.1 KB/sec)
Downloading: http://repo.maven.apache.org/maven2/org/apache/maven/scm/maven-scm/1.8.1/maven-scm-1.8.1.pom
Downloaded: http://repo.maven.apache.org/maven2/org/apache/maven/scm/maven-scm/1.8.1/maven-scm-1.8.1.pom
(22 KB at 2122.0 KB/sec)
[WARNING] HTTP result code: 404 for file-management site = http://maven.apache.org/shared/file-management/
Downloading: http://repo.maven.apache.org/maven2/org/apache/maven/shared/maven-common-artifact-filters/1.4/maven-common-artifact-filters-1.4.pom
Downloaded: http://repo.maven.apache.org/maven2/org/apache/maven/shared/maven-common-artifact-filters/1.4/maven-common-artifact-filters-1.4.pom
(4 KB at 367.2 KB/sec)
Downloading: http://repo.maven.apache.org/maven2/org/apache/maven/shared/maven-dependency-analyzer/1.4/maven-dependency-analyzer-1.4.pom
Downloaded: http://repo.maven.apache.org/maven2/org/apache/maven/shared/maven-dependency-analyzer/1.4/maven-dependency-analyzer-1.4.pom
(6 KB at 559.2 KB/sec)
Downloading: http://repo.maven.apache.org/maven2/org/apache/maven/shared/maven-invoker/2.1.1/maven-invoker-2.1.1.pom
Downloaded: http://repo.maven.apache.org/maven2/org/apache/maven/shared/maven-invoker/2.1.1/maven-invoker-2.1.1.pom
(6 KB at 679.3 KB/sec)
Downloading: http://repo.maven.apache.org/maven2/org/apache/maven/shared/maven-jarsigner/1.0/maven-jarsigner-1.0.pom
Downloaded: http://repo.maven.apache.org/maven2/org/apache/maven/shared/maven-jarsigner/1.0/maven-jarsigner-1.0.pom
(4 KB at 342.9 KB/sec)
Downloading: http://repo.maven.apache.org/maven2/org/apache/maven/shared/maven-model-converter/2.3/maven-model-converter-2.3.pom
Downloaded: http://repo.maven.apache.org/maven2/org/apache/maven/shared/maven-model-converter/2.3/maven-model-converter-2.3.pom
(5 KB at 458.0 KB/sec)
Downloading: http://repo.maven.apache.org/maven2/org/apache/maven/shared/maven-repository-builder/1.0-alpha-2/maven-repository-builder-1.0-alpha-2.pom
Downloaded: http://repo.maven.apache.org/maven2/org/apache/maven/shared/maven-repository-builder/1.0-alpha-2/maven-repository-builder-1.0-alpha-2.pom
(4 KB at 315.3 KB/sec)
Downloading: http://repo.maven.apache.org/maven2/org/apache/maven/shared/maven-runtime/1.0-alpha-3/maven-runtime-1.0-alpha-3.pom
Downloaded: http://repo.maven.apache.org/maven2/org/apache/maven/shared/maven-runtime/1.0-alpha-3/maven-runtime-1.0-alpha-3.pom
(6 KB at 562.2 KB/sec)
Downloading: http://repo.maven.apache.org/maven2/org/apache/maven/shared/maven-script-interpreter/1.1/maven-script-interpreter-1.1.pom
Downloaded: http://repo.maven.apache.org/maven2/org/apache/maven/shared/maven-script-interpreter/1.1/maven-script-interpreter-1.1.pom
(4 KB at 453.0 KB/sec)
Downloading: http://repo.maven.apache.org/maven2/org/apache/maven/shared/maven-shared-resources/1/maven-shared-resources-1.pom
Downloaded: http://repo.maven.apache.org/maven2/org/apache/maven/shared/maven-shared-resources/1/maven-shared-resources-1.pom
(3 KB at 217.5 KB/sec)
Downloading: http://repo.maven.apache.org/maven2/org/apache/maven/shared/maven-shared-utils/0.4/maven-shared-utils-0.4.pom
Downloaded: http://repo.maven.apache.org/maven2/org/apache/maven/shared/maven-shared-utils/0.4/maven-shared-utils-0.4.pom
(4 KB at 395.2 KB/sec)
Downloading: http://repo.maven.apache.org/maven2/org/apache/maven/shared/maven-verifier/1.4/maven-verifier-1.4.pom
Downloaded: http://repo.maven.apache.org/maven2/org/apache/maven/shared/maven-verifier/1.4/maven-verifier-1.4.pom
(3 KB at 248.4 KB/sec)
Downloading: http://repo.maven.apache.org/maven2/org/apache/maven/skins/maven-skins/7/maven-skins-7.pom
Downloaded: http://repo.maven.apache.org/maven2/org/apache/maven/skins/maven-skins/7/maven-skins-7.pom
(4 KB at 317.3 KB/sec)
Downloading: http://repo.maven.apache.org/maven2/org/apache/maven/skins/maven-application-skin/1.0/maven-application-skin-1.0.pom
Downloaded: http://repo.maven.apache.org/maven2/org/apache/maven/skins/maven-application-skin/1.0/maven-application-skin-1.0.pom
(5 KB at 466.9 KB/sec)
Downloading: http://repo.maven.apache.org/maven2/org/apache/maven/skins/maven-skins/6/maven-skins-6.pom
Downloaded: http://repo.maven.apache.org/maven2/org/apache/maven/skins/maven-skins/6/maven-skins-6.pom
(4 KB at 352.5 KB/sec)
Downloading: http://repo.maven.apache.org/maven2/org/apache/maven/skins/maven-classic-skin/1.1/maven-classic-skin-1.1.pom
Downloaded: http://repo.maven.apache.org/maven2/org/apache/maven/skins/maven-classic-skin/1.1/maven-classic-skin-1.1.pom
(5 KB at 516.2 KB/sec)
Downloading: http://repo.maven.apache.org/maven2/org/apache/maven/skins/maven-default-skin/1.1/maven-default-skin-1.1.pom
Downloaded: http://repo.maven.apache.org/maven2/org/apache/maven/skins/maven-default-skin/1.1/maven-default-skin-1.1.pom
(5 KB at 580.7 KB/sec)
Downloading: http://repo.maven.apache.org/maven2/org/apache/maven/skins/maven-fluido-skin/1.3.0/maven-fluido-skin-1.3.0.pom
Downloaded: http://repo.maven.apache.org/maven2/org/apache/maven/skins/maven-fluido-skin/1.3.0/maven-fluido-skin-1.3.0.pom
(23 KB at 2552.7 KB/sec)
Downloading: http://repo.maven.apache.org/maven2/org/apache/maven/skins/maven-stylus-skin/1.5/maven-stylus-skin-1.5.pom
Downloaded: http://repo.maven.apache.org/maven2/org/apache/maven/skins/maven-stylus-skin/1.5/maven-stylus-skin-1.5.pom
(6 KB at 610.6 KB/sec)
Downloading: http://repo.maven.apache.org/maven2/org/apache/maven/surefire/surefire/2.16/surefire-2.16.pom
Downloaded: http://repo.maven.apache.org/maven2/org/apache/maven/surefire/surefire/2.16/surefire-2.16.pom
(19 KB at 1860.1 KB/sec)
Downloading: http://repo.maven.apache.org/maven2/org/apache/maven/wagon/wagon/2.5/wagon-2.5.pom
Downloaded: http://repo.maven.apache.org/maven2/org/apache/maven/wagon/wagon/2.5/wagon-2.5.pom
(20 KB at 1957.5 KB/sec)
[INFO] Generating "Dist Tool> Source Release" report    --- dist-tool-plugin:0.0.1-SNAPSHOT
[WARNING] Missing file for doxia-linkcheck in http://repo.maven.apache.org/maven2/org/apache/maven/doxia/doxia-linkcheck/1.2
[WARNING]  > doxia-linkcheck-1.2-source-release.zip <
[WARNING]  > doxia-linkcheck-1.2-source-release.zip.asc <
[WARNING]  > doxia-linkcheck-1.2-source-release.zip.md5 <
[WARNING] Missing file for doxia-linkcheck in http://www.apache.org/dist/maven/doxia
[WARNING]  > doxia-linkcheck-1.2-source-release.zip <
[WARNING]  > doxia-linkcheck-1.2-source-release.zip.asc <
[WARNING]  > doxia-linkcheck-1.2-source-release.zip.md5 <
[WARNING] Missing file for apache-maven in http://repo.maven.apache.org/maven2/org/apache/maven/apache-maven/2.0.11
[WARNING]  > apache-maven-2.0.11-src.zip <
[WARNING]  > apache-maven-2.0.11-src.zip.asc <
[WARNING]  > apache-maven-2.0.11-src.zip.md5 <
[WARNING] Missing file for maven-docck-plugin in http://repo.maven.apache.org/maven2/org/apache/maven/plugins/maven-docck-plugin/1.0
[WARNING]  > maven-docck-plugin-1.0-source-release.zip <
[WARNING]  > maven-docck-plugin-1.0-source-release.zip.asc <
[WARNING]  > maven-docck-plugin-1.0-source-release.zip.md5 <
[WARNING] Missing file for maven-docck-plugin in http://www.apache.org/dist/maven/plugins
[WARNING]  > maven-docck-plugin-1.0-source-release.zip <
[WARNING]  > maven-docck-plugin-1.0-source-release.zip.asc <
[WARNING]  > maven-docck-plugin-1.0-source-release.zip.md5 <
[WARNING] Missing file for maven-reactor-plugin in http://repo.maven.apache.org/maven2/org/apache/maven/plugins/maven-reactor-plugin/1.0
[WARNING]  > maven-reactor-plugin-1.0-source-release.zip <
[WARNING]  > maven-reactor-plugin-1.0-source-release.zip.asc <
[WARNING]  > maven-reactor-plugin-1.0-source-release.zip.md5 <
[WARNING] Missing file for maven-reactor-plugin in http://www.apache.org/dist/maven/plugins
[WARNING]  > maven-reactor-plugin-1.0-source-release.zip <
[WARNING]  > maven-reactor-plugin-1.0-source-release.zip.asc <
[WARNING]  > maven-reactor-plugin-1.0-source-release.zip.md5 <
[WARNING] Missing file for apache-incubator-disclaimer-resource-bundle in http://repo.maven.apache.org/maven2/org/apache/apache-incubator-disclaimer-resource-bundle/1.1
[WARNING]  > apache-incubator-disclaimer-resource-bundle-1.1-source-release.zip <
[WARNING]  > apache-incubator-disclaimer-resource-bundle-1.1-source-release.zip.asc <
[WARNING]  > apache-incubator-disclaimer-resource-bundle-1.1-source-release.zip.md5 <
[WARNING] Missing file for apache-incubator-disclaimer-resource-bundle in http://www.apache.org/dist/maven/resources
[WARNING]  > apache-incubator-disclaimer-resource-bundle-1.1-source-release.zip <
[WARNING]  > apache-incubator-disclaimer-resource-bundle-1.1-source-release.zip.asc <
[WARNING]  > apache-incubator-disclaimer-resource-bundle-1.1-source-release.zip.md5 <
[WARNING] Missing file for apache-jar-resource-bundle in http://repo.maven.apache.org/maven2/org/apache/apache-jar-resource-bundle/1.4
[WARNING]  > apache-jar-resource-bundle-1.4-source-release.zip <
[WARNING]  > apache-jar-resource-bundle-1.4-source-release.zip.asc <
[WARNING]  > apache-jar-resource-bundle-1.4-source-release.zip.md5 <
[WARNING] Missing file for apache-jar-resource-bundle in http://www.apache.org/dist/maven/resources
[WARNING]  > apache-jar-resource-bundle-1.4-source-release.zip <
[WARNING]  > apache-jar-resource-bundle-1.4-source-release.zip.asc <
[WARNING]  > apache-jar-resource-bundle-1.4-source-release.zip.md5 <
[WARNING] Missing file for apache-license-header-resource-bundle in http://repo.maven.apache.org/maven2/org/apache/apache-license-header-resource-bundle/1.1
[WARNING]  > apache-license-header-resource-bundle-1.1-source-release.zip <
[WARNING]  > apache-license-header-resource-bundle-1.1-source-release.zip.asc <
[WARNING]  > apache-license-header-resource-bundle-1.1-source-release.zip.md5 <
[WARNING] Missing file for apache-license-header-resource-bundle in http://www.apache.org/dist/maven/resources
[WARNING]  > apache-license-header-resource-bundle-1.1-source-release.zip <
[WARNING]  > apache-license-header-resource-bundle-1.1-source-release.zip.asc <
[WARNING]  > apache-license-header-resource-bundle-1.1-source-release.zip.md5 <
[WARNING] Missing file for file-management in http://repo.maven.apache.org/maven2/org/apache/maven/shared/file-management/1.2.1
[WARNING]  > file-management-1.2.1-source-release.zip <
[WARNING]  > file-management-1.2.1-source-release.zip.asc <
[WARNING]  > file-management-1.2.1-source-release.zip.md5 <
[WARNING] Missing file for file-management in http://www.apache.org/dist/maven/shared
[WARNING]  > file-management-1.2.1-source-release.zip <
[WARNING]  > file-management-1.2.1-source-release.zip.asc <
[WARNING]  > file-management-1.2.1-source-release.zip.md5 <
[WARNING] Missing file for maven-repository-builder in http://repo.maven.apache.org/maven2/org/apache/maven/shared/maven-repository-builder/1.0-alpha-2
[WARNING]  > maven-repository-builder-1.0-alpha-2-source-release.zip <
[WARNING]  > maven-repository-builder-1.0-alpha-2-source-release.zip.asc <
[WARNING]  > maven-repository-builder-1.0-alpha-2-source-release.zip.md5 <
[WARNING] Missing file for maven-repository-builder in http://www.apache.org/dist/maven/shared
[WARNING]  > maven-repository-builder-1.0-alpha-2-source-release.zip <
[WARNING]  > maven-repository-builder-1.0-alpha-2-source-release.zip.asc <
[WARNING]  > maven-repository-builder-1.0-alpha-2-source-release.zip.md5 <
[INFO] Generating "Dist Tool> Index Pages" report    --- dist-tool-plugin:0.0.1-SNAPSHOT
[ERROR] maven-shared-utils: found 0.3 instead of 0.4 in http://maven.apache.org/shared/
[ERROR] maven-enforcer-plugin: found 1.3 instead of 1.3.1 in http://maven.apache.org/plugins/
[INFO] Generating "Failure Hack" report    --- dist-tool-plugin:0.0.1-SNAPSHOT
[ERROR] check-index-page.log error log not empty:
maven-shared-utils: found 0.3 instead of 0.4 in http://maven.apache.org/shared/
maven-enforcer-plugin: found 1.3 instead of 1.3.1 in http://maven.apache.org/plugins/

[JENKINS] Archiving site from <https://builds.apache.org/job/dist-tool-plugin/ws/target/site>
to /home/hudson/hudson/jobs/dist-tool-plugin/site
[INFO] ------------------------------------------------------------------------
[INFO] BUILD FAILURE
[INFO] ------------------------------------------------------------------------
[INFO] Total time: 11:57.512s
[INFO] Finished at: Sun Nov 03 03:33:14 UTC 2013
[INFO] Final Memory: 60M/453M
Waiting for Jenkins to finish collecting data
[INFO] ------------------------------------------------------------------------
[ERROR] Failed to execute goal org.apache.maven.plugins:maven-site-plugin:3.3:site (default-site)
on project dist-tool-plugin: Error during page generation: Error rendering Maven report: Dist
tools report non empty please check: https://builds.apache.org/job/dist-tool-plugin/site/
-> [Help 1]
[ERROR] 
[ERROR] To see the full stack trace of the errors, re-run Maven with the -e switch.
[ERROR] Re-run Maven using the -X switch to enable full debug logging.
[ERROR] 
[ERROR] For more information about the errors and possible solutions, please read the following
articles:
[ERROR] [Help 1] http://cwiki.apache.org/confluence/display/MAVEN/MojoExecutionException
[JENKINS] Archiving <https://builds.apache.org/job/dist-tool-plugin/ws/pom.xml> to org.apache.maven.dist.tools/dist-tool-plugin/0.0.1-SNAPSHOT/dist-tool-plugin-0.0.1-SNAPSHOT.pom
[JENKINS] Archiving <https://builds.apache.org/job/dist-tool-plugin/ws/target/dist-tool-plugin-0.0.1-SNAPSHOT.jar>
to org.apache.maven.dist.tools/dist-tool-plugin/0.0.1-SNAPSHOT/dist-tool-plugin-0.0.1-SNAPSHOT.jar
Sending e-mails to: notifications@maven.apache.org null@apache.org rfscholte@apache.org hboutemy@apache.org
channel stopped

Mime
View raw message