maven-notifications mailing list archives

Site index · List index
Message view « Date » · « Thread »
Top « Date » · « Thread »
From Apache Jenkins Server <jenk...@builds.apache.org>
Subject Build failed in Jenkins: maven-plugins-ITs-m3.0.3 #403
Date Sat, 26 Oct 2013 09:37:45 GMT
See <https://builds.apache.org/job/maven-plugins-ITs-m3.0.3/403/changes>

Changes:

[hboutemy] [DOXIASITETOOLS-85] moved RenderingContext from o.a.m.doxia.sink.render package
to o.a.m.doxia.siterenderer

------------------------------------------
[...truncated 9976 lines...]
[INFO] run script setup.bsh
[INFO] run script verify.bsh
[INFO] ..SUCCESS (3.0 s)
[INFO] Building: mini-jar-malformed-dependencies/pom.xml
[INFO] ..SUCCESS (6.5 s)
[INFO] Building: duplicate-classes-without-reloc/pom.xml
[INFO] ..SUCCESS (3.1 s)
[INFO] Building: empty-relocation-shaded-pattern/pom.xml
[INFO] ..SUCCESS (3.7 s)
[INFO] Building: empty-relocation-pattern/pom.xml
[INFO] ..SUCCESS (4.6 s)
[INFO] 
[INFO] --- maven-invoker-plugin:1.8:verify (integration-test) @ maven-shade-plugin ---
[INFO] -------------------------------------------------
[INFO] Build Summary:
[INFO]   Passed: 45, Failed: 0, Errors: 0, Skipped: 0
[INFO] -------------------------------------------------
[INFO] 
[INFO] --- maven-install-plugin:2.3.1:install (default-install) @ maven-shade-plugin ---
[INFO] Installing <https://builds.apache.org/job/maven-plugins-ITs-m3.0.3/ws/maven-shade-plugin/target/maven-shade-plugin-2.2-SNAPSHOT.jar>
to /home/jenkins/.m2/repository/org/apache/maven/plugins/maven-shade-plugin/2.2-SNAPSHOT/maven-shade-plugin-2.2-SNAPSHOT.jar
[INFO] Installing <https://builds.apache.org/job/maven-plugins-ITs-m3.0.3/ws/maven-shade-plugin/pom.xml>
to /home/jenkins/.m2/repository/org/apache/maven/plugins/maven-shade-plugin/2.2-SNAPSHOT/maven-shade-plugin-2.2-SNAPSHOT.pom
[INFO] Installing <https://builds.apache.org/job/maven-plugins-ITs-m3.0.3/ws/maven-shade-plugin/target/maven-shade-plugin-2.2-SNAPSHOT-tests.jar>
to /home/jenkins/.m2/repository/org/apache/maven/plugins/maven-shade-plugin/2.2-SNAPSHOT/maven-shade-plugin-2.2-SNAPSHOT-tests.jar
[INFO]                                                                         
[INFO] ------------------------------------------------------------------------
[INFO] Building Apache Maven GPG Plugin 1.5-SNAPSHOT
[INFO] ------------------------------------------------------------------------
[INFO] 
[INFO] --- maven-clean-plugin:2.5:clean (default-clean) @ maven-gpg-plugin ---
[INFO] Deleting <https://builds.apache.org/job/maven-plugins-ITs-m3.0.3/ws/maven-gpg-plugin/target>
[INFO] 
[INFO] --- maven-enforcer-plugin:1.0.1:enforce (ensure-no-container-api) @ maven-gpg-plugin
---
[INFO] 
[INFO] --- maven-plugin-plugin:3.2:helpmojo (generated-helpmojo) @ maven-gpg-plugin ---
[INFO] Using 'UTF-8' encoding to read mojo metadata.
[INFO] Applying mojo extractor for language: java
[INFO] Mojo extractor for language: java found 0 mojo descriptors.
[INFO] Applying mojo extractor for language: bsh
[INFO] Mojo extractor for language: bsh found 0 mojo descriptors.
[INFO] Applying mojo extractor for language: java-annotations
[INFO] Mojo extractor for language: java-annotations found 0 mojo descriptors.
[INFO] 
[INFO] --- maven-plugin-plugin:3.2:descriptor (default-descriptor) @ maven-gpg-plugin ---
[INFO] Using 'UTF-8' encoding to read mojo metadata.
[INFO] Applying mojo extractor for language: java
[INFO] Mojo extractor for language: java found 0 mojo descriptors.
[INFO] Applying mojo extractor for language: bsh
[INFO] Mojo extractor for language: bsh found 0 mojo descriptors.
[INFO] Applying mojo extractor for language: java-annotations
[INFO] Mojo extractor for language: java-annotations found 0 mojo descriptors.
[INFO] 
[INFO] --- maven-remote-resources-plugin:1.4:process (default) @ maven-gpg-plugin ---
[INFO] 
[INFO] --- maven-resources-plugin:2.6:resources (default-resources) @ maven-gpg-plugin ---
[INFO] Using 'UTF-8' encoding to copy filtered resources.
[INFO] skip non existing resourceDirectory <https://builds.apache.org/job/maven-plugins-ITs-m3.0.3/ws/maven-gpg-plugin/src/main/resources>
[INFO] Copying 3 resources
[INFO] 
[INFO] --- maven-compiler-plugin:3.0:compile (default-compile) @ maven-gpg-plugin ---
[INFO] Changes detected - recompiling the module!
[INFO] Compiling 9 source files to <https://builds.apache.org/job/maven-plugins-ITs-m3.0.3/ws/maven-gpg-plugin/target/classes>
[INFO] 
[INFO] --- maven-plugin-plugin:3.2:descriptor (generate-descriptor) @ maven-gpg-plugin ---
[INFO] Using 'UTF-8' encoding to read mojo metadata.
[INFO] Applying mojo extractor for language: java
[INFO] Mojo extractor for language: java found 0 mojo descriptors.
[INFO] Applying mojo extractor for language: bsh
[INFO] Mojo extractor for language: bsh found 0 mojo descriptors.
[INFO] Applying mojo extractor for language: java-annotations
[INFO] Mojo extractor for language: java-annotations found 3 mojo descriptors.
[INFO] 
[INFO] --- maven-resources-plugin:2.6:testResources (default-testResources) @ maven-gpg-plugin
---
[INFO] Using 'UTF-8' encoding to copy filtered resources.
[INFO] Copying 8 resources
[INFO] Copying 3 resources
[INFO] 
[INFO] --- maven-compiler-plugin:3.0:testCompile (default-testCompile) @ maven-gpg-plugin
---
[INFO] No sources to compile
[INFO] 
[INFO] --- maven-surefire-plugin:2.12.4:test (default-test) @ maven-gpg-plugin ---
[INFO] 
[INFO] --- maven-jar-plugin:2.4:jar (default-jar) @ maven-gpg-plugin ---
[INFO] Building jar: <https://builds.apache.org/job/maven-plugins-ITs-m3.0.3/ws/maven-gpg-plugin/target/maven-gpg-plugin-1.5-SNAPSHOT.jar>
[INFO] 
[INFO] --- maven-plugin-plugin:3.2:addPluginArtifactMetadata (default-addPluginArtifactMetadata)
@ maven-gpg-plugin ---
[INFO] 
[INFO] --- maven-invoker-plugin:1.7:install (integration-test) @ maven-gpg-plugin ---
[INFO] Installing <https://builds.apache.org/job/maven-plugins-ITs-m3.0.3/ws/maven-gpg-plugin/pom.xml>
to <https://builds.apache.org/job/maven-plugins-ITs-m3.0.3/ws/maven-gpg-plugin/target/local-repo/org/apache/maven/plugins/maven-gpg-plugin/1.5-SNAPSHOT/maven-gpg-plugin-1.5-SNAPSHOT.pom>
[INFO] Installing <https://builds.apache.org/job/maven-plugins-ITs-m3.0.3/ws/maven-gpg-plugin/target/maven-gpg-plugin-1.5-SNAPSHOT.jar>
to <https://builds.apache.org/job/maven-plugins-ITs-m3.0.3/ws/maven-gpg-plugin/target/local-repo/org/apache/maven/plugins/maven-gpg-plugin/1.5-SNAPSHOT/maven-gpg-plugin-1.5-SNAPSHOT.jar>
[INFO] 
[INFO] --- maven-invoker-plugin:1.7:integration-test (integration-test) @ maven-gpg-plugin
---
[INFO] Building: sign-release/pom.xml
[INFO] run script verify.bsh
[INFO] ..SUCCESS (4.1 s)
[INFO] Building: no-main-artifact/pom.xml
[INFO] run script verify.bsh
[INFO] ..SUCCESS (2.5 s)
[INFO] Building: alternative-secret-keyring/pom.xml
[INFO] run script verify.bsh
[INFO] ..SUCCESS (2.5 s)
[INFO] 
[INFO] --- maven-invoker-plugin:1.7:verify (integration-test) @ maven-gpg-plugin ---
[INFO] -------------------------------------------------
[INFO] Build Summary:
[INFO]   Passed: 3, Failed: 0, Errors: 0, Skipped: 0
[INFO] -------------------------------------------------
[INFO] 
[INFO] --- maven-install-plugin:2.3.1:install (default-install) @ maven-gpg-plugin ---
[INFO] Installing <https://builds.apache.org/job/maven-plugins-ITs-m3.0.3/ws/maven-gpg-plugin/target/maven-gpg-plugin-1.5-SNAPSHOT.jar>
to /home/jenkins/.m2/repository/org/apache/maven/plugins/maven-gpg-plugin/1.5-SNAPSHOT/maven-gpg-plugin-1.5-SNAPSHOT.jar
[INFO] Installing <https://builds.apache.org/job/maven-plugins-ITs-m3.0.3/ws/maven-gpg-plugin/pom.xml>
to /home/jenkins/.m2/repository/org/apache/maven/plugins/maven-gpg-plugin/1.5-SNAPSHOT/maven-gpg-plugin-1.5-SNAPSHOT.pom
[INFO]                                                                         
[INFO] ------------------------------------------------------------------------
[INFO] Building Apache Maven Plugins Aggregator 1-SNAPSHOT
[INFO] ------------------------------------------------------------------------
[INFO] 
[INFO] --- maven-clean-plugin:2.4.1:clean (default-clean) @ maven-plugins-aggregator ---
[INFO] Deleting <https://builds.apache.org/job/maven-plugins-ITs-m3.0.3/ws/target>
[INFO] 
[INFO] --- maven-remote-resources-plugin:1.1:process (default) @ maven-plugins-aggregator
---
[INFO] Setting property: classpath.resource.loader.class => 'org.codehaus.plexus.velocity.ContextClassLoaderResourceLoader'.
[INFO] Setting property: velocimacro.messages.on => 'false'.
[INFO] Setting property: resource.loader => 'classpath'.
[INFO] Setting property: resource.manager.logwhenfound => 'false'.
[INFO] 
[INFO] --- maven-install-plugin:2.3.1:install (default-install) @ maven-plugins-aggregator
---
[INFO] Installing <https://builds.apache.org/job/maven-plugins-ITs-m3.0.3/ws/pom.xml>
to /home/jenkins/.m2/repository/org/apache/maven/plugins/maven-plugins-aggregator/1-SNAPSHOT/maven-plugins-aggregator-1-SNAPSHOT.pom
[INFO] ------------------------------------------------------------------------
[INFO] Reactor Summary:
[INFO] 
[INFO] Apache Maven Plugins .............................. SUCCESS [11.390s]
[INFO] Apache Maven ACR Plugin ........................... SUCCESS [44.154s]
[INFO] Apache Maven Ant Plugin ........................... SUCCESS [1:22.766s]
[INFO] Apache Maven AntRun Plugin ........................ SUCCESS [57.878s]
[INFO] Apache Maven Eclipse Plugin ....................... SUCCESS [6:59.270s]
[INFO] Apache Maven Assembly Plugin ...................... SUCCESS [13:07.845s]
[INFO] Apache Maven Changelog Plugin ..................... SUCCESS [1:01.681s]
[INFO] Apache Maven Changes Plugin ....................... SUCCESS [1:20.108s]
[INFO] Apache Maven Checkstyle Plugin .................... SUCCESS [2:02.550s]
[INFO] Apache Maven Clean Plugin ......................... SUCCESS [31.457s]
[INFO] Apache Maven Compiler Plugin ...................... SUCCESS [1:50.554s]
[INFO] Apache Maven Dependency Plugin .................... SUCCESS [3:10.053s]
[INFO] Apache Maven Deploy Plugin ........................ SUCCESS [1:18.541s]
[INFO] Apache Maven DOAP Plugin .......................... SUCCESS [22.589s]
[INFO] Apache Maven Documentation Checker Plugin ......... SUCCESS [10.040s]
[INFO] Apache Maven EAR Plugin ........................... SUCCESS [4:05.186s]
[INFO] Apache Maven EJB Plugin ........................... SUCCESS [28.491s]
[INFO] Apache Maven Help Plugin .......................... SUCCESS [48.021s]
[INFO] Apache Maven Install Plugin ....................... SUCCESS [1:01.318s]
[INFO] Apache Maven JAR Plugin ........................... SUCCESS [1:15.613s]
[INFO] Apache Maven Jarsigner Plugin ..................... SUCCESS [26.132s]
[INFO] Apache Maven Javadoc Plugin ....................... SUCCESS [3:10.049s]
[INFO] Apache Maven Linkcheck Plugin ..................... SUCCESS [3.229s]
[INFO] Apache Maven Patch Plugin ......................... SUCCESS [12.856s]
[INFO] Apache Maven PDF Plugin ........................... SUCCESS [1:11.728s]
[INFO] Apache Maven PMD Plugin ........................... SUCCESS [2:04.536s]
[INFO] Apache Maven RAR Plugin ........................... SUCCESS [15.181s]
[INFO] Apache Maven Reactor Plugin ....................... SUCCESS [3.082s]
[INFO] Apache Maven Repository Plugin .................... SUCCESS [41.550s]
[INFO] Apache Maven Resources Plugin ..................... SUCCESS [1:00.466s]
[INFO] Apache Maven Site Plugin 3 ........................ FAILURE [26.798s]
[INFO] Apache Maven Source Plugin ........................ SUCCESS [53.174s]
[INFO] Apache Maven Stage Plugin ......................... SUCCESS [2.562s]
[INFO] Apache Maven Toolchains Plugin .................... SUCCESS [1.663s]
[INFO] Apache Maven Verifier Plugin ...................... SUCCESS [16.867s]
[INFO] Apache Maven WAR Plugin ........................... SUCCESS [1:25.572s]
[INFO] Apache Maven SCM Publish Plugin ................... SUCCESS [1:26.851s]
[INFO] Apache Maven Invoker Plugin ....................... SUCCESS [4:49.035s]
[INFO] Apache Maven Project Info Reports Plugin .......... SUCCESS [2:17.926s]
[INFO] Apache Maven Remote Resources Plugin .............. SUCCESS [58.816s]
[INFO] Apache Maven Shade Plugin ......................... SUCCESS [3:47.366s]
[INFO] Apache Maven GPG Plugin ........................... SUCCESS [11.741s]
[INFO] Apache Maven Plugins Aggregator ................... SUCCESS [0.523s]
[INFO] ------------------------------------------------------------------------
[INFO] BUILD FAILURE
[INFO] ------------------------------------------------------------------------
[INFO] Total time: 1:08:46.398s
[INFO] Finished at: Sat Oct 26 09:34:26 UTC 2013
[INFO] Final Memory: 98M/432M
[INFO] ------------------------------------------------------------------------
[WARNING] The requested profile "apache.snapshots" could not be activated because it does
not exist.
[ERROR] Failed to execute goal org.apache.maven.plugins:maven-compiler-plugin:3.0:compile
(default-compile) on project maven-site-plugin: Compilation failure: Compilation failure:
[ERROR] <https://builds.apache.org/job/maven-plugins-ITs-m3.0.3/ws/maven-site-plugin/src/main/java/org/apache/maven/plugins/site/CategorySummaryDocumentRenderer.java>:[32,43]
cannot find symbol
[ERROR] symbol  : class RenderingContext
[ERROR] location: package org.apache.maven.doxia.siterenderer
[ERROR] <https://builds.apache.org/job/maven-plugins-ITs-m3.0.3/ws/maven-site-plugin/src/main/java/org/apache/maven/plugins/site/CategorySummaryDocumentRenderer.java>:[48,12]
cannot find symbol
[ERROR] symbol  : class RenderingContext
[ERROR] location: class org.apache.maven.plugins.site.CategorySummaryDocumentRenderer
[ERROR] <https://builds.apache.org/job/maven-plugins-ITs-m3.0.3/ws/maven-site-plugin/src/main/java/org/apache/maven/plugins/site/CategorySummaryDocumentRenderer.java>:[62,44]
cannot find symbol
[ERROR] symbol  : class RenderingContext
[ERROR] location: class org.apache.maven.plugins.site.CategorySummaryDocumentRenderer
[ERROR] <https://builds.apache.org/job/maven-plugins-ITs-m3.0.3/ws/maven-site-plugin/src/main/java/org/apache/maven/plugins/site/CategorySummaryDocumentRenderer.java>:[68,44]
cannot find symbol
[ERROR] symbol  : class RenderingContext
[ERROR] location: class org.apache.maven.plugins.site.CategorySummaryDocumentRenderer
[ERROR] <https://builds.apache.org/job/maven-plugins-ITs-m3.0.3/ws/maven-site-plugin/src/main/java/org/apache/maven/plugins/site/CategorySummaryDocumentRenderer.java>:[183,11]
cannot find symbol
[ERROR] symbol  : class RenderingContext
[ERROR] location: class org.apache.maven.plugins.site.CategorySummaryDocumentRenderer
[ERROR] <https://builds.apache.org/job/maven-plugins-ITs-m3.0.3/ws/maven-site-plugin/src/main/java/org/apache/maven/plugins/site/AbstractSiteRenderingMojo.java>:[42,43]
cannot find symbol
[ERROR] symbol  : class RenderingContext
[ERROR] location: package org.apache.maven.doxia.siterenderer
[ERROR] <https://builds.apache.org/job/maven-plugins-ITs-m3.0.3/ws/maven-site-plugin/src/main/java/org/apache/maven/plugins/site/ReportDocumentRenderer.java>:[38,43]
cannot find symbol
[ERROR] symbol  : class RenderingContext
[ERROR] location: package org.apache.maven.doxia.siterenderer
[ERROR] <https://builds.apache.org/job/maven-plugins-ITs-m3.0.3/ws/maven-site-plugin/src/main/java/org/apache/maven/plugins/site/ReportDocumentRenderer.java>:[60,18]
cannot find symbol
[ERROR] symbol  : class RenderingContext
[ERROR] location: class org.apache.maven.plugins.site.ReportDocumentRenderer
[ERROR] <https://builds.apache.org/job/maven-plugins-ITs-m3.0.3/ws/maven-site-plugin/src/main/java/org/apache/maven/plugins/site/ReportDocumentRenderer.java>:[68,78]
cannot find symbol
[ERROR] symbol  : class RenderingContext
[ERROR] location: class org.apache.maven.plugins.site.ReportDocumentRenderer
[ERROR] <https://builds.apache.org/job/maven-plugins-ITs-m3.0.3/ws/maven-site-plugin/src/main/java/org/apache/maven/plugins/site/ReportDocumentRenderer.java>:[330,11]
cannot find symbol
[ERROR] symbol  : class RenderingContext
[ERROR] location: class org.apache.maven.plugins.site.ReportDocumentRenderer
[ERROR] <https://builds.apache.org/job/maven-plugins-ITs-m3.0.3/ws/maven-site-plugin/src/main/java/org/apache/maven/plugins/site/ReportDocumentRenderer.java>:[129,58]
cannot find symbol
[ERROR] symbol  : class RenderingContext
[ERROR] location: class org.apache.maven.plugins.site.ReportDocumentRenderer.MySink
[ERROR] <https://builds.apache.org/job/maven-plugins-ITs-m3.0.3/ws/maven-site-plugin/src/main/java/org/apache/maven/plugins/site/ReportDocumentRenderer.java>:[151,16]
cannot find symbol
[ERROR] symbol  : class RenderingContext
[ERROR] location: class org.apache.maven.plugins.site.ReportDocumentRenderer.MySinkFactory
[ERROR] <https://builds.apache.org/job/maven-plugins-ITs-m3.0.3/ws/maven-site-plugin/src/main/java/org/apache/maven/plugins/site/ReportDocumentRenderer.java>:[155,30]
cannot find symbol
[ERROR] symbol  : class RenderingContext
[ERROR] location: class org.apache.maven.plugins.site.ReportDocumentRenderer.MySinkFactory
[ERROR] <https://builds.apache.org/job/maven-plugins-ITs-m3.0.3/ws/maven-site-plugin/src/main/java/org/apache/maven/plugins/site/AbstractSiteRenderingMojo.java>:[410,16]
cannot find symbol
[ERROR] symbol  : class RenderingContext
[ERROR] location: class org.apache.maven.plugins.site.AbstractSiteRenderingMojo
[ERROR] <https://builds.apache.org/job/maven-plugins-ITs-m3.0.3/ws/maven-site-plugin/src/main/java/org/apache/maven/plugins/site/AbstractSiteRenderingMojo.java>:[410,56]
cannot find symbol
[ERROR] symbol  : class RenderingContext
[ERROR] location: class org.apache.maven.plugins.site.AbstractSiteRenderingMojo
[ERROR] <https://builds.apache.org/job/maven-plugins-ITs-m3.0.3/ws/maven-site-plugin/src/main/java/org/apache/maven/plugins/site/AbstractSiteRenderingMojo.java>:[459,12]
cannot find symbol
[ERROR] symbol  : class RenderingContext
[ERROR] location: class org.apache.maven.plugins.site.AbstractSiteRenderingMojo
[ERROR] <https://builds.apache.org/job/maven-plugins-ITs-m3.0.3/ws/maven-site-plugin/src/main/java/org/apache/maven/plugins/site/AbstractSiteRenderingMojo.java>:[459,52]
cannot find symbol
[ERROR] symbol  : class RenderingContext
[ERROR] location: class org.apache.maven.plugins.site.AbstractSiteRenderingMojo
[ERROR] <https://builds.apache.org/job/maven-plugins-ITs-m3.0.3/ws/maven-site-plugin/src/main/java/org/apache/maven/plugins/site/AbstractSiteRenderingMojo.java>:[479,12]
cannot find symbol
[ERROR] symbol  : class RenderingContext
[ERROR] location: class org.apache.maven.plugins.site.AbstractSiteRenderingMojo
[ERROR] <https://builds.apache.org/job/maven-plugins-ITs-m3.0.3/ws/maven-site-plugin/src/main/java/org/apache/maven/plugins/site/AbstractSiteRenderingMojo.java>:[479,52]
cannot find symbol
[ERROR] symbol  : class RenderingContext
[ERROR] location: class org.apache.maven.plugins.site.AbstractSiteRenderingMojo
[ERROR] -> [Help 1]
[ERROR] 
[ERROR] To see the full stack trace of the errors, re-run Maven with the -e switch.
[ERROR] Re-run Maven using the -X switch to enable full debug logging.
[ERROR] 
[ERROR] For more information about the errors and possible solutions, please read the following
articles:
[ERROR] [Help 1] http://cwiki.apache.org/confluence/display/MAVEN/MojoFailureException
[ERROR] 
[ERROR] After correcting the problems, you can resume the build with the command
[ERROR]   mvn <goals> -rf :maven-site-plugin
Build step 'Invoke top-level Maven targets' marked build as failure
Recording test results

Mime
View raw message