maven-notifications mailing list archives

Site index · List index
Message view « Date » · « Thread »
Top « Date » · « Thread »
From Apache Jenkins Server <jenk...@builds.apache.org>
Subject Build failed in Jenkins: dist-tool-plugin #272
Date Tue, 29 Oct 2013 10:09:04 GMT
See <https://builds.apache.org/job/dist-tool-plugin/272/>

------------------------------------------
[...truncated 3021 lines...]
Downloaded: http://repo.maven.apache.org/maven2/org/apache/maven/apache-maven/3.0.5/apache-maven-3.0.5.pom
(6 KB at 591.1 KB/sec)
Downloading: http://repo.maven.apache.org/maven2/org/apache/maven/maven/3.0.5/maven-3.0.5.pom
Downloaded: http://repo.maven.apache.org/maven2/org/apache/maven/maven/3.0.5/maven-3.0.5.pom
(22 KB at 2735.7 KB/sec)
Downloading: http://repo.maven.apache.org/maven2/org/apache/maven/apache-maven/3.1.1/apache-maven-3.1.1.pom
Downloaded: http://repo.maven.apache.org/maven2/org/apache/maven/apache-maven/3.1.1/apache-maven-3.1.1.pom
(7 KB at 80.0 KB/sec)
Downloading: http://repo.maven.apache.org/maven2/org/apache/maven/maven/3.1.1/maven-3.1.1.pom
Downloaded: http://repo.maven.apache.org/maven2/org/apache/maven/maven/3.1.1/maven-3.1.1.pom
(22 KB at 2697.1 KB/sec)
Downloading: http://repo.maven.apache.org/maven2/org/apache/maven/plugin-testing/maven-plugin-testing/2.1/maven-plugin-testing-2.1.pom
Downloaded: http://repo.maven.apache.org/maven2/org/apache/maven/plugin-testing/maven-plugin-testing/2.1/maven-plugin-testing-2.1.pom
(10 KB at 981.1 KB/sec)
Downloading: http://repo.maven.apache.org/maven2/org/apache/maven/plugins/maven-acr-plugin/1.0/maven-acr-plugin-1.0.pom
Downloaded: http://repo.maven.apache.org/maven2/org/apache/maven/plugins/maven-acr-plugin/1.0/maven-acr-plugin-1.0.pom
(6 KB at 638.9 KB/sec)
Downloading: http://repo.maven.apache.org/maven2/org/apache/maven/plugins/maven-ant-plugin/2.3/maven-ant-plugin-2.3.pom
Downloaded: http://repo.maven.apache.org/maven2/org/apache/maven/plugins/maven-ant-plugin/2.3/maven-ant-plugin-2.3.pom
(6 KB at 742.1 KB/sec)
Downloading: http://repo.maven.apache.org/maven2/org/apache/maven/plugins/maven-plugins/16/maven-plugins-16.pom
Downloaded: http://repo.maven.apache.org/maven2/org/apache/maven/plugins/maven-plugins/16/maven-plugins-16.pom
(13 KB at 1806.5 KB/sec)
Downloading: http://repo.maven.apache.org/maven2/org/apache/maven/plugins/maven-antrun-plugin/1.7/maven-antrun-plugin-1.7.pom
Downloaded: http://repo.maven.apache.org/maven2/org/apache/maven/plugins/maven-antrun-plugin/1.7/maven-antrun-plugin-1.7.pom
(5 KB at 447.5 KB/sec)
Downloading: http://repo.maven.apache.org/maven2/org/apache/maven/plugins/maven-assembly-plugin/2.4/maven-assembly-plugin-2.4.pom
Downloaded: http://repo.maven.apache.org/maven2/org/apache/maven/plugins/maven-assembly-plugin/2.4/maven-assembly-plugin-2.4.pom
(17 KB at 2055.9 KB/sec)
Downloading: http://repo.maven.apache.org/maven2/org/apache/maven/plugins/maven-changelog-plugin/2.2/maven-changelog-plugin-2.2.pom
Downloaded: http://repo.maven.apache.org/maven2/org/apache/maven/plugins/maven-changelog-plugin/2.2/maven-changelog-plugin-2.2.pom
(13 KB at 1368.5 KB/sec)
Downloading: http://repo.maven.apache.org/maven2/org/apache/maven/plugins/maven-changes-plugin/2.9/maven-changes-plugin-2.9.pom
Downloaded: http://repo.maven.apache.org/maven2/org/apache/maven/plugins/maven-changes-plugin/2.9/maven-changes-plugin-2.9.pom
(19 KB at 2045.0 KB/sec)
Downloading: http://repo.maven.apache.org/maven2/org/apache/maven/plugins/maven-dependency-plugin/2.8/maven-dependency-plugin-2.8.pom
Downloaded: http://repo.maven.apache.org/maven2/org/apache/maven/plugins/maven-dependency-plugin/2.8/maven-dependency-plugin-2.8.pom
(12 KB at 1242.8 KB/sec)
Downloading: http://repo.maven.apache.org/maven2/org/apache/maven/plugins/maven-deploy-plugin/2.8.1/maven-deploy-plugin-2.8.1.pom
Downloaded: http://repo.maven.apache.org/maven2/org/apache/maven/plugins/maven-deploy-plugin/2.8.1/maven-deploy-plugin-2.8.1.pom
(8 KB at 970.1 KB/sec)
Downloading: http://repo.maven.apache.org/maven2/org/apache/maven/plugins/maven-doap-plugin/1.1/maven-doap-plugin-1.1.pom
Downloaded: http://repo.maven.apache.org/maven2/org/apache/maven/plugins/maven-doap-plugin/1.1/maven-doap-plugin-1.1.pom
(9 KB at 104.7 KB/sec)
Downloading: http://repo.maven.apache.org/maven2/org/apache/maven/plugins/maven-ear-plugin/2.8/maven-ear-plugin-2.8.pom
Downloaded: http://repo.maven.apache.org/maven2/org/apache/maven/plugins/maven-ear-plugin/2.8/maven-ear-plugin-2.8.pom
(9 KB at 957.7 KB/sec)
Downloading: http://repo.maven.apache.org/maven2/org/apache/maven/plugins/maven-eclipse-plugin/2.9/maven-eclipse-plugin-2.9.pom
Downloaded: http://repo.maven.apache.org/maven2/org/apache/maven/plugins/maven-eclipse-plugin/2.9/maven-eclipse-plugin-2.9.pom
(15 KB at 1842.4 KB/sec)
Downloading: http://repo.maven.apache.org/maven2/org/apache/maven/plugins/maven-ejb-plugin/2.3/maven-ejb-plugin-2.3.pom
Downloaded: http://repo.maven.apache.org/maven2/org/apache/maven/plugins/maven-ejb-plugin/2.3/maven-ejb-plugin-2.3.pom
(6 KB at 643.2 KB/sec)
Downloading: http://repo.maven.apache.org/maven2/org/apache/maven/plugins/maven-help-plugin/2.2/maven-help-plugin-2.2.pom
Downloaded: http://repo.maven.apache.org/maven2/org/apache/maven/plugins/maven-help-plugin/2.2/maven-help-plugin-2.2.pom
(9 KB at 946.3 KB/sec)
Downloading: http://repo.maven.apache.org/maven2/org/apache/maven/plugins/maven-idea-plugin/2.2.1/maven-idea-plugin-2.2.1.pom
Downloaded: http://repo.maven.apache.org/maven2/org/apache/maven/plugins/maven-idea-plugin/2.2.1/maven-idea-plugin-2.2.1.pom
(7 KB at 145.5 KB/sec)
Downloading: http://repo.maven.apache.org/maven2/org/apache/maven/plugins/maven-install-plugin/2.5.1/maven-install-plugin-2.5.1.pom
Downloaded: http://repo.maven.apache.org/maven2/org/apache/maven/plugins/maven-install-plugin/2.5.1/maven-install-plugin-2.5.1.pom
(8 KB at 889.3 KB/sec)
Downloading: http://repo.maven.apache.org/maven2/org/apache/maven/plugins/maven-invoker-plugin/1.8/maven-invoker-plugin-1.8.pom
Downloaded: http://repo.maven.apache.org/maven2/org/apache/maven/plugins/maven-invoker-plugin/1.8/maven-invoker-plugin-1.8.pom
(13 KB at 1385.5 KB/sec)
Downloading: http://repo.maven.apache.org/maven2/org/apache/maven/plugins/maven-jarsigner-plugin/1.2/maven-jarsigner-plugin-1.2.pom
Downloaded: http://repo.maven.apache.org/maven2/org/apache/maven/plugins/maven-jarsigner-plugin/1.2/maven-jarsigner-plugin-1.2.pom
(6 KB at 586.5 KB/sec)
Downloading: http://repo.maven.apache.org/maven2/org/apache/maven/plugins/maven-plugins/14/maven-plugins-14.pom
Downloaded: http://repo.maven.apache.org/maven2/org/apache/maven/plugins/maven-plugins/14/maven-plugins-14.pom
(13 KB at 1360.4 KB/sec)
Downloading: http://repo.maven.apache.org/maven2/org/apache/maven/plugins/maven-javadoc-plugin/2.9.1/maven-javadoc-plugin-2.9.1.pom
Downloaded: http://repo.maven.apache.org/maven2/org/apache/maven/plugins/maven-javadoc-plugin/2.9.1/maven-javadoc-plugin-2.9.1.pom
(16 KB at 110.5 KB/sec)
Downloading: http://repo.maven.apache.org/maven2/org/apache/maven/plugins/maven-linkcheck-plugin/1.1/maven-linkcheck-plugin-1.1.pom
Downloaded: http://repo.maven.apache.org/maven2/org/apache/maven/plugins/maven-linkcheck-plugin/1.1/maven-linkcheck-plugin-1.1.pom
(7 KB at 680.5 KB/sec)
Downloading: http://repo.maven.apache.org/maven2/org/apache/maven/plugins/maven-one-plugin/1.3/maven-one-plugin-1.3.pom
Downloaded: http://repo.maven.apache.org/maven2/org/apache/maven/plugins/maven-one-plugin/1.3/maven-one-plugin-1.3.pom
(6 KB at 50.4 KB/sec)
Downloading: http://repo.maven.apache.org/maven2/org/apache/maven/plugins/maven-patch-plugin/1.1.1/maven-patch-plugin-1.1.1.pom
Downloaded: http://repo.maven.apache.org/maven2/org/apache/maven/plugins/maven-patch-plugin/1.1.1/maven-patch-plugin-1.1.1.pom
(4 KB at 41.8 KB/sec)
Downloading: http://repo.maven.apache.org/maven2/org/apache/maven/plugins/maven-pdf-plugin/1.2/maven-pdf-plugin-1.2.pom
Downloaded: http://repo.maven.apache.org/maven2/org/apache/maven/plugins/maven-pdf-plugin/1.2/maven-pdf-plugin-1.2.pom
(17 KB at 580.3 KB/sec)
Downloading: http://repo.maven.apache.org/maven2/org/apache/maven/plugins/maven-rar-plugin/2.3/maven-rar-plugin-2.3.pom
Downloaded: http://repo.maven.apache.org/maven2/org/apache/maven/plugins/maven-rar-plugin/2.3/maven-rar-plugin-2.3.pom
(6 KB at 69.4 KB/sec)
Downloading: http://repo.maven.apache.org/maven2/org/apache/maven/plugins/maven-reactor-plugin/1.0/maven-reactor-plugin-1.0.pom
Downloaded: http://repo.maven.apache.org/maven2/org/apache/maven/plugins/maven-reactor-plugin/1.0/maven-reactor-plugin-1.0.pom
(4 KB at 418.8 KB/sec)
Downloading: http://repo.maven.apache.org/maven2/org/apache/maven/plugins/maven-remote-resources-plugin/1.5/maven-remote-resources-plugin-1.5.pom
Downloaded: http://repo.maven.apache.org/maven2/org/apache/maven/plugins/maven-remote-resources-plugin/1.5/maven-remote-resources-plugin-1.5.pom
(14 KB at 1630.0 KB/sec)
Downloading: http://repo.maven.apache.org/maven2/org/apache/maven/plugins/maven-repository-plugin/2.3.1/maven-repository-plugin-2.3.1.pom
Downloaded: http://repo.maven.apache.org/maven2/org/apache/maven/plugins/maven-repository-plugin/2.3.1/maven-repository-plugin-2.3.1.pom
(9 KB at 45.9 KB/sec)
Downloading: http://repo.maven.apache.org/maven2/org/apache/maven/plugins/maven-shade-plugin/2.1/maven-shade-plugin-2.1.pom
Downloaded: http://repo.maven.apache.org/maven2/org/apache/maven/plugins/maven-shade-plugin/2.1/maven-shade-plugin-2.1.pom
(8 KB at 15.7 KB/sec)
Downloading: http://repo.maven.apache.org/maven2/org/apache/maven/plugins/maven-stage-plugin/1.0-alpha-2/maven-stage-plugin-1.0-alpha-2.pom
Downloaded: http://repo.maven.apache.org/maven2/org/apache/maven/plugins/maven-stage-plugin/1.0-alpha-2/maven-stage-plugin-1.0-alpha-2.pom
(8 KB at 54.7 KB/sec)
Downloading: http://repo.maven.apache.org/maven2/org/apache/maven/plugins/maven-plugins/13/maven-plugins-13.pom
Downloaded: http://repo.maven.apache.org/maven2/org/apache/maven/plugins/maven-plugins/13/maven-plugins-13.pom
(12 KB at 1644.1 KB/sec)
Downloading: http://repo.maven.apache.org/maven2/org/apache/maven/plugins/maven-toolchains-plugin/1.0/maven-toolchains-plugin-1.0.pom
Downloaded: http://repo.maven.apache.org/maven2/org/apache/maven/plugins/maven-toolchains-plugin/1.0/maven-toolchains-plugin-1.0.pom
(4 KB at 397.8 KB/sec)
Downloading: http://repo.maven.apache.org/maven2/org/apache/maven/plugins/maven-verifier-plugin/1.0/maven-verifier-plugin-1.0.pom
Downloaded: http://repo.maven.apache.org/maven2/org/apache/maven/plugins/maven-verifier-plugin/1.0/maven-verifier-plugin-1.0.pom
(5 KB at 546.1 KB/sec)
Downloading: http://repo.maven.apache.org/maven2/org/apache/maven/plugins/maven-war-plugin/2.4/maven-war-plugin-2.4.pom
Downloaded: http://repo.maven.apache.org/maven2/org/apache/maven/plugins/maven-war-plugin/2.4/maven-war-plugin-2.4.pom
(10 KB at 1126.2 KB/sec)
[INFO] org.apache.maven.release:maven-release metadata latest version value is 5 but check
was manually set to 2.4.1
Downloading: http://repo.maven.apache.org/maven2/org/apache/maven/release/maven-release/2.4.1/maven-release-2.4.1.pom
Downloaded: http://repo.maven.apache.org/maven2/org/apache/maven/release/maven-release/2.4.1/maven-release-2.4.1.pom
(6 KB at 670.2 KB/sec)
Downloading: http://repo.maven.apache.org/maven2/org/apache/apache/resources/apache-resource-bundles/4/apache-resource-bundles-4.pom
Downloaded: http://repo.maven.apache.org/maven2/org/apache/apache/resources/apache-resource-bundles/4/apache-resource-bundles-4.pom
(3 KB at 240.6 KB/sec)
Downloading: http://repo.maven.apache.org/maven2/org/apache/apache/resources/apache-source-release-assembly-descriptor/1.0.4/apache-source-release-assembly-descriptor-1.0.4.pom
Downloaded: http://repo.maven.apache.org/maven2/org/apache/apache/resources/apache-source-release-assembly-descriptor/1.0.4/apache-source-release-assembly-descriptor-1.0.4.pom
(8 KB at 264.7 KB/sec)
Downloading: http://repo.maven.apache.org/maven2/org/apache/maven/scm/maven-scm/1.8.1/maven-scm-1.8.1.pom
Downloaded: http://repo.maven.apache.org/maven2/org/apache/maven/scm/maven-scm/1.8.1/maven-scm-1.8.1.pom
(22 KB at 1116.8 KB/sec)
[WARNING] HTTP result code: 404 for file-management site = http://maven.apache.org/shared/file-management/
Downloading: http://repo.maven.apache.org/maven2/org/apache/maven/shared/maven-common-artifact-filters/1.4/maven-common-artifact-filters-1.4.pom
Downloaded: http://repo.maven.apache.org/maven2/org/apache/maven/shared/maven-common-artifact-filters/1.4/maven-common-artifact-filters-1.4.pom
(4 KB at 459.0 KB/sec)
Downloading: http://repo.maven.apache.org/maven2/org/apache/maven/shared/maven-dependency-analyzer/1.4/maven-dependency-analyzer-1.4.pom
Downloaded: http://repo.maven.apache.org/maven2/org/apache/maven/shared/maven-dependency-analyzer/1.4/maven-dependency-analyzer-1.4.pom
(6 KB at 629.2 KB/sec)
Downloading: http://repo.maven.apache.org/maven2/org/apache/maven/shared/maven-invoker/2.1.1/maven-invoker-2.1.1.pom
Downloaded: http://repo.maven.apache.org/maven2/org/apache/maven/shared/maven-invoker/2.1.1/maven-invoker-2.1.1.pom
(6 KB at 201.3 KB/sec)
Downloading: http://repo.maven.apache.org/maven2/org/apache/maven/shared/maven-jarsigner/1.0/maven-jarsigner-1.0.pom
Downloaded: http://repo.maven.apache.org/maven2/org/apache/maven/shared/maven-jarsigner/1.0/maven-jarsigner-1.0.pom
(4 KB at 21.6 KB/sec)
Downloading: http://repo.maven.apache.org/maven2/org/apache/maven/shared/maven-model-converter/2.3/maven-model-converter-2.3.pom
Downloaded: http://repo.maven.apache.org/maven2/org/apache/maven/shared/maven-model-converter/2.3/maven-model-converter-2.3.pom
(5 KB at 412.2 KB/sec)
Downloading: http://repo.maven.apache.org/maven2/org/apache/maven/shared/maven-repository-builder/1.0-alpha-2/maven-repository-builder-1.0-alpha-2.pom
Downloaded: http://repo.maven.apache.org/maven2/org/apache/maven/shared/maven-repository-builder/1.0-alpha-2/maven-repository-builder-1.0-alpha-2.pom
(4 KB at 64.4 KB/sec)
Downloading: http://repo.maven.apache.org/maven2/org/apache/maven/shared/maven-runtime/1.0-alpha-3/maven-runtime-1.0-alpha-3.pom
Downloaded: http://repo.maven.apache.org/maven2/org/apache/maven/shared/maven-runtime/1.0-alpha-3/maven-runtime-1.0-alpha-3.pom
(6 KB at 35.6 KB/sec)
Downloading: http://repo.maven.apache.org/maven2/org/apache/maven/shared/maven-script-interpreter/1.1/maven-script-interpreter-1.1.pom
Downloaded: http://repo.maven.apache.org/maven2/org/apache/maven/shared/maven-script-interpreter/1.1/maven-script-interpreter-1.1.pom
(4 KB at 151.0 KB/sec)
Downloading: http://repo.maven.apache.org/maven2/org/apache/maven/shared/maven-shared-resources/1/maven-shared-resources-1.pom
Downloaded: http://repo.maven.apache.org/maven2/org/apache/maven/shared/maven-shared-resources/1/maven-shared-resources-1.pom
(3 KB at 77.7 KB/sec)
Downloading: http://repo.maven.apache.org/maven2/org/apache/maven/shared/maven-shared-utils/0.4/maven-shared-utils-0.4.pom
Downloaded: http://repo.maven.apache.org/maven2/org/apache/maven/shared/maven-shared-utils/0.4/maven-shared-utils-0.4.pom
(4 KB at 564.6 KB/sec)
Downloading: http://repo.maven.apache.org/maven2/org/apache/maven/shared/maven-verifier/1.4/maven-verifier-1.4.pom
Downloaded: http://repo.maven.apache.org/maven2/org/apache/maven/shared/maven-verifier/1.4/maven-verifier-1.4.pom
(3 KB at 44.7 KB/sec)
Downloading: http://repo.maven.apache.org/maven2/org/apache/maven/skins/maven-application-skin/1.0/maven-application-skin-1.0.pom
Downloaded: http://repo.maven.apache.org/maven2/org/apache/maven/skins/maven-application-skin/1.0/maven-application-skin-1.0.pom
(5 KB at 155.6 KB/sec)
Downloading: http://repo.maven.apache.org/maven2/org/apache/maven/skins/maven-skins/6/maven-skins-6.pom
Downloaded: http://repo.maven.apache.org/maven2/org/apache/maven/skins/maven-skins/6/maven-skins-6.pom
(4 KB at 31.7 KB/sec)
Downloading: http://repo.maven.apache.org/maven2/org/apache/maven/skins/maven-classic-skin/1.1/maven-classic-skin-1.1.pom
Downloaded: http://repo.maven.apache.org/maven2/org/apache/maven/skins/maven-classic-skin/1.1/maven-classic-skin-1.1.pom
(5 KB at 29.0 KB/sec)
Downloading: http://repo.maven.apache.org/maven2/org/apache/maven/skins/maven-default-skin/1.1/maven-default-skin-1.1.pom
Downloaded: http://repo.maven.apache.org/maven2/org/apache/maven/skins/maven-default-skin/1.1/maven-default-skin-1.1.pom
(5 KB at 21.3 KB/sec)
Downloading: http://repo.maven.apache.org/maven2/org/apache/maven/skins/maven-fluido-skin/1.3.0/maven-fluido-skin-1.3.0.pom
Downloaded: http://repo.maven.apache.org/maven2/org/apache/maven/skins/maven-fluido-skin/1.3.0/maven-fluido-skin-1.3.0.pom
(23 KB at 147.3 KB/sec)
Downloading: http://repo.maven.apache.org/maven2/org/apache/maven/skins/maven-skins/7/maven-skins-7.pom
Downloaded: http://repo.maven.apache.org/maven2/org/apache/maven/skins/maven-skins/7/maven-skins-7.pom
(4 KB at 23.5 KB/sec)
Downloading: http://repo.maven.apache.org/maven2/org/apache/maven/skins/maven-stylus-skin/1.5/maven-stylus-skin-1.5.pom
Downloaded: http://repo.maven.apache.org/maven2/org/apache/maven/skins/maven-stylus-skin/1.5/maven-stylus-skin-1.5.pom
(6 KB at 44.3 KB/sec)
Downloading: http://repo.maven.apache.org/maven2/org/apache/maven/surefire/surefire/2.16/surefire-2.16.pom
Downloaded: http://repo.maven.apache.org/maven2/org/apache/maven/surefire/surefire/2.16/surefire-2.16.pom
(19 KB at 2325.1 KB/sec)
Downloading: http://repo.maven.apache.org/maven2/org/apache/maven/wagon/wagon/2.5/wagon-2.5.pom
Downloaded: http://repo.maven.apache.org/maven2/org/apache/maven/wagon/wagon/2.5/wagon-2.5.pom
(20 KB at 2175.0 KB/sec)
[INFO] Generating "Disttool> Source Release" report    --- dist-tool-plugin:0.0.1-SNAPSHOT
[INFO] ## line format:
[INFO] ## directory groupId [src+bin]
[INFO] ##   artifactId [forced version] An
[INFO] ##    artifactId [forced version] An
[INFO] ## n : 1 plugins
[INFO] ## n : 2 shared
[INFO] ## n : 3 skins
[INFO] ## n : 4 poms
[INFO] #### A1 site2X 
[INFO] #### A4 ASF (skin and parent find pattern hardcoded)
[INFO] ## binaries
[INFO] ##  doxia-book-maven-plugin
[INFO] ##  doxia-book-renderer
[WARNING] Missing file for doxia-linkcheck in http://repo.maven.apache.org/maven2/org/apache/maven/doxia/doxia-linkcheck/1.2
[WARNING]  > doxia-linkcheck-1.2-source-release.zip <
[WARNING]  > doxia-linkcheck-1.2-source-release.zip.asc <
[WARNING]  > doxia-linkcheck-1.2-source-release.zip.md5 <
[WARNING] Missing file for doxia-linkcheck in http://www.apache.org/dist/maven/doxia
[WARNING]  > doxia-linkcheck-1.2-source-release.zip <
[WARNING]  > doxia-linkcheck-1.2-source-release.zip.asc <
[WARNING]  > doxia-linkcheck-1.2-source-release.zip.md5 <
[INFO] ## maven-1
[INFO] org.apache.maven:apache-maven metadata latest version value is 3.1.1 but check was
manually set to 2.0.11
[WARNING] Missing file for apache-maven in http://repo.maven.apache.org/maven2/org/apache/maven/apache-maven/2.0.11
[WARNING]  > apache-maven-2.0.11-src.zip <
[WARNING]  > apache-maven-2.0.11-src.zip.asc <
[WARNING]  > apache-maven-2.0.11-src.zip.md5 <
[INFO] org.apache.maven:apache-maven metadata latest version value is 3.1.1 but check was
manually set to 2.2.1
[INFO] org.apache.maven:apache-maven metadata latest version value is 3.1.1 but check was
manually set to 3.0.5
[WARNING] Missing file for maven-docck-plugin in http://repo.maven.apache.org/maven2/org/apache/maven/plugins/maven-docck-plugin/1.0
[WARNING]  > maven-docck-plugin-1.0-source-release.zip <
[WARNING]  > maven-docck-plugin-1.0-source-release.zip.asc <
[WARNING]  > maven-docck-plugin-1.0-source-release.zip.md5 <
[WARNING] Missing file for maven-docck-plugin in http://www.apache.org/dist/maven/plugins
[WARNING]  > maven-docck-plugin-1.0-source-release.zip <
[WARNING]  > maven-docck-plugin-1.0-source-release.zip.asc <
[WARNING]  > maven-docck-plugin-1.0-source-release.zip.md5 <
[WARNING] Missing file for maven-reactor-plugin in http://repo.maven.apache.org/maven2/org/apache/maven/plugins/maven-reactor-plugin/1.0
[WARNING]  > maven-reactor-plugin-1.0-source-release.zip <
[WARNING]  > maven-reactor-plugin-1.0-source-release.zip.asc <
[WARNING]  > maven-reactor-plugin-1.0-source-release.zip.md5 <
[WARNING] Missing file for maven-reactor-plugin in http://www.apache.org/dist/maven/plugins
[WARNING]  > maven-reactor-plugin-1.0-source-release.zip <
[WARNING]  > maven-reactor-plugin-1.0-source-release.zip.asc <
[WARNING]  > maven-reactor-plugin-1.0-source-release.zip.md5 <
[INFO] org.apache.maven.release:maven-release metadata latest version value is 5 but check
was manually set to 2.4.1
[ERROR] Missing file for maven-release in http://www.apache.org/dist/maven/release
[ERROR]  > maven-release-2.4.1-source-release.zip <
[ERROR]  > maven-release-2.4.1-source-release.zip.asc <
[ERROR]  > maven-release-2.4.1-source-release.zip.md5 <
[ERROR] Older version than 2.4.1 for maven-release still available in http://www.apache.org/dist/maven/release
[ERROR]  > maven-release-2.4.2-source-release.zip <
[ERROR]  > maven-release-2.4.2-source-release.zip.asc <
[ERROR]  > maven-release-2.4.2-source-release.zip.md5 <
[WARNING] Missing file for file-management in http://repo.maven.apache.org/maven2/org/apache/maven/shared/file-management/1.2.1
[WARNING]  > file-management-1.2.1-source-release.zip <
[WARNING]  > file-management-1.2.1-source-release.zip.asc <
[WARNING]  > file-management-1.2.1-source-release.zip.md5 <
[WARNING] Missing file for file-management in http://www.apache.org/dist/maven/shared
[WARNING]  > file-management-1.2.1-source-release.zip <
[WARNING]  > file-management-1.2.1-source-release.zip.asc <
[WARNING]  > file-management-1.2.1-source-release.zip.md5 <
[WARNING] Missing file for maven-repository-builder in http://repo.maven.apache.org/maven2/org/apache/maven/shared/maven-repository-builder/1.0-alpha-2
[WARNING]  > maven-repository-builder-1.0-alpha-2-source-release.zip <
[WARNING]  > maven-repository-builder-1.0-alpha-2-source-release.zip.asc <
[WARNING]  > maven-repository-builder-1.0-alpha-2-source-release.zip.md5 <
[WARNING] Missing file for maven-repository-builder in http://www.apache.org/dist/maven/shared
[WARNING]  > maven-repository-builder-1.0-alpha-2-source-release.zip <
[WARNING]  > maven-repository-builder-1.0-alpha-2-source-release.zip.asc <
[WARNING]  > maven-repository-builder-1.0-alpha-2-source-release.zip.md5 <
[INFO] Generating "Disttool> Aggregator Check" report    --- dist-tool-plugin:0.0.1-SNAPSHOT
[INFO] ## line format:
[INFO] ## directory groupId [src+bin]
[INFO] ##   artifactId [forced version] An
[INFO] ##    artifactId [forced version] An
[INFO] ## n : 1 plugins
[INFO] ## n : 2 shared
[INFO] ## n : 3 skins
[INFO] ## n : 4 poms
[INFO] #### A1 site2X 
[INFO] #### A4 ASF (skin and parent find pattern hardcoded)
[INFO] ## binaries
[INFO] ##  doxia-book-maven-plugin
[INFO] ##  doxia-book-renderer
[INFO] ## maven-1
[INFO] org.apache.maven:apache-maven metadata latest version value is 3.1.1 but check was
manually set to 2.0.11
[INFO] org.apache.maven:apache-maven metadata latest version value is 3.1.1 but check was
manually set to 2.2.1
[INFO] org.apache.maven:apache-maven metadata latest version value is 3.1.1 but check was
manually set to 3.0.5
[INFO] org.apache.maven.plugins:maven-release-plugin metadata latest version value is 2.4.2
but check was manually set to 2.4.1
[INFO] org.apache.maven.release:maven-release metadata latest version value is 5 but check
was manually set to 2.4.1
[INFO] Generating "Failure Hack" report    --- dist-tool-plugin:0.0.1-SNAPSHOT
[ERROR] check-source-release.log error log not empty:
Missing file for maven-release in http://www.apache.org/dist/maven/release
 > maven-release-2.4.1-source-release.zip <
 > maven-release-2.4.1-source-release.zip.asc <
 > maven-release-2.4.1-source-release.zip.md5 <
Older version than 2.4.1 for maven-release still available in http://www.apache.org/dist/maven/release
 > maven-release-2.4.2-source-release.zip <
 > maven-release-2.4.2-source-release.zip.asc <
 > maven-release-2.4.2-source-release.zip.md5 <

[JENKINS] Archiving site from <https://builds.apache.org/job/dist-tool-plugin/ws/target/site>
to /home/hudson/hudson/jobs/dist-tool-plugin/site
Oct 29, 2013 10:07:31 AM org.apache.maven.cli.event.ExecutionEventLogger logResult
INFO: ------------------------------------------------------------------------
Oct 29, 2013 10:07:31 AM org.apache.maven.cli.event.ExecutionEventLogger logResult
INFO: BUILD FAILURE
Oct 29, 2013 10:07:31 AM org.apache.maven.cli.event.ExecutionEventLogger logStats
INFO: ------------------------------------------------------------------------
Oct 29, 2013 10:07:31 AM org.apache.maven.cli.event.ExecutionEventLogger logStats
INFO: Total time: 5:29.646s
Oct 29, 2013 10:07:31 AM org.apache.maven.cli.event.ExecutionEventLogger logStats
INFO: Finished at: Tue Oct 29 10:07:31 UTC 2013
Oct 29, 2013 10:07:31 AM org.apache.maven.cli.event.ExecutionEventLogger logStats
INFO: Final Memory: 59M/431M
Oct 29, 2013 10:07:31 AM org.apache.maven.cli.event.ExecutionEventLogger sessionEnded
INFO: ------------------------------------------------------------------------
[JENKINS] Archiving <https://builds.apache.org/job/dist-tool-plugin/ws/pom.xml> to /home/hudson/hudson/jobs/dist-tool-plugin/modules/org.apache.maven.dist.tools$dist-tool-plugin/builds/2013-10-29_10-01-53/archive/org.apache.maven.dist.tools/dist-tool-plugin/0.0.1-SNAPSHOT/dist-tool-plugin-0.0.1-SNAPSHOT.pom
[JENKINS] Archiving <https://builds.apache.org/job/dist-tool-plugin/ws/target/dist-tool-plugin-0.0.1-SNAPSHOT.jar>
to /home/hudson/hudson/jobs/dist-tool-plugin/modules/org.apache.maven.dist.tools$dist-tool-plugin/builds/2013-10-29_10-01-53/archive/org.apache.maven.dist.tools/dist-tool-plugin/0.0.1-SNAPSHOT/dist-tool-plugin-0.0.1-SNAPSHOT.jar
Waiting for Jenkins to finish collecting data
Sending e-mails to: notifications@maven.apache.org
channel stopped

Mime
View raw message