maven-notifications mailing list archives

Site index · List index
Message view « Date » · « Thread »
Top « Date » · « Thread »
From Apache Jenkins Server <jenk...@builds.apache.org>
Subject Build failed in Jenkins: dist-tool-plugin #273
Date Wed, 30 Oct 2013 09:56:43 GMT
See <https://builds.apache.org/job/dist-tool-plugin/273/>

------------------------------------------
[...truncated 438 lines...]
Generating <https://builds.apache.org/job/dist-tool-plugin/ws/target/site/apidocs/org/apache/maven/dist/tools/checkers/StylusRightHTMLChecker.html...>
Generating <https://builds.apache.org/job/dist-tool-plugin/ws/target/site/apidocs/overview-frame.html...>
Generating <https://builds.apache.org/job/dist-tool-plugin/ws/target/site/apidocs/org/apache/maven/dist/tools/package-frame.html...>
Generating <https://builds.apache.org/job/dist-tool-plugin/ws/target/site/apidocs/org/apache/maven/dist/tools/package-summary.html...>
Generating <https://builds.apache.org/job/dist-tool-plugin/ws/target/site/apidocs/org/apache/maven/dist/tools/package-tree.html...>
Generating <https://builds.apache.org/job/dist-tool-plugin/ws/target/site/apidocs/org/apache/maven/dist/tools/checkers/package-frame.html...>
Generating <https://builds.apache.org/job/dist-tool-plugin/ws/target/site/apidocs/org/apache/maven/dist/tools/checkers/package-summary.html...>
Generating <https://builds.apache.org/job/dist-tool-plugin/ws/target/site/apidocs/org/apache/maven/dist/tools/checkers/package-tree.html...>
Generating <https://builds.apache.org/job/dist-tool-plugin/ws/target/site/apidocs/constant-values.html...>
Generating <https://builds.apache.org/job/dist-tool-plugin/ws/target/site/apidocs/org/apache/maven/dist/tools/class-use/DummyFailureMojo.html...>
Generating <https://builds.apache.org/job/dist-tool-plugin/ws/target/site/apidocs/org/apache/maven/dist/tools/class-use/HelpMojo.html...>
Generating <https://builds.apache.org/job/dist-tool-plugin/ws/target/site/apidocs/org/apache/maven/dist/tools/class-use/DistCheckAggregatorsSiteMojo.html...>
Generating <https://builds.apache.org/job/dist-tool-plugin/ws/target/site/apidocs/org/apache/maven/dist/tools/class-use/AbstractDistCheckMojo.html...>
Generating <https://builds.apache.org/job/dist-tool-plugin/ws/target/site/apidocs/org/apache/maven/dist/tools/class-use/DistCheckSourceReleaseMojo.html...>
Generating <https://builds.apache.org/job/dist-tool-plugin/ws/target/site/apidocs/org/apache/maven/dist/tools/class-use/DistCheckSiteMojo.html...>
Generating <https://builds.apache.org/job/dist-tool-plugin/ws/target/site/apidocs/org/apache/maven/dist/tools/checkers/class-use/StylusRightHTMLChecker.html...>
Generating <https://builds.apache.org/job/dist-tool-plugin/ws/target/site/apidocs/org/apache/maven/dist/tools/checkers/class-use/HTMLChecker.html...>
Generating <https://builds.apache.org/job/dist-tool-plugin/ws/target/site/apidocs/org/apache/maven/dist/tools/checkers/class-use/StylusLeftHTMLChecker.html...>
Generating <https://builds.apache.org/job/dist-tool-plugin/ws/target/site/apidocs/org/apache/maven/dist/tools/checkers/class-use/FluidoHTMLChecker.html...>
Generating <https://builds.apache.org/job/dist-tool-plugin/ws/target/site/apidocs/org/apache/maven/dist/tools/checkers/class-use/HTMLCheckerFactory.html...>
Generating <https://builds.apache.org/job/dist-tool-plugin/ws/target/site/apidocs/org/apache/maven/dist/tools/package-use.html...>
Generating <https://builds.apache.org/job/dist-tool-plugin/ws/target/site/apidocs/org/apache/maven/dist/tools/checkers/package-use.html...>
Building index for all the packages and classes...
Generating <https://builds.apache.org/job/dist-tool-plugin/ws/target/site/apidocs/overview-tree.html...>
Generating <https://builds.apache.org/job/dist-tool-plugin/ws/target/site/apidocs/index-all.html...>
Generating <https://builds.apache.org/job/dist-tool-plugin/ws/target/site/apidocs/deprecated-list.html...>
Building index for all classes...
Generating <https://builds.apache.org/job/dist-tool-plugin/ws/target/site/apidocs/allclasses-frame.html...>
Generating <https://builds.apache.org/job/dist-tool-plugin/ws/target/site/apidocs/allclasses-noframe.html...>
Generating <https://builds.apache.org/job/dist-tool-plugin/ws/target/site/apidocs/index.html...>
Generating <https://builds.apache.org/job/dist-tool-plugin/ws/target/site/apidocs/overview-summary.html...>
Generating <https://builds.apache.org/job/dist-tool-plugin/ws/target/site/apidocs/help-doc.html...>
Note: Custom tags that could override future standard tags:  @requiresDependencyResolution,
@requiresReports, @execute, @configurator, @aggregator, @instantiationStrategy, @threadSafe,
@executionStrategy, @goal, @requiresOnline, @parameter, @requiresDirectInvocation, @component,
@inheritByDefault, @requiresProject, @required, @readonly, @phase, @requiresDependencyCollection.
To avoid potential overrides, use at least one period character (.) in custom tag names.
4 warnings
[WARNING] Javadoc Warnings
[WARNING] javadoc: warning - Error fetching URL: http://commons.apache.org/collections/apidocs-COLLECTIONS_3_0/package-list
[WARNING] <https://builds.apache.org/job/dist-tool-plugin/ws/target/generated-sources/plugin/org/apache/maven/dist/tools/HelpMojo.java>:30:
warning - @author tag has no arguments.
[WARNING] <https://builds.apache.org/job/dist-tool-plugin/ws/target/generated-sources/plugin/org/apache/maven/dist/tools/HelpMojo.java>:30:
warning - @version tag has no arguments.
[WARNING] <https://builds.apache.org/job/dist-tool-plugin/ws/src/main/java/org/apache/maven/dist/tools/AbstractDistCheckMojo.java>:104:
warning - @return tag has no arguments.
[INFO] Generating "Test JavaDocs" report    --- maven-javadoc-plugin:2.9
[ERROR] Error fetching link: http://www.eclipse.org/aether/aether-api/apidocs/package-list.
Ignored it.
[ERROR] Error fetching link: http://www.eclipse.org/aether/aether-util/apidocs/package-list.
Ignored it.
[ERROR] Error fetching link: http://xml.apache.org/commons/components/external/apidocs/package-list.
Ignored it.
[ERROR] Error fetching link: http://selenium.googlecode.com/selenium-firefox-driver/apidocs/package-list.
Ignored it.
[ERROR] Error fetching link: http://junit.org/apidocs/package-list. Ignored it.
[ERROR] Error fetching link: http://hc.apache.org/httpcomponents-client/apidocs/package-list.
Ignored it.
[INFO] 
Loading source files for package org.apache.maven.dist.tools...
Constructing Javadoc information...
Registered Taglet org.apache.maven.tools.plugin.javadoc.MojoRequiresDirectInvocationTypeTaglet
...
Registered Taglet org.apache.maven.tools.plugin.javadoc.MojoParameterFieldTaglet ...
Registered Taglet org.apache.maven.tools.plugin.javadoc.MojoGoalTypeTaglet ...
Registered Taglet org.apache.maven.tools.plugin.javadoc.MojoInheritByDefaultTypeTaglet ...
Registered Taglet org.apache.maven.tools.plugin.javadoc.MojoExecuteTypeTaglet ...
Registered Taglet org.apache.maven.tools.plugin.javadoc.MojoRequiresDependencyCollectionTypeTaglet
...
Registered Taglet org.apache.maven.tools.plugin.javadoc.MojoConfiguratorTypeTaglet ...
Registered Taglet org.apache.maven.tools.plugin.javadoc.MojoRequiresDependencyResolutionTypeTaglet
...
Registered Taglet org.apache.maven.tools.plugin.javadoc.MojoRequiresReportsTypeTaglet ...
Registered Taglet org.apache.maven.tools.plugin.javadoc.MojoThreadSafeTypeTaglet ...
Registered Taglet org.apache.maven.tools.plugin.javadoc.MojoAggregatorTypeTaglet ...
Registered Taglet org.apache.maven.tools.plugin.javadoc.MojoRequiresOnLineTypeTaglet ...
Registered Taglet org.apache.maven.tools.plugin.javadoc.MojoRequiredFieldTaglet ...
Registered Taglet org.apache.maven.tools.plugin.javadoc.MojoPhaseTypeTaglet ...
Registered Taglet org.apache.maven.tools.plugin.javadoc.MojoReadOnlyFieldTaglet ...
Registered Taglet org.apache.maven.tools.plugin.javadoc.MojoComponentFieldTaglet ...
Registered Taglet org.apache.maven.tools.plugin.javadoc.MojoInstantiationStrategyTypeTaglet
...
Registered Taglet org.apache.maven.tools.plugin.javadoc.MojoRequiresProjectTypeTaglet ...
Registered Taglet org.apache.maven.tools.plugin.javadoc.MojoExecutionStrategyTypeTaglet ...
Registered Taglet org.codehaus.plexus.javadoc.PlexusConfigurationTaglet ...
Registered Taglet org.codehaus.plexus.javadoc.PlexusRequirementTaglet ...
Registered Taglet org.codehaus.plexus.javadoc.PlexusComponentTaglet ...
Standard Doclet version 1.7.0_25
Building tree for all the packages and classes...
Generating <https://builds.apache.org/job/dist-tool-plugin/ws/target/site/testapidocs/org/apache/maven/dist/tools/PatternTest.html...>
Generating <https://builds.apache.org/job/dist-tool-plugin/ws/target/site/testapidocs/org/apache/maven/dist/tools/package-frame.html...>
Generating <https://builds.apache.org/job/dist-tool-plugin/ws/target/site/testapidocs/org/apache/maven/dist/tools/package-summary.html...>
Generating <https://builds.apache.org/job/dist-tool-plugin/ws/target/site/testapidocs/org/apache/maven/dist/tools/package-tree.html...>
Generating <https://builds.apache.org/job/dist-tool-plugin/ws/target/site/testapidocs/constant-values.html...>
Generating <https://builds.apache.org/job/dist-tool-plugin/ws/target/site/testapidocs/org/apache/maven/dist/tools/class-use/PatternTest.html...>
Generating <https://builds.apache.org/job/dist-tool-plugin/ws/target/site/testapidocs/org/apache/maven/dist/tools/package-use.html...>
Building index for all the packages and classes...
Generating <https://builds.apache.org/job/dist-tool-plugin/ws/target/site/testapidocs/overview-tree.html...>
Generating <https://builds.apache.org/job/dist-tool-plugin/ws/target/site/testapidocs/index-all.html...>
Generating <https://builds.apache.org/job/dist-tool-plugin/ws/target/site/testapidocs/deprecated-list.html...>
Building index for all classes...
Generating <https://builds.apache.org/job/dist-tool-plugin/ws/target/site/testapidocs/allclasses-frame.html...>
Generating <https://builds.apache.org/job/dist-tool-plugin/ws/target/site/testapidocs/allclasses-noframe.html...>
Generating <https://builds.apache.org/job/dist-tool-plugin/ws/target/site/testapidocs/index.html...>
Generating <https://builds.apache.org/job/dist-tool-plugin/ws/target/site/testapidocs/help-doc.html...>
Note: Custom tags that could override future standard tags:  @requiresDependencyResolution,
@requiresReports, @execute, @configurator, @aggregator, @instantiationStrategy, @threadSafe,
@executionStrategy, @goal, @requiresOnline, @parameter, @requiresDirectInvocation, @component,
@inheritByDefault, @requiresProject, @required, @readonly, @phase, @requiresDependencyCollection.
To avoid potential overrides, use at least one period character (.) in custom tag names.
Note: Custom tags that were not seen:  @plexus.requirement, @parameter, @component, @plexus.configuration,
@required, @readonly
1 warning
[WARNING] Javadoc Warnings
[WARNING] javadoc: warning - Error fetching URL: http://commons.apache.org/collections/apidocs-COLLECTIONS_3_0/package-list
[INFO] Generating "FindBugs Report" report    --- findbugs-maven-plugin:2.5.2
[INFO] Locale is en
[INFO] Fork Value is true
     [java] The following classes needed for analysis were missing:
     [java]   org.apache.maven.artifact.repository.Authentication
     [java]   org.apache.maven.repository.Proxy
     [java] Warnings generated: 15
[INFO] Done FindBugs Analysis....
[warn] [XHTML Sink] Modified invalid anchor name: 'org.apache.maven.dist.tools.DistCheckSiteMojo$DistCheckSiteResult'
to 'org.apache.maven.dist.tools.DistCheckSiteMojoDistCheckSiteResult'
[INFO] Generating "Sonar" report    --- maven-report:0.1
[INFO] Generating "Disttool> Sites" report    --- dist-tool-plugin:0.0.1-SNAPSHOT
[INFO] ## line format:
[INFO] ## directory groupId [src+bin]
[INFO] ##   artifactId [forced version] An
[INFO] ##    artifactId [forced version] An
[INFO] ## n : 1 plugins
[INFO] ## n : 2 shared
[INFO] ## n : 3 skins
[INFO] ## n : 4 poms
[INFO] #### A1 site2X 
[INFO] #### A4 ASF (skin and parent find pattern hardcoded)
[INFO] ## binaries
[INFO] ##  doxia-book-maven-plugin
[INFO] ##  doxia-book-renderer
[WARNING] HTTP result code: 404 for maven-indexer site = http://maven.apache.org/maven-indexer-archives/maven-indexer-5.1.1
[INFO] ## maven-1
[INFO] org.apache.maven:apache-maven metadata latest version value is 3.1.1 but check was
manually set to 2.0.11
[WARNING] HTTP result code: 404 for apache-maven site = http://maven.apache.org/apache-maven
[INFO] org.apache.maven:apache-maven metadata latest version value is 3.1.1 but check was
manually set to 2.2.1
[WARNING] HTTP result code: 404 for apache-maven site = http://maven.apache.org/apache-maven
[INFO] org.apache.maven:apache-maven metadata latest version value is 3.1.1 but check was
manually set to 3.0.5
[INFO] org.apache.maven.release:maven-release metadata latest version value is 5 but check
was manually set to 2.4.1
[WARNING] HTTP result code: 404 for file-management site = http://maven.apache.org/shared/file-management/
[INFO] Generating "Disttool> Source Release" report    --- dist-tool-plugin:0.0.1-SNAPSHOT
[INFO] ## line format:
[INFO] ## directory groupId [src+bin]
[INFO] ##   artifactId [forced version] An
[INFO] ##    artifactId [forced version] An
[INFO] ## n : 1 plugins
[INFO] ## n : 2 shared
[INFO] ## n : 3 skins
[INFO] ## n : 4 poms
[INFO] #### A1 site2X 
[INFO] #### A4 ASF (skin and parent find pattern hardcoded)
[INFO] ## binaries
[INFO] ##  doxia-book-maven-plugin
[INFO] ##  doxia-book-renderer
[WARNING] Missing file for doxia-linkcheck in http://repo.maven.apache.org/maven2/org/apache/maven/doxia/doxia-linkcheck/1.2
[WARNING]  > doxia-linkcheck-1.2-source-release.zip <
[WARNING]  > doxia-linkcheck-1.2-source-release.zip.asc <
[WARNING]  > doxia-linkcheck-1.2-source-release.zip.md5 <
[WARNING] Missing file for doxia-linkcheck in http://www.apache.org/dist/maven/doxia
[WARNING]  > doxia-linkcheck-1.2-source-release.zip <
[WARNING]  > doxia-linkcheck-1.2-source-release.zip.asc <
[WARNING]  > doxia-linkcheck-1.2-source-release.zip.md5 <
[INFO] ## maven-1
[INFO] org.apache.maven:apache-maven metadata latest version value is 3.1.1 but check was
manually set to 2.0.11
[WARNING] Missing file for apache-maven in http://repo.maven.apache.org/maven2/org/apache/maven/apache-maven/2.0.11
[WARNING]  > apache-maven-2.0.11-src.zip <
[WARNING]  > apache-maven-2.0.11-src.zip.asc <
[WARNING]  > apache-maven-2.0.11-src.zip.md5 <
[INFO] org.apache.maven:apache-maven metadata latest version value is 3.1.1 but check was
manually set to 2.2.1
[INFO] org.apache.maven:apache-maven metadata latest version value is 3.1.1 but check was
manually set to 3.0.5
[WARNING] Missing file for maven-docck-plugin in http://repo.maven.apache.org/maven2/org/apache/maven/plugins/maven-docck-plugin/1.0
[WARNING]  > maven-docck-plugin-1.0-source-release.zip <
[WARNING]  > maven-docck-plugin-1.0-source-release.zip.asc <
[WARNING]  > maven-docck-plugin-1.0-source-release.zip.md5 <
[WARNING] Missing file for maven-docck-plugin in http://www.apache.org/dist/maven/plugins
[WARNING]  > maven-docck-plugin-1.0-source-release.zip <
[WARNING]  > maven-docck-plugin-1.0-source-release.zip.asc <
[WARNING]  > maven-docck-plugin-1.0-source-release.zip.md5 <
[WARNING] Missing file for maven-reactor-plugin in http://repo.maven.apache.org/maven2/org/apache/maven/plugins/maven-reactor-plugin/1.0
[WARNING]  > maven-reactor-plugin-1.0-source-release.zip <
[WARNING]  > maven-reactor-plugin-1.0-source-release.zip.asc <
[WARNING]  > maven-reactor-plugin-1.0-source-release.zip.md5 <
[WARNING] Missing file for maven-reactor-plugin in http://www.apache.org/dist/maven/plugins
[WARNING]  > maven-reactor-plugin-1.0-source-release.zip <
[WARNING]  > maven-reactor-plugin-1.0-source-release.zip.asc <
[WARNING]  > maven-reactor-plugin-1.0-source-release.zip.md5 <
[INFO] org.apache.maven.release:maven-release metadata latest version value is 5 but check
was manually set to 2.4.1
[ERROR] Missing file for maven-release in http://www.apache.org/dist/maven/release
[ERROR]  > maven-release-2.4.1-source-release.zip <
[ERROR]  > maven-release-2.4.1-source-release.zip.asc <
[ERROR]  > maven-release-2.4.1-source-release.zip.md5 <
[ERROR] Older version than 2.4.1 for maven-release still available in http://www.apache.org/dist/maven/release
[ERROR]  > maven-release-2.4.2-source-release.zip <
[ERROR]  > maven-release-2.4.2-source-release.zip.asc <
[ERROR]  > maven-release-2.4.2-source-release.zip.md5 <
[WARNING] Missing file for file-management in http://repo.maven.apache.org/maven2/org/apache/maven/shared/file-management/1.2.1
[WARNING]  > file-management-1.2.1-source-release.zip <
[WARNING]  > file-management-1.2.1-source-release.zip.asc <
[WARNING]  > file-management-1.2.1-source-release.zip.md5 <
[WARNING] Missing file for file-management in http://www.apache.org/dist/maven/shared
[WARNING]  > file-management-1.2.1-source-release.zip <
[WARNING]  > file-management-1.2.1-source-release.zip.asc <
[WARNING]  > file-management-1.2.1-source-release.zip.md5 <
[WARNING] Missing file for maven-repository-builder in http://repo.maven.apache.org/maven2/org/apache/maven/shared/maven-repository-builder/1.0-alpha-2
[WARNING]  > maven-repository-builder-1.0-alpha-2-source-release.zip <
[WARNING]  > maven-repository-builder-1.0-alpha-2-source-release.zip.asc <
[WARNING]  > maven-repository-builder-1.0-alpha-2-source-release.zip.md5 <
[WARNING] Missing file for maven-repository-builder in http://www.apache.org/dist/maven/shared
[WARNING]  > maven-repository-builder-1.0-alpha-2-source-release.zip <
[WARNING]  > maven-repository-builder-1.0-alpha-2-source-release.zip.asc <
[WARNING]  > maven-repository-builder-1.0-alpha-2-source-release.zip.md5 <
[INFO] Generating "Disttool> Aggregator Check" report    --- dist-tool-plugin:0.0.1-SNAPSHOT
[INFO] ## line format:
[INFO] ## directory groupId [src+bin]
[INFO] ##   artifactId [forced version] An
[INFO] ##    artifactId [forced version] An
[INFO] ## n : 1 plugins
[INFO] ## n : 2 shared
[INFO] ## n : 3 skins
[INFO] ## n : 4 poms
[INFO] #### A1 site2X 
[INFO] #### A4 ASF (skin and parent find pattern hardcoded)
[INFO] ## binaries
[INFO] ##  doxia-book-maven-plugin
[INFO] ##  doxia-book-renderer
[INFO] ## maven-1
[INFO] org.apache.maven:apache-maven metadata latest version value is 3.1.1 but check was
manually set to 2.0.11
[INFO] org.apache.maven:apache-maven metadata latest version value is 3.1.1 but check was
manually set to 2.2.1
[INFO] org.apache.maven:apache-maven metadata latest version value is 3.1.1 but check was
manually set to 3.0.5
[INFO] org.apache.maven.plugins:maven-release-plugin metadata latest version value is 2.4.2
but check was manually set to 2.4.1
[INFO] org.apache.maven.release:maven-release metadata latest version value is 5 but check
was manually set to 2.4.1
[INFO] Generating "Failure Hack" report    --- dist-tool-plugin:0.0.1-SNAPSHOT
[ERROR] check-source-release.log error log not empty:
Missing file for maven-release in http://www.apache.org/dist/maven/release
 > maven-release-2.4.1-source-release.zip <
 > maven-release-2.4.1-source-release.zip.asc <
 > maven-release-2.4.1-source-release.zip.md5 <
Older version than 2.4.1 for maven-release still available in http://www.apache.org/dist/maven/release
 > maven-release-2.4.2-source-release.zip <
 > maven-release-2.4.2-source-release.zip.asc <
 > maven-release-2.4.2-source-release.zip.md5 <

[JENKINS] Archiving site from <https://builds.apache.org/job/dist-tool-plugin/ws/target/site>
to /home/hudson/hudson/jobs/dist-tool-plugin/site
Oct 30, 2013 9:56:37 AM org.apache.maven.cli.event.ExecutionEventLogger logResult
INFO: ------------------------------------------------------------------------
Oct 30, 2013 9:56:37 AM org.apache.maven.cli.event.ExecutionEventLogger logResult
INFO: BUILD FAILURE
Oct 30, 2013 9:56:37 AM org.apache.maven.cli.event.ExecutionEventLogger logStats
INFO: ------------------------------------------------------------------------
Oct 30, 2013 9:56:37 AM org.apache.maven.cli.event.ExecutionEventLogger logStats
INFO: Total time: 3:32.643s
Oct 30, 2013 9:56:37 AM org.apache.maven.cli.event.ExecutionEventLogger logStats
INFO: Finished at: Wed Oct 30 09:56:37 UTC 2013
Oct 30, 2013 9:56:37 AM org.apache.maven.cli.event.ExecutionEventLogger logStats
INFO: Final Memory: 60M/428M
Oct 30, 2013 9:56:37 AM org.apache.maven.cli.event.ExecutionEventLogger sessionEnded
INFO: ------------------------------------------------------------------------
[JENKINS] Archiving <https://builds.apache.org/job/dist-tool-plugin/ws/pom.xml> to /home/hudson/hudson/jobs/dist-tool-plugin/modules/org.apache.maven.dist.tools$dist-tool-plugin/builds/2013-10-30_09-52-51/archive/org.apache.maven.dist.tools/dist-tool-plugin/0.0.1-SNAPSHOT/dist-tool-plugin-0.0.1-SNAPSHOT.pom
[JENKINS] Archiving <https://builds.apache.org/job/dist-tool-plugin/ws/target/dist-tool-plugin-0.0.1-SNAPSHOT.jar>
to /home/hudson/hudson/jobs/dist-tool-plugin/modules/org.apache.maven.dist.tools$dist-tool-plugin/builds/2013-10-30_09-52-51/archive/org.apache.maven.dist.tools/dist-tool-plugin/0.0.1-SNAPSHOT/dist-tool-plugin-0.0.1-SNAPSHOT.jar
Waiting for Jenkins to finish collecting data
Sending e-mails to: notifications@maven.apache.org
channel stopped

Mime
View raw message