maven-notifications mailing list archives

Site index · List index
Message view « Date » · « Thread »
Top « Date » · « Thread »
From Apache Jenkins Server <jenk...@builds.apache.org>
Subject Build failed in Jenkins: core-it-maven-3-win #448
Date Sun, 27 Oct 2013 11:14:31 GMT
See <https://builds.apache.org/job/core-it-maven-3-win/448/>

------------------------------------------
[...truncated 8311 lines...]
mng1088ReactorPluginResolution(itMNG1088)...................OK (2.1 s)
mng1073AggregatorForksReactor(itForkLifecycle)..............OK (2.2 s)
mng1073AggregatorForksReactor(itForkGoal)...................OK (2.5 s)
mng1052PluginMngtConfig(itMNG1052)..........................OK (1.9 s)
mng1021EqualAttachmentBuildNumber(itMNG1021)................OK (2.3 s)
mng0985NonExecutedPluginMngtGoals(itMNG0985)................OK (1.8 s)
mng0956ComponentInjectionViaProjectLevelPluginDep(itMNG0956)OK (2.7 s)
mng0947OptionalDependency(it)...............................OK (2.6 s)
mng0870ReactorAwarePluginDiscovery(itMNG0870)...............OK (2.4 s)
mng0866EvaluateDefaultValue(itMNG866).......................OK (2.0 s)
mng0848SystemPropOverridesDefaultValue(itMNG848)............OK (2.0 s)
mng0836PluginParentResolution(itMNG836).....................OK (2.2 s)
mng0823MojoContextPassing(itMNG0823)........................OK (2.3 s)
mng0820ConflictResolution(itMNG0820)........................OK (2.4 s)
mng0818WarDepsNotTransitive(itMNG0818)......................OK (2.5 s)
mng0814ExplicitProfileActivation(itMNG814)..................OK (2.5 s)
mng0786ProfileAwareReactor(itMNG0786).......................OK (2.0 s)
mng0781PluginConfigVsExecConfig(itMNG0781)..................OK (1.9 s)
mng0773SettingsProfileReactorPollution(itMNG773)............OK (1.7 s)
mng0768OfflineMode(itMNG768)................................OK (7.3 s)
mng0761MissingSnapshotDistRepo(itMNG761)....................OK (2.2 s)
mng0731LegacyRepoLayout(itMNG731)...........................SKIPPED - Maven version 3.1.2-SNAPSHOT
not in range [2.0,3.0-alpha-3)
mng0680ParentBasedir(itMNG680)..............................OK (2.0 s)
mng0674PluginParameterAlias(itLifecycle)....................OK (2.1 s)
mng0674PluginParameterAlias(itCli)..........................OK (2.2 s)
mng0666IgnoreLegacyPom(itMNG666)............................OK (2.4 s)
mng0557UserSettingsCliOption(itMNG557)......................OK (2.1 s)
mng0553SettingsAuthzEncryption(itBasic).....................OK (2.8 s)
mng0553SettingsAuthzEncryption(itRelocation)................OK (2.9 s)
mng0553SettingsAuthzEncryption(itEncryption)................OK (3.7 s)
mng0522InheritedPluginMgmtConfig(itMNG522)..................OK (2.1 s)
mng0507ArtifactRelocation(itMNG507).........................OK (2.8 s)
mng0505VersionRange(itMNG505)...............................OK (2.6 s)
mng0496IgnoreUnknownPluginParameters(itMNG496)..............OK (2.0 s)
mng0479OverrideCentralRepo(itModel).........................OK (3.8 s)
mng0479OverrideCentralRepo(itResolution)....................OK (8.4 s)
mng0471CustomLifecycle(itMNG471)............................OK (2.1 s)
mng0469ReportConfig(itReportConfigOverridesBuildDefaults)...SKIPPED - Maven version 3.1.2-SNAPSHOT
not in range [2.0.0,3.0-alpha-1)
mng0469ReportConfig(itBuildConfigDominantDuringBuild).......OK (1.9 s)
mng0469ReportConfig(itBuildConfigIrrelevantForReports)......OK (1.9 s)
mng0461TolerateMissingDependencyPom(it).....................OK (2.3 s)
mng0449PluginVersionResolution(itLifecycleInvocation).......OK (2.3 s)
mng0449PluginVersionResolution(itCliInvocation).............OK (2.1 s)
mng0377PluginLookupFromPrefix(itMNG377).....................OK (3.6 s)
mng0294MergeGlobalAndUserSettings(itMNG294).................OK (3.5 s)
mng0282NonReactorExecWhenProjectIndependent(itMNG282).......OK (2.2 s)
mng0249ResolveDepsFromReactor(itMNG0249)....................OK (2.6 s)
mng0187CollectedProjects(it)................................OK (2.0 s)
mng0095ReactorFailureBehavior(itFailFast)...................OK (2.0 s)
mng0095ReactorFailureBehavior(itFailNever)..................OK (2.0 s)
mng0095ReactorFailureBehavior(itFailAtEnd)..................OK (2.0 s)
0145ReactorWithIncludesExcludes(itDefaultIncludesExcludes)..SKIPPED - Maven version 3.1.2-SNAPSHOT
not in range [2.0,3.0-alpha-1)
0145ReactorWithIncludesExcludes(itCustomIncludes)...........SKIPPED - Maven version 3.1.2-SNAPSHOT
not in range [2.0,3.0-alpha-1)
0145ReactorWithIncludesExcludes(itCustomExcludes)...........SKIPPED - Maven version 3.1.2-SNAPSHOT
not in range [2.0,3.0-alpha-1)
0144LifecycleExecutionOrder(it0144).........................OK (3.2 s)
0143TransitiveDependencyScopes(itCompileScope)..............OK (2.8 s)
0143TransitiveDependencyScopes(itProvidedScope).............OK (2.6 s)
0143TransitiveDependencyScopes(itRuntimeScope)..............OK (2.4 s)
0143TransitiveDependencyScopes(itTestScope).................OK (2.3 s)
0142DirectDependencyScopes(it0142)..........................OK (2.7 s)
0140InterpolationWithPomPrefix(it0140)......................OK (2.2 s)
0139InterpolationWithProjectPrefix(it0139)..................OK (1.9 s)
0138PluginLifecycle(it0138).................................OK (2.3 s)
0137EarLifecycle(it0137)....................................OK (2.1 s)
0136RarLifecycle(it0136)....................................OK (2.4 s)
0135EjbLifecycle(it0135)....................................OK (2.6 s)
0134WarLifecycle(it0134)....................................OK (2.7 s)
0133JarLifecycle(it0133)....................................OK (2.2 s)
0132PomLifecycle(it0132)....................................OK (2.0 s)
0131SiteLifecycle(it0131)...................................OK (1.9 s)
0130CleanLifecycle(it0130)..................................OK (1.9 s)
0113ServerAuthzAvailableToWagonMgrInPlugin(it0113)..........OK (2.5 s)
0090EnvVarInterpolation(it0090).............................OK (2.0 s)
0087PluginRealmWithProjectLevelDeps(it0087).................OK (2.4 s)
0086PluginRealm(it0086).....................................OK (1.9 s)
0085TransitiveSystemScope(it0085)...........................OK (2.3 s)
0072InterpolationWithDottedProperty(it0072).................OK (1.9 s)
0071PluginConfigWithDottedProperty(it0071)..................OK (1.9 s)
0064MojoConfigViaSetters(it0064)............................OK (2.0 s)
0063SystemScopeDependency(it0063)...........................OK (2.1 s)
0056MultipleGoalExecutions(it0056)..........................OK (1.8 s)
0052ReleaseProfile(it0052)..................................OK (2.1 s)
0051ReleaseProfile(it0051)..................................OK (2.4 s)
0041ArtifactTypeFromPluginExtension(it0041).................OK (3.0 s)
0040PackagingFromPluginExtension(it0040)....................OK (1.9 s)
0039ReleasePomInReactor(it0039).............................SKIPPED - Maven version 3.1.2-SNAPSHOT
not in range [2.0,3.0-alpha-1)
0038AlternatePomFileDifferentDir(it0038)....................OK (1.9 s)
0037AlternatePomFileSameDir(it0037).........................OK (1.9 s)
0036ReleasePom(it0036)......................................SKIPPED - Maven version 3.1.2-SNAPSHOT
not in range (2.0,3.0-alpha-1)
0032MavenPrerequisite(it0032)...............................OK (1.8 s)
0030DepPomDepMngtInheritance(it0030)........................OK (7.6 s)
0025MultipleExecutionLevelConfigs(it0025)...................OK (3.3 s)
0024MultipleGoalExecutions(it0024)..........................OK (2.0 s)
0023SettingsProfile(it0023).................................OK (2.1 s)
0021PomProfile(it0021)......................................OK (3.1 s)
0019PluginVersionMngtBySuperPom(it0019).....................OK (2.9 s)
0018DependencyManagement(it0018)............................OK (2.5 s)
0012PomInterpolation(it0012)................................OK (2.2 s)
0011DefaultVersionByDependencyManagement(it0011)............OK (2.7 s)
0010DependencyClosureResolution(it0010).....................OK (2.5 s)
0009GoalConfiguration(it0009)...............................OK (2.0 s)
0008SimplePlugin(it0008)....................................OK (2.3 s)
Tests run: 718, Failures: 0, Errors: 1, Skipped: 0, Time elapsed: 2,116.231 sec <<<
FAILURE!
testit(org.apache.maven.it.MavenITmng4625SettingsXmlInterpolationWithXmlMarkupTest)  Time
elapsed: 0.08 sec  <<< ERROR!
org.apache.maven.it.VerificationException: Exit code was non-zero: 1; command line and log
= 
<https://builds.apache.org/job/core-it-maven-3-win/ws/apache-maven-3-SNAPSHOT\bin\mvn>
--global-settings F:\ws\m3-its\core-integration-testing-trunk\core-it-suite\target\test-classes\settings.xml
--settings settings.xml -e --batch-mode -Dtest.prop=&x=y<> -Dmaven.repo.local=<https://builds.apache.org/job/core-it-maven-3-win/ws/it-local-repo>
validate
> was unexpected at this time.

	at org.apache.maven.it.Verifier.executeGoals(Verifier.java:1384)
	at org.apache.maven.it.Verifier.executeGoal(Verifier.java:1228)
	at org.apache.maven.it.Verifier.executeGoal(Verifier.java:1222)
	at org.apache.maven.it.MavenITmng4625SettingsXmlInterpolationWithXmlMarkupTest.testit(MavenITmng4625SettingsXmlInterpolationWithXmlMarkupTest.java:57)


Results :

Tests in error: 
  MavenITmng4625SettingsXmlInterpolationWithXmlMarkupTest>AbstractMavenIntegrationTestCase.runTest:220->testit:57
ยป Verification

Tests run: 718, Failures: 0, Errors: 1, Skipped: 0

[INFO] ------------------------------------------------------------------------
[INFO] Reactor Summary:
[INFO] 
[INFO] Maven Core ITs .................................... SUCCESS [29.670s]
[INFO] Maven IT Support .................................. SUCCESS [0.134s]
[INFO] Maven IT :: Plugins ............................... SUCCESS [0.149s]
[INFO] Maven IT Plugin :: Active Collection .............. SUCCESS [12.481s]
[INFO] Maven IT Plugin :: Ant-Based ...................... SUCCESS [10.397s]
[INFO] Maven IT Plugin :: Artifact ....................... SUCCESS [3.329s]
[INFO] Maven IT Plugin :: Class Loader :: Dependency A ... SUCCESS [0.198s]
[INFO] Maven IT Plugin :: Class Loader :: Dependency B ... SUCCESS [0.204s]
[INFO] Maven IT Plugin :: Class Loader :: Dependency C ... SUCCESS [0.144s]
[INFO] Maven IT Plugin :: Class Loader ................... SUCCESS [3.212s]
[INFO] Maven IT Plugin :: Class Loader :: Aggregator ..... SUCCESS [0.043s]
[INFO] Maven IT Plugin :: Configuration .................. SUCCESS [0.652s]
[INFO] Maven IT Plugin :: Context Passing ................ SUCCESS [0.429s]
[INFO] Maven ITs :: Core Plugin Stubs .................... SUCCESS [0.074s]
[INFO] Maven IT Clean Plugin Stub ........................ SUCCESS [0.205s]
[INFO] Maven IT Compiler Plugin Stub ..................... SUCCESS [0.230s]
[INFO] Maven IT Deploy Plugin Stub ....................... SUCCESS [0.222s]
[INFO] Maven IT EAR Plugin Stub .......................... SUCCESS [0.220s]
[INFO] Maven IT EJB Plugin Stub .......................... SUCCESS [0.381s]
[INFO] Maven IT Install Plugin Stub ...................... SUCCESS [0.208s]
[INFO] Maven IT JAR Plugin Stub .......................... SUCCESS [0.282s]
[INFO] Maven IT Javadoc Plugin Stub ...................... SUCCESS [0.243s]
[INFO] Maven IT Plugin Plugin Stub ....................... SUCCESS [0.509s]
[INFO] Maven IT RAR Plugin Stub .......................... SUCCESS [0.241s]
[INFO] Maven IT Resources Plugin Stub .................... SUCCESS [0.327s]
[INFO] Maven IT Site Plugin Stub ......................... SUCCESS [0.430s]
[INFO] Maven IT Source Plugin Stub ....................... SUCCESS [0.237s]
[INFO] Maven IT Surefire Plugin Stub ..................... SUCCESS [0.500s]
[INFO] Maven IT WAR Plugin Stub .......................... SUCCESS [0.254s]
[INFO] Maven IT Plugin :: Dependency Collection .......... SUCCESS [6.105s]
[INFO] Maven IT Plugin :: Dependency Resolution .......... SUCCESS [6.860s]
[INFO] Maven IT Plugin :: Expression ..................... SUCCESS [3.543s]
[INFO] Maven IT Plugin :: Error Mojos .................... SUCCESS [2.493s]
[INFO] Maven IT Component ................................ SUCCESS [0.523s]
[INFO] Maven IT Plugin :: Extension Consumer ............. SUCCESS [0.324s]
[INFO] Maven IT Plugin :: Extension Provider ............. SUCCESS [0.264s]
[INFO] Maven IT Plugin :: Fork ........................... SUCCESS [0.887s]
[INFO] Maven IT Plugin :: Invalid Descriptor ............. SUCCESS [0.224s]
[INFO] Maven IT Plugin :: Log File ....................... SUCCESS [0.250s]
[INFO] Maven IT Helper Library ........................... SUCCESS [4.868s]
[INFO] Maven IT Plugin :: Model Interpolation ............ SUCCESS [1.343s]
[INFO] Maven IT Plugin :: No Default Component ........... SUCCESS [0.338s]
[INFO] Maven IT Plugin :: No Project ..................... SUCCESS [0.255s]
[INFO] Maven IT Plugin :: Online ......................... SUCCESS [0.180s]
[INFO] Maven IT Plugin :: Optional Mojos ................. SUCCESS [0.459s]
[INFO] Maven IT Plugin :: Packaging ...................... SUCCESS [0.183s]
[INFO] Maven IT Plugin :: Parameter Implementation ....... SUCCESS [0.202s]
[INFO] Maven IT Plugin :: Plugin Dependency .............. SUCCESS [0.260s]
[INFO] Maven IT Plugin :: Project ........................ SUCCESS [0.559s]
[INFO] Maven IT Plugin :: Project Interpolation .......... SUCCESS [0.290s]
[INFO] Maven IT Plugin :: Setter ......................... SUCCESS [0.281s]
[INFO] Maven IT Plugin :: Singleton Component ............ SUCCESS [0.290s]
[INFO] Maven IT Plugin :: Site ........................... SUCCESS [2.224s]
[INFO] Maven IT Plugin :: Toolchain ...................... SUCCESS [4.897s]
[INFO] Maven IT Plugin :: Touch .......................... SUCCESS [0.704s]
[INFO] Maven IT Plugin :: Uses Properties Plugin ......... SUCCESS [0.229s]
[INFO] Maven IT Plugin :: Uses Wagon Plugin .............. SUCCESS [1.516s]
[INFO] Maven IT Plugin :: This plugin should contain the mojos needed by all tests.  SUCCESS
[0.433s]
[INFO] Maven IT Plugin :: Plexus Utils 1.1 ............... SUCCESS [1.478s]
[INFO] Maven IT Plugin :: Plexus Utils New ............... SUCCESS [0.325s]
[INFO] Maven IT Plugin :: Plexus Component API ........... SUCCESS [2.027s]
[INFO] Maven IT Plugin :: Log4J Client ................... SUCCESS [0.538s]
[INFO] Maven IT Plugin :: Extension 1 .................... SUCCESS [0.318s]
[INFO] Maven IT Plugin :: Extension 2 .................... SUCCESS [0.213s]
[INFO] Maven IT Plugin :: Plexus Lifecycle ............... SUCCESS [1.969s]
[INFO] Maven IT Plugin :: Settings ....................... SUCCESS [0.342s]
[INFO] Maven IT Toolchain ................................ SUCCESS [0.584s]
[INFO] Maven IT Wagon .................................... SUCCESS [0.569s]
[INFO] Maven IT Support Artifacts ........................ SUCCESS [2.142s]
[INFO] Maven IT Extension ................................ SUCCESS [0.303s]
[INFO] Maven ITs ......................................... FAILURE [36:19.952s]
[INFO] ------------------------------------------------------------------------
[INFO] BUILD FAILURE
[INFO] ------------------------------------------------------------------------
[INFO] Total time: 38:22.129s
[INFO] Finished at: Sun Oct 27 11:14:25 GMT 2013
[INFO] Final Memory: 33M/766M
[INFO] ------------------------------------------------------------------------
[ERROR] Failed to execute goal org.apache.maven.plugins:maven-surefire-plugin:2.13:test (default-test)
on project core-it-suite: There are test failures.
[ERROR] 
[ERROR] Please refer to F:\ws\m3-its\core-integration-testing-trunk\core-it-suite\target\surefire-reports
for the individual test results.
[ERROR] -> [Help 1]
org.apache.maven.lifecycle.LifecycleExecutionException: Failed to execute goal org.apache.maven.plugins:maven-surefire-plugin:2.13:test
(default-test) on project core-it-suite: There are test failures.

Please refer to F:\ws\m3-its\core-integration-testing-trunk\core-it-suite\target\surefire-reports
for the individual test results.
	at org.apache.maven.lifecycle.internal.MojoExecutor.execute(MojoExecutor.java:213)
	at org.apache.maven.lifecycle.internal.MojoExecutor.execute(MojoExecutor.java:153)
	at org.apache.maven.lifecycle.internal.MojoExecutor.execute(MojoExecutor.java:145)
	at org.apache.maven.lifecycle.internal.LifecycleModuleBuilder.buildProject(LifecycleModuleBuilder.java:84)
	at org.apache.maven.lifecycle.internal.LifecycleModuleBuilder.buildProject(LifecycleModuleBuilder.java:59)
	at org.apache.maven.lifecycle.internal.LifecycleStarter.singleThreadedBuild(LifecycleStarter.java:183)
	at org.apache.maven.lifecycle.internal.LifecycleStarter.execute(LifecycleStarter.java:161)
	at org.apache.maven.DefaultMaven.doExecute(DefaultMaven.java:320)
	at org.apache.maven.DefaultMaven.execute(DefaultMaven.java:156)
	at org.apache.maven.cli.MavenCli.execute(MavenCli.java:537)
	at org.apache.maven.cli.MavenCli.doMain(MavenCli.java:196)
	at org.apache.maven.cli.MavenCli.main(MavenCli.java:141)
	at sun.reflect.NativeMethodAccessorImpl.invoke0(Native Method)
	at sun.reflect.NativeMethodAccessorImpl.invoke(NativeMethodAccessorImpl.java:39)
	at sun.reflect.DelegatingMethodAccessorImpl.invoke(DelegatingMethodAccessorImpl.java:25)
	at java.lang.reflect.Method.invoke(Method.java:597)
	at org.codehaus.plexus.classworlds.launcher.Launcher.launchEnhanced(Launcher.java:290)
	at org.codehaus.plexus.classworlds.launcher.Launcher.launch(Launcher.java:230)
	at org.codehaus.plexus.classworlds.launcher.Launcher.mainWithExitCode(Launcher.java:409)
	at org.codehaus.plexus.classworlds.launcher.Launcher.main(Launcher.java:352)
Caused by: org.apache.maven.plugin.MojoFailureException: There are test failures.

Please refer to F:\ws\m3-its\core-integration-testing-trunk\core-it-suite\target\surefire-reports
for the individual test results.
	at org.apache.maven.plugin.surefire.SurefireHelper.reportExecution(SurefireHelper.java:82)
	at org.apache.maven.plugin.surefire.SurefirePlugin.handleSummary(SurefirePlugin.java:151)
	at org.apache.maven.plugin.surefire.AbstractSurefireMojo.executeAfterPreconditionsChecked(AbstractSurefireMojo.java:721)
	at org.apache.maven.plugin.surefire.AbstractSurefireMojo.execute(AbstractSurefireMojo.java:620)
	at org.apache.maven.plugin.DefaultBuildPluginManager.executeMojo(DefaultBuildPluginManager.java:101)
	at org.apache.maven.lifecycle.internal.MojoExecutor.execute(MojoExecutor.java:209)
	... 19 more
[ERROR] 
[ERROR] Re-run Maven using the -X switch to enable full debug logging.
[ERROR] 
[ERROR] For more information about the errors and possible solutions, please read the following
articles:
[ERROR] [Help 1] http://cwiki.apache.org/confluence/display/MAVEN/MojoFailureException
[ERROR] 
[ERROR] After correcting the problems, you can resume the build with the command
[ERROR]   mvn <goals> -rf :core-it-suite
Build step 'Invoke top-level Maven targets' marked build as failure
Recording test results

Mime
View raw message