maven-notifications mailing list archives

Site index · List index
Message view « Date » · « Thread »
Top « Date » · « Thread »
From Apache Jenkins Server <jenk...@builds.apache.org>
Subject Build failed in Jenkins: maven-plugins-ITs-m3.0.3 #370
Date Sat, 21 Sep 2013 10:19:59 GMT
See <https://builds.apache.org/job/maven-plugins-ITs-m3.0.3/370/changes>

Changes:

[dennisl] Set correct Subversion properties: mime-type.

[dennisl] Set correct Subversion properties: eol-style and keywords.

------------------------------------------
[...truncated 14904 lines...]
[INFO] ..SUCCESS (3.9 s)
[INFO] Building: manifest-transformed/pom.xml
[INFO] run script verify.bsh
[INFO] ..SUCCESS (4.0 s)
[INFO] Building: mini-jar-malformed-dependencies/pom.xml
[INFO] ..SUCCESS (5.5 s)
[INFO] Building: finalNameShade/pom.xml
[INFO] run script setup.bsh
[INFO] run script verify.bsh
[INFO] ..SUCCESS (3.4 s)
[INFO] Building: dep-reduced-pom-relocated-result/pom.xml
[INFO] ..SUCCESS (2.5 s)
[INFO] Building: reloc-abs-resource-path/pom.xml
[INFO] ..SUCCESS (5.4 s)
[INFO] Building: pom-packaging/pom.xml
[INFO] run script verify.bsh
[INFO] ..SUCCESS (2.3 s)
[INFO] Building: artifact-includes-excludes/pom.xml
[INFO] run script verify.bsh
[INFO] ..SUCCESS (3.4 s)
[INFO] Building: MSHADE-133/pom.xml
[INFO] run script verify.groovy
[INFO] ..SUCCESS (3.2 s)
[INFO] Building: mini-jar-respect-includes/pom.xml
[INFO] run script verify.bsh
[INFO] ..SUCCESS (3.8 s)
[INFO] Building: dep-reduced-pom-unique/pom.xml
[INFO] run script verify.groovy
[INFO] ..SUCCESS (3.4 s)
[INFO] Building: services-resource-transformer/pom.xml
[INFO] run script verify.bsh
[INFO] ..SUCCESS (3.4 s)
[INFO] Building: shadePomDependency/pom.xml
[INFO] ..SUCCESS (4.0 s)
[INFO] Building: reloc-includes-excludes/pom.xml
[INFO] run script verify.bsh
[INFO] ..SUCCESS (3.8 s)
[INFO] Building: dep-reduced-pom-use-base-version/pom.xml
[INFO] run script verify.groovy
[INFO] ..SUCCESS (3.3 s)
[INFO] Building: rerun-with-reloc/pom.xml
[INFO] ..SUCCESS (3.8 s)
[INFO] Building: mini-jar-package-info/pom.xml
[INFO] run script verify.bsh
[INFO] ..SUCCESS (3.9 s)
[INFO] Building: attached-artifact-type/pom.xml
[INFO] ..SUCCESS (2.8 s)
[INFO] Building: MSHADE-114/pom.xml
[INFO] ..SUCCESS (3.0 s)
[INFO] Building: implicit-inclusion-of-project-artifact/pom.xml
[INFO] run script verify.bsh
[INFO] ..SUCCESS (3.5 s)
[INFO] Building: finalNameShade-attached/pom.xml
[INFO] run script setup.bsh
[INFO] run script verify.bsh
[INFO] ..SUCCESS (3.1 s)
[INFO] Building: mini-jar/pom.xml
[INFO] run script verify.bsh
[INFO] ..SUCCESS (3.6 s)
[INFO] Building: reloc-anno/pom.xml
[INFO] ..SUCCESS (2.8 s)
[INFO] Building: filter-artifact-contents/pom.xml
[INFO] run script verify.bsh
[INFO] ..SUCCESS (3.1 s)
[INFO] Building: plugin-descriptor-relocation/pom.xml
[INFO] run script verify.groovy
[INFO] ..SUCCESS (6.1 s)
[INFO] Building: reloc-class-from-string-pool/pom.xml
[INFO] ..SUCCESS (3.0 s)
[INFO] 
[INFO] --- maven-invoker-plugin:1.8:verify (integration-test) @ maven-shade-plugin ---
[INFO] -------------------------------------------------
[INFO] Build Summary:
[INFO]   Passed: 45, Failed: 0, Errors: 0, Skipped: 0
[INFO] -------------------------------------------------
[INFO] 
[INFO] --- maven-install-plugin:2.3.1:install (default-install) @ maven-shade-plugin ---
[INFO] Installing /x1/jenkins/jenkins-slave/workspace/maven-plugins-ITs-m3.0.3/maven-shade-plugin/target/maven-shade-plugin-2.2-SNAPSHOT.jar
to /home/jenkins/.m2/repository/org/apache/maven/plugins/maven-shade-plugin/2.2-SNAPSHOT/maven-shade-plugin-2.2-SNAPSHOT.jar
[INFO] Installing /x1/jenkins/jenkins-slave/workspace/maven-plugins-ITs-m3.0.3/maven-shade-plugin/pom.xml
to /home/jenkins/.m2/repository/org/apache/maven/plugins/maven-shade-plugin/2.2-SNAPSHOT/maven-shade-plugin-2.2-SNAPSHOT.pom
[INFO] Installing /x1/jenkins/jenkins-slave/workspace/maven-plugins-ITs-m3.0.3/maven-shade-plugin/target/maven-shade-plugin-2.2-SNAPSHOT-tests.jar
to /home/jenkins/.m2/repository/org/apache/maven/plugins/maven-shade-plugin/2.2-SNAPSHOT/maven-shade-plugin-2.2-SNAPSHOT-tests.jar
[INFO]                                                                         
[INFO] ------------------------------------------------------------------------
[INFO] Building Apache Maven GPG Plugin 1.5-SNAPSHOT
[INFO] ------------------------------------------------------------------------
[INFO] 
[INFO] --- maven-clean-plugin:2.5:clean (default-clean) @ maven-gpg-plugin ---
[INFO] Deleting /x1/jenkins/jenkins-slave/workspace/maven-plugins-ITs-m3.0.3/maven-gpg-plugin/target
[INFO] 
[INFO] --- maven-enforcer-plugin:1.0.1:enforce (ensure-no-container-api) @ maven-gpg-plugin
---
[INFO] 
[INFO] --- maven-plugin-plugin:3.2:helpmojo (generated-helpmojo) @ maven-gpg-plugin ---
[INFO] Using 'UTF-8' encoding to read mojo metadata.
[INFO] Applying mojo extractor for language: java
[INFO] Mojo extractor for language: java found 0 mojo descriptors.
[INFO] Applying mojo extractor for language: bsh
[INFO] Mojo extractor for language: bsh found 0 mojo descriptors.
[INFO] Applying mojo extractor for language: java-annotations
[INFO] Mojo extractor for language: java-annotations found 0 mojo descriptors.
[INFO] 
[INFO] --- maven-plugin-plugin:3.2:descriptor (default-descriptor) @ maven-gpg-plugin ---
[INFO] Using 'UTF-8' encoding to read mojo metadata.
[INFO] Applying mojo extractor for language: java
[INFO] Mojo extractor for language: java found 0 mojo descriptors.
[INFO] Applying mojo extractor for language: bsh
[INFO] Mojo extractor for language: bsh found 0 mojo descriptors.
[INFO] Applying mojo extractor for language: java-annotations
[INFO] Mojo extractor for language: java-annotations found 0 mojo descriptors.
[INFO] 
[INFO] --- maven-remote-resources-plugin:1.4:process (default) @ maven-gpg-plugin ---
[INFO] 
[INFO] --- maven-resources-plugin:2.6:resources (default-resources) @ maven-gpg-plugin ---
[INFO] Using 'UTF-8' encoding to copy filtered resources.
[INFO] skip non existing resourceDirectory /x1/jenkins/jenkins-slave/workspace/maven-plugins-ITs-m3.0.3/maven-gpg-plugin/src/main/resources
[INFO] Copying 3 resources
[INFO] 
[INFO] --- maven-compiler-plugin:3.0:compile (default-compile) @ maven-gpg-plugin ---
[INFO] Changes detected - recompiling the module!
[INFO] Compiling 9 source files to /x1/jenkins/jenkins-slave/workspace/maven-plugins-ITs-m3.0.3/maven-gpg-plugin/target/classes
[INFO] 
[INFO] --- maven-plugin-plugin:3.2:descriptor (generate-descriptor) @ maven-gpg-plugin ---
[INFO] Using 'UTF-8' encoding to read mojo metadata.
[INFO] Applying mojo extractor for language: java
[INFO] Mojo extractor for language: java found 0 mojo descriptors.
[INFO] Applying mojo extractor for language: bsh
[INFO] Mojo extractor for language: bsh found 0 mojo descriptors.
[INFO] Applying mojo extractor for language: java-annotations
[INFO] Mojo extractor for language: java-annotations found 3 mojo descriptors.
[INFO] 
[INFO] --- maven-resources-plugin:2.6:testResources (default-testResources) @ maven-gpg-plugin
---
[INFO] Using 'UTF-8' encoding to copy filtered resources.
[INFO] Copying 8 resources
[INFO] Copying 3 resources
[INFO] 
[INFO] --- maven-compiler-plugin:3.0:testCompile (default-testCompile) @ maven-gpg-plugin
---
[INFO] No sources to compile
[INFO] 
[INFO] --- maven-surefire-plugin:2.12.4:test (default-test) @ maven-gpg-plugin ---
[INFO] 
[INFO] --- maven-jar-plugin:2.4:jar (default-jar) @ maven-gpg-plugin ---
[INFO] Building jar: /x1/jenkins/jenkins-slave/workspace/maven-plugins-ITs-m3.0.3/maven-gpg-plugin/target/maven-gpg-plugin-1.5-SNAPSHOT.jar
[INFO] 
[INFO] --- maven-plugin-plugin:3.2:addPluginArtifactMetadata (default-addPluginArtifactMetadata)
@ maven-gpg-plugin ---
[INFO] 
[INFO] --- maven-invoker-plugin:1.7:install (integration-test) @ maven-gpg-plugin ---
[INFO] Installing /x1/jenkins/jenkins-slave/workspace/maven-plugins-ITs-m3.0.3/maven-gpg-plugin/pom.xml
to /x1/jenkins/jenkins-slave/workspace/maven-plugins-ITs-m3.0.3/maven-gpg-plugin/target/local-repo/org/apache/maven/plugins/maven-gpg-plugin/1.5-SNAPSHOT/maven-gpg-plugin-1.5-SNAPSHOT.pom
[INFO] Installing /x1/jenkins/jenkins-slave/workspace/maven-plugins-ITs-m3.0.3/maven-gpg-plugin/target/maven-gpg-plugin-1.5-SNAPSHOT.jar
to /x1/jenkins/jenkins-slave/workspace/maven-plugins-ITs-m3.0.3/maven-gpg-plugin/target/local-repo/org/apache/maven/plugins/maven-gpg-plugin/1.5-SNAPSHOT/maven-gpg-plugin-1.5-SNAPSHOT.jar
[INFO] 
[INFO] --- maven-invoker-plugin:1.7:integration-test (integration-test) @ maven-gpg-plugin
---
[INFO] Building: alternative-secret-keyring/pom.xml
[INFO] run script verify.bsh
[INFO] ..SUCCESS (2.5 s)
[INFO] Building: no-main-artifact/pom.xml
[INFO] run script verify.bsh
[INFO] ..SUCCESS (2.7 s)
[INFO] Building: sign-release/pom.xml
[INFO] run script verify.bsh
[INFO] ..SUCCESS (2.8 s)
[INFO] 
[INFO] --- maven-invoker-plugin:1.7:verify (integration-test) @ maven-gpg-plugin ---
[INFO] -------------------------------------------------
[INFO] Build Summary:
[INFO]   Passed: 3, Failed: 0, Errors: 0, Skipped: 0
[INFO] -------------------------------------------------
[INFO] 
[INFO] --- maven-install-plugin:2.3.1:install (default-install) @ maven-gpg-plugin ---
[INFO] Installing /x1/jenkins/jenkins-slave/workspace/maven-plugins-ITs-m3.0.3/maven-gpg-plugin/target/maven-gpg-plugin-1.5-SNAPSHOT.jar
to /home/jenkins/.m2/repository/org/apache/maven/plugins/maven-gpg-plugin/1.5-SNAPSHOT/maven-gpg-plugin-1.5-SNAPSHOT.jar
[INFO] Installing /x1/jenkins/jenkins-slave/workspace/maven-plugins-ITs-m3.0.3/maven-gpg-plugin/pom.xml
to /home/jenkins/.m2/repository/org/apache/maven/plugins/maven-gpg-plugin/1.5-SNAPSHOT/maven-gpg-plugin-1.5-SNAPSHOT.pom
[INFO]                                                                         
[INFO] ------------------------------------------------------------------------
[INFO] Building Apache Maven Plugins Aggregator 1-SNAPSHOT
[INFO] ------------------------------------------------------------------------
[INFO] 
[INFO] --- maven-clean-plugin:2.4.1:clean (default-clean) @ maven-plugins-aggregator ---
[INFO] Deleting /x1/jenkins/jenkins-slave/workspace/maven-plugins-ITs-m3.0.3/target
[INFO] 
[INFO] --- maven-remote-resources-plugin:1.1:process (default) @ maven-plugins-aggregator
---
[INFO] Setting property: classpath.resource.loader.class => 'org.codehaus.plexus.velocity.ContextClassLoaderResourceLoader'.
[INFO] Setting property: velocimacro.messages.on => 'false'.
[INFO] Setting property: resource.loader => 'classpath'.
[INFO] Setting property: resource.manager.logwhenfound => 'false'.
[INFO] 
[INFO] --- maven-install-plugin:2.3.1:install (default-install) @ maven-plugins-aggregator
---
[INFO] Installing /x1/jenkins/jenkins-slave/workspace/maven-plugins-ITs-m3.0.3/pom.xml to
/home/jenkins/.m2/repository/org/apache/maven/plugins/maven-plugins-aggregator/1-SNAPSHOT/maven-plugins-aggregator-1-SNAPSHOT.pom
[INFO] ------------------------------------------------------------------------
[INFO] Reactor Summary:
[INFO] 
[INFO] Apache Maven Plugins .............................. SUCCESS [24.461s]
[INFO] Apache Maven ACR Plugin ........................... SUCCESS [28.530s]
[INFO] Apache Maven Ant Plugin ........................... SUCCESS [1:10.458s]
[INFO] Apache Maven AntRun Plugin ........................ SUCCESS [51.109s]
[INFO] Apache Maven Eclipse Plugin ....................... SUCCESS [6:15.804s]
[INFO] Apache Maven Assembly Plugin ...................... SUCCESS [9:27.791s]
[INFO] Apache Maven Changelog Plugin ..................... SUCCESS [45.492s]
[INFO] Apache Maven Changes Plugin ....................... SUCCESS [57.697s]
[INFO] Apache Maven Checkstyle Plugin .................... SUCCESS [1:34.882s]
[INFO] Apache Maven Clean Plugin ......................... SUCCESS [17.666s]
[INFO] Apache Maven Compiler Plugin ...................... SUCCESS [1:15.956s]
[INFO] Apache Maven Dependency Plugin .................... SUCCESS [2:36.906s]
[INFO] Apache Maven Deploy Plugin ........................ SUCCESS [1:03.952s]
[INFO] Apache Maven DOAP Plugin .......................... SUCCESS [18.085s]
[INFO] Apache Maven Documentation Checker Plugin ......... SUCCESS [5.706s]
[INFO] Apache Maven EAR Plugin ........................... SUCCESS [3:33.709s]
[INFO] Apache Maven EJB Plugin ........................... SUCCESS [24.169s]
[INFO] Apache Maven Help Plugin .......................... SUCCESS [39.094s]
[INFO] Apache Maven Install Plugin ....................... SUCCESS [48.115s]
[INFO] Apache Maven JAR Plugin ........................... SUCCESS [1:04.479s]
[INFO] Apache Maven Jarsigner Plugin ..................... SUCCESS [22.915s]
[INFO] Apache Maven Javadoc Plugin ....................... SUCCESS [3:10.425s]
[INFO] Apache Maven Linkcheck Plugin ..................... SUCCESS [2.331s]
[INFO] Apache Maven Patch Plugin ......................... SUCCESS [11.512s]
[INFO] Apache Maven PDF Plugin ........................... SUCCESS [1:30.602s]
[INFO] Apache Maven PMD Plugin ........................... FAILURE [1:27.264s]
[INFO] Apache Maven RAR Plugin ........................... SUCCESS [8.944s]
[INFO] Apache Maven Reactor Plugin ....................... SUCCESS [2.399s]
[INFO] Apache Maven Repository Plugin .................... SUCCESS [40.128s]
[INFO] Apache Maven Resources Plugin ..................... SUCCESS [48.177s]
[INFO] Apache Maven Site Plugin 3 ........................ SUCCESS [6:06.159s]
[INFO] Apache Maven Source Plugin ........................ SUCCESS [42.314s]
[INFO] Apache Maven Stage Plugin ......................... SUCCESS [1.959s]
[INFO] Apache Maven Toolchains Plugin .................... SUCCESS [1.407s]
[INFO] Apache Maven Verifier Plugin ...................... SUCCESS [13.523s]
[INFO] Apache Maven WAR Plugin ........................... SUCCESS [1:07.438s]
[INFO] Apache Maven SCM Publish Plugin ................... SUCCESS [58.332s]
[INFO] Apache Maven Invoker Plugin ....................... SUCCESS [4:09.295s]
[INFO] Apache Maven Project Info Reports Plugin .......... SUCCESS [2:08.519s]
[INFO] Apache Maven Remote Resources Plugin .............. SUCCESS [57.585s]
[INFO] Apache Maven Shade Plugin ......................... SUCCESS [2:53.176s]
[INFO] Apache Maven GPG Plugin ........................... SUCCESS [10.388s]
[INFO] Apache Maven Plugins Aggregator ................... SUCCESS [0.358s]
[INFO] ------------------------------------------------------------------------
[INFO] BUILD FAILURE
[INFO] ------------------------------------------------------------------------
[INFO] Total time: 1:02:03.645s
[INFO] Finished at: Sat Sep 21 10:19:52 GMT 2013
[INFO] Final Memory: 108M/566M
[INFO] ------------------------------------------------------------------------
[WARNING] The requested profile "apache.snapshots" could not be activated because it does
not exist.
[ERROR] Failed to execute goal org.apache.maven.plugins:maven-invoker-plugin:1.7:verify (integration-test)
on project maven-pmd-plugin: 2 builds failed. See console output above for details. ->
[Help 1]
[ERROR] 
[ERROR] To see the full stack trace of the errors, re-run Maven with the -e switch.
[ERROR] Re-run Maven using the -X switch to enable full debug logging.
[ERROR] 
[ERROR] For more information about the errors and possible solutions, please read the following
articles:
[ERROR] [Help 1] http://cwiki.apache.org/confluence/display/MAVEN/MojoFailureException
[ERROR] 
[ERROR] After correcting the problems, you can resume the build with the command
[ERROR]   mvn <goals> -rf :maven-pmd-plugin
Build step 'Invoke top-level Maven targets' marked build as failure
Recording test results

Mime
View raw message