maven-notifications mailing list archives

Site index · List index
Message view « Date » · « Thread »
Top « Date » · « Thread »
From Apache Jenkins Server <jenk...@builds.apache.org>
Subject Build failed in Jenkins: maven-plugins-ITs-m3.0.3 #322
Date Thu, 22 Aug 2013 19:42:19 GMT
See <https://builds.apache.org/job/maven-plugins-ITs-m3.0.3/322/changes>

Changes:

[krosenvold] Ok, so now it compiles too.

[krosenvold] And maven-eclipse-plugin to latest plexus too

And at this point, I think all of the maven plugins refer to the same version
of plexus-utils, plexus-io and plexus-archiver. Time to move them
to dependencyManagement in parent ?

------------------------------------------
[...truncated 10903 lines...]
[INFO] Installing <https://builds.apache.org/job/maven-plugins-ITs-m3.0.3/ws/maven-site-plugin/dependency-reduced-pom.xml>
to <https://builds.apache.org/job/maven-plugins-ITs-m3.0.3/ws/maven-shade-plugin/target/local-repo/org/apache/maven/plugins/maven-site-plugin/3.4-SNAPSHOT/maven-site-plugin-3.4-SNAPSHOT.pom>
[INFO] Installing <https://builds.apache.org/job/maven-plugins-ITs-m3.0.3/ws/maven-site-plugin/target/maven-site-plugin-3.4-SNAPSHOT.jar>
to <https://builds.apache.org/job/maven-plugins-ITs-m3.0.3/ws/maven-shade-plugin/target/local-repo/org/apache/maven/plugins/maven-site-plugin/3.4-SNAPSHOT/maven-site-plugin-3.4-SNAPSHOT.jar>
[INFO] Installing <https://builds.apache.org/job/maven-plugins-ITs-m3.0.3/ws/maven-site-plugin/dependency-reduced-pom.xml>
to <https://builds.apache.org/job/maven-plugins-ITs-m3.0.3/ws/maven-shade-plugin/target/local-repo/org/apache/maven/plugins/maven-site-plugin/3.4-SNAPSHOT/maven-site-plugin-3.4-SNAPSHOT.pom>
[INFO] Installing <https://builds.apache.org/job/maven-plugins-ITs-m3.0.3/ws/maven-source-plugin/pom.xml>
to <https://builds.apache.org/job/maven-plugins-ITs-m3.0.3/ws/maven-shade-plugin/target/local-repo/org/apache/maven/plugins/maven-source-plugin/2.3-SNAPSHOT/maven-source-plugin-2.3-SNAPSHOT.pom>
[INFO] Installing <https://builds.apache.org/job/maven-plugins-ITs-m3.0.3/ws/maven-source-plugin/target/maven-source-plugin-2.3-SNAPSHOT.jar>
to <https://builds.apache.org/job/maven-plugins-ITs-m3.0.3/ws/maven-shade-plugin/target/local-repo/org/apache/maven/plugins/maven-source-plugin/2.3-SNAPSHOT/maven-source-plugin-2.3-SNAPSHOT.jar>
[INFO] Installing <https://builds.apache.org/job/maven-plugins-ITs-m3.0.3/ws/maven-source-plugin/pom.xml>
to <https://builds.apache.org/job/maven-plugins-ITs-m3.0.3/ws/maven-shade-plugin/target/local-repo/org/apache/maven/plugins/maven-source-plugin/2.3-SNAPSHOT/maven-source-plugin-2.3-SNAPSHOT.pom>
[INFO] Installing <https://builds.apache.org/job/maven-plugins-ITs-m3.0.3/ws/maven-stage-plugin/pom.xml>
to <https://builds.apache.org/job/maven-plugins-ITs-m3.0.3/ws/maven-shade-plugin/target/local-repo/org/apache/maven/plugins/maven-stage-plugin/1.0-SNAPSHOT/maven-stage-plugin-1.0-SNAPSHOT.pom>
[INFO] Installing <https://builds.apache.org/job/maven-plugins-ITs-m3.0.3/ws/maven-stage-plugin/target/maven-stage-plugin-1.0-SNAPSHOT.jar>
to <https://builds.apache.org/job/maven-plugins-ITs-m3.0.3/ws/maven-shade-plugin/target/local-repo/org/apache/maven/plugins/maven-stage-plugin/1.0-SNAPSHOT/maven-stage-plugin-1.0-SNAPSHOT.jar>
[INFO] Installing <https://builds.apache.org/job/maven-plugins-ITs-m3.0.3/ws/maven-stage-plugin/pom.xml>
to <https://builds.apache.org/job/maven-plugins-ITs-m3.0.3/ws/maven-shade-plugin/target/local-repo/org/apache/maven/plugins/maven-stage-plugin/1.0-SNAPSHOT/maven-stage-plugin-1.0-SNAPSHOT.pom>
[INFO] Installing <https://builds.apache.org/job/maven-plugins-ITs-m3.0.3/ws/maven-toolchains-plugin/pom.xml>
to <https://builds.apache.org/job/maven-plugins-ITs-m3.0.3/ws/maven-shade-plugin/target/local-repo/org/apache/maven/plugins/maven-toolchains-plugin/1.1-SNAPSHOT/maven-toolchains-plugin-1.1-SNAPSHOT.pom>
[INFO] Installing <https://builds.apache.org/job/maven-plugins-ITs-m3.0.3/ws/maven-toolchains-plugin/target/maven-toolchains-plugin-1.1-SNAPSHOT.jar>
to <https://builds.apache.org/job/maven-plugins-ITs-m3.0.3/ws/maven-shade-plugin/target/local-repo/org/apache/maven/plugins/maven-toolchains-plugin/1.1-SNAPSHOT/maven-toolchains-plugin-1.1-SNAPSHOT.jar>
[INFO] Installing <https://builds.apache.org/job/maven-plugins-ITs-m3.0.3/ws/maven-toolchains-plugin/pom.xml>
to <https://builds.apache.org/job/maven-plugins-ITs-m3.0.3/ws/maven-shade-plugin/target/local-repo/org/apache/maven/plugins/maven-toolchains-plugin/1.1-SNAPSHOT/maven-toolchains-plugin-1.1-SNAPSHOT.pom>
[INFO] Installing <https://builds.apache.org/job/maven-plugins-ITs-m3.0.3/ws/maven-verifier-plugin/pom.xml>
to <https://builds.apache.org/job/maven-plugins-ITs-m3.0.3/ws/maven-shade-plugin/target/local-repo/org/apache/maven/plugins/maven-verifier-plugin/1.1-SNAPSHOT/maven-verifier-plugin-1.1-SNAPSHOT.pom>
[INFO] Installing <https://builds.apache.org/job/maven-plugins-ITs-m3.0.3/ws/maven-verifier-plugin/target/maven-verifier-plugin-1.1-SNAPSHOT.jar>
to <https://builds.apache.org/job/maven-plugins-ITs-m3.0.3/ws/maven-shade-plugin/target/local-repo/org/apache/maven/plugins/maven-verifier-plugin/1.1-SNAPSHOT/maven-verifier-plugin-1.1-SNAPSHOT.jar>
[INFO] Installing <https://builds.apache.org/job/maven-plugins-ITs-m3.0.3/ws/maven-verifier-plugin/pom.xml>
to <https://builds.apache.org/job/maven-plugins-ITs-m3.0.3/ws/maven-shade-plugin/target/local-repo/org/apache/maven/plugins/maven-verifier-plugin/1.1-SNAPSHOT/maven-verifier-plugin-1.1-SNAPSHOT.pom>
[INFO] Installing <https://builds.apache.org/job/maven-plugins-ITs-m3.0.3/ws/maven-war-plugin/pom.xml>
to <https://builds.apache.org/job/maven-plugins-ITs-m3.0.3/ws/maven-shade-plugin/target/local-repo/org/apache/maven/plugins/maven-war-plugin/2.5-SNAPSHOT/maven-war-plugin-2.5-SNAPSHOT.pom>
[INFO] Installing <https://builds.apache.org/job/maven-plugins-ITs-m3.0.3/ws/maven-war-plugin/target/maven-war-plugin-2.5-SNAPSHOT.jar>
to <https://builds.apache.org/job/maven-plugins-ITs-m3.0.3/ws/maven-shade-plugin/target/local-repo/org/apache/maven/plugins/maven-war-plugin/2.5-SNAPSHOT/maven-war-plugin-2.5-SNAPSHOT.jar>
[INFO] Installing <https://builds.apache.org/job/maven-plugins-ITs-m3.0.3/ws/maven-war-plugin/pom.xml>
to <https://builds.apache.org/job/maven-plugins-ITs-m3.0.3/ws/maven-shade-plugin/target/local-repo/org/apache/maven/plugins/maven-war-plugin/2.5-SNAPSHOT/maven-war-plugin-2.5-SNAPSHOT.pom>
[INFO] Installing <https://builds.apache.org/job/maven-plugins-ITs-m3.0.3/ws/maven-scm-publish-plugin/pom.xml>
to <https://builds.apache.org/job/maven-plugins-ITs-m3.0.3/ws/maven-shade-plugin/target/local-repo/org/apache/maven/plugins/maven-scm-publish-plugin/1.0-SNAPSHOT/maven-scm-publish-plugin-1.0-SNAPSHOT.pom>
[INFO] Installing <https://builds.apache.org/job/maven-plugins-ITs-m3.0.3/ws/maven-scm-publish-plugin/target/maven-scm-publish-plugin-1.0-SNAPSHOT.jar>
to <https://builds.apache.org/job/maven-plugins-ITs-m3.0.3/ws/maven-shade-plugin/target/local-repo/org/apache/maven/plugins/maven-scm-publish-plugin/1.0-SNAPSHOT/maven-scm-publish-plugin-1.0-SNAPSHOT.jar>
[INFO] Installing <https://builds.apache.org/job/maven-plugins-ITs-m3.0.3/ws/maven-scm-publish-plugin/pom.xml>
to <https://builds.apache.org/job/maven-plugins-ITs-m3.0.3/ws/maven-shade-plugin/target/local-repo/org/apache/maven/plugins/maven-scm-publish-plugin/1.0-SNAPSHOT/maven-scm-publish-plugin-1.0-SNAPSHOT.pom>
[INFO] Installing <https://builds.apache.org/job/maven-plugins-ITs-m3.0.3/ws/maven-invoker-plugin/pom.xml>
to <https://builds.apache.org/job/maven-plugins-ITs-m3.0.3/ws/maven-shade-plugin/target/local-repo/org/apache/maven/plugins/maven-invoker-plugin/1.9-SNAPSHOT/maven-invoker-plugin-1.9-SNAPSHOT.pom>
[INFO] Installing <https://builds.apache.org/job/maven-plugins-ITs-m3.0.3/ws/maven-invoker-plugin/target/maven-invoker-plugin-1.9-SNAPSHOT.jar>
to <https://builds.apache.org/job/maven-plugins-ITs-m3.0.3/ws/maven-shade-plugin/target/local-repo/org/apache/maven/plugins/maven-invoker-plugin/1.9-SNAPSHOT/maven-invoker-plugin-1.9-SNAPSHOT.jar>
[INFO] Installing <https://builds.apache.org/job/maven-plugins-ITs-m3.0.3/ws/maven-invoker-plugin/pom.xml>
to <https://builds.apache.org/job/maven-plugins-ITs-m3.0.3/ws/maven-shade-plugin/target/local-repo/org/apache/maven/plugins/maven-invoker-plugin/1.9-SNAPSHOT/maven-invoker-plugin-1.9-SNAPSHOT.pom>
[INFO] Installing <https://builds.apache.org/job/maven-plugins-ITs-m3.0.3/ws/maven-project-info-reports-plugin/pom.xml>
to <https://builds.apache.org/job/maven-plugins-ITs-m3.0.3/ws/maven-shade-plugin/target/local-repo/org/apache/maven/plugins/maven-project-info-reports-plugin/2.8-SNAPSHOT/maven-project-info-reports-plugin-2.8-SNAPSHOT.pom>
[INFO] Installing <https://builds.apache.org/job/maven-plugins-ITs-m3.0.3/ws/maven-project-info-reports-plugin/target/maven-project-info-reports-plugin-2.8-SNAPSHOT.jar>
to <https://builds.apache.org/job/maven-plugins-ITs-m3.0.3/ws/maven-shade-plugin/target/local-repo/org/apache/maven/plugins/maven-project-info-reports-plugin/2.8-SNAPSHOT/maven-project-info-reports-plugin-2.8-SNAPSHOT.jar>
[INFO] Installing <https://builds.apache.org/job/maven-plugins-ITs-m3.0.3/ws/maven-project-info-reports-plugin/pom.xml>
to <https://builds.apache.org/job/maven-plugins-ITs-m3.0.3/ws/maven-shade-plugin/target/local-repo/org/apache/maven/plugins/maven-project-info-reports-plugin/2.8-SNAPSHOT/maven-project-info-reports-plugin-2.8-SNAPSHOT.pom>
[INFO] Installing <https://builds.apache.org/job/maven-plugins-ITs-m3.0.3/ws/maven-remote-resources-plugin/pom.xml>
to <https://builds.apache.org/job/maven-plugins-ITs-m3.0.3/ws/maven-shade-plugin/target/local-repo/org/apache/maven/plugins/maven-remote-resources-plugin/1.6-SNAPSHOT/maven-remote-resources-plugin-1.6-SNAPSHOT.pom>
[INFO] Installing <https://builds.apache.org/job/maven-plugins-ITs-m3.0.3/ws/maven-remote-resources-plugin/target/maven-remote-resources-plugin-1.6-SNAPSHOT.jar>
to <https://builds.apache.org/job/maven-plugins-ITs-m3.0.3/ws/maven-shade-plugin/target/local-repo/org/apache/maven/plugins/maven-remote-resources-plugin/1.6-SNAPSHOT/maven-remote-resources-plugin-1.6-SNAPSHOT.jar>
[INFO] Installing <https://builds.apache.org/job/maven-plugins-ITs-m3.0.3/ws/maven-remote-resources-plugin/pom.xml>
to <https://builds.apache.org/job/maven-plugins-ITs-m3.0.3/ws/maven-shade-plugin/target/local-repo/org/apache/maven/plugins/maven-remote-resources-plugin/1.6-SNAPSHOT/maven-remote-resources-plugin-1.6-SNAPSHOT.pom>
[INFO] Installing <https://builds.apache.org/job/maven-plugins-ITs-m3.0.3/ws/maven-shade-plugin/pom.xml>
to <https://builds.apache.org/job/maven-plugins-ITs-m3.0.3/ws/maven-shade-plugin/target/local-repo/org/apache/maven/plugins/maven-shade-plugin/2.2-SNAPSHOT/maven-shade-plugin-2.2-SNAPSHOT.pom>
[INFO] Installing <https://builds.apache.org/job/maven-plugins-ITs-m3.0.3/ws/maven-shade-plugin/target/maven-shade-plugin-2.2-SNAPSHOT.jar>
to <https://builds.apache.org/job/maven-plugins-ITs-m3.0.3/ws/maven-shade-plugin/target/local-repo/org/apache/maven/plugins/maven-shade-plugin/2.2-SNAPSHOT/maven-shade-plugin-2.2-SNAPSHOT.jar>
[INFO] Installing <https://builds.apache.org/job/maven-plugins-ITs-m3.0.3/ws/maven-shade-plugin/target/maven-shade-plugin-2.2-SNAPSHOT-tests.jar>
to <https://builds.apache.org/job/maven-plugins-ITs-m3.0.3/ws/maven-shade-plugin/target/local-repo/org/apache/maven/plugins/maven-shade-plugin/2.2-SNAPSHOT/maven-shade-plugin-2.2-SNAPSHOT-tests.jar>
[INFO] 
[INFO] --- maven-invoker-plugin:1.8:integration-test (integration-test) @ maven-shade-plugin
---
[INFO] Building: artifact-includes-excludes/pom.xml
[INFO] run script verify.bsh
[INFO] ..SUCCESS (4.3 s)
[INFO] Building: MSHADE-133/pom.xml
[INFO] run script verify.groovy
[INFO] ..SUCCESS (3.8 s)
[INFO] Building: dep-reduced-pom-with-local-parent/pom.xml
[INFO] ..SUCCESS (3.1 s)
[INFO] Building: implicit-inclusion-of-project-artifact/pom.xml
[INFO] run script verify.bsh
[INFO] ..SUCCESS (3.9 s)
[INFO] Building: reloc-class-from-string-pool/pom.xml
[INFO] ..SUCCESS (3.4 s)
[INFO] Building: dep-reduced-pom-unique/pom.xml
[INFO] run script verify.groovy
[INFO] ..SUCCESS (3.9 s)
[INFO] Building: non-runtime-scope-excluded/pom.xml
[INFO] run script verify.bsh
[INFO] ..SUCCESS (3.9 s)
[INFO] Building: manifest-transformed/pom.xml
[INFO] run script verify.bsh
[INFO] ..SUCCESS (6.1 s)
[INFO] Building: duplicate-classes-without-reloc/pom.xml
[INFO] ..SUCCESS (3.1 s)
[INFO] Building: mini-jar-respect-includes/pom.xml
[INFO] run script verify.bsh
[INFO] ..SUCCESS (4.8 s)
[INFO] Building: pom-packaging/pom.xml
[INFO] run script verify.bsh
[INFO] ..SUCCESS (2.6 s)
[INFO] Building: xml-transformer-ignores-dtd/pom.xml
[INFO] run script verify.bsh
[INFO] ..SUCCESS (3.8 s)
[INFO] Building: empty-relocation-shaded-pattern/pom.xml
[INFO] ..SUCCESS (3.7 s)
[INFO] Building: mshade-123/pom.xml
[INFO] ..SUCCESS (5.9 s)
[INFO] Building: manifest-retained/pom.xml
[INFO] run script verify.bsh
[INFO] ..SUCCESS (4.5 s)
[INFO] Building: finalNameBuild/pom.xml
[INFO] run script setup.bsh
[INFO] run script verify.bsh
[INFO] ..SUCCESS (3.9 s)
[INFO] Building: finalNameShade/pom.xml
[INFO] run script setup.bsh
[INFO] run script verify.bsh
[INFO] ..SUCCESS (4.0 s)
[INFO] Building: reloc-abs-resource-path/pom.xml
[INFO] ..SUCCESS (5.6 s)
[INFO] Building: dep-reduced-pom-use-base-version/pom.xml
[INFO] run script verify.groovy
[INFO] ..SUCCESS (4.1 s)
[INFO] Building: empty-apache-notice-transform/pom.xml
[INFO] ..SUCCESS (4.1 s)
[INFO] Building: MSHADE-114/pom.xml
[INFO] ..SUCCESS (3.7 s)
[INFO] Building: services-resource-transformer/pom.xml
[INFO] run script verify.bsh
[INFO] ..SUCCESS (4.1 s)
[INFO] Building: mini-jar-package-info/pom.xml
[INFO] run script verify.bsh
[INFO] ..SUCCESS (4.6 s)
[INFO] Building: rerun-without-reloc/pom.xml
[INFO] ..SUCCESS (3.6 s)
[INFO] Building: shadePomDependency/pom.xml
[INFO] ..SUCCESS (4.5 s)
[INFO] Building: reloc-includes-excludes/pom.xml
[INFO] run script verify.bsh
[INFO] ..SUCCESS (4.3 s)
[INFO] Building: finalNameShade-attached/pom.xml
[INFO] run script setup.bsh
[INFO] run script verify.bsh
[INFO] ..SUCCESS (3.7 s)
[INFO] Building: component-descriptor-relocation/pom.xml
[INFO] ..SUCCESS (4.3 s)
[INFO] Building: users-shader-impl/pom.xml
[INFO] run script verify.groovy
[INFO] ..SUCCESS (4.4 s)
[INFO] Building: mini-jar-malformed-dependencies/pom.xml
[INFO] ..SUCCESS (7.1 s)
[INFO] Building: plugin-descriptor-relocation/pom.xml
[INFO] run script verify.groovy
[INFO] ..SUCCESS (7.4 s)
[INFO] Building: finalNameBuild-attached/pom.xml
[INFO] run script setup.bsh
[INFO] run script verify.bsh
[INFO] ..SUCCESS (3.9 s)
[INFO] Building: attach-after-lifecycle-fork/pom.xml
[INFO] run script setup.bsh
[INFO] run script verify.bsh
[INFO] ..SUCCESS (3.1 s)
[INFO] Building: empty-relocation-pattern/pom.xml
[INFO] ..SUCCESS (3.7 s)
[INFO] Building: mini-jar/pom.xml
[INFO] run script verify.bsh
[INFO] ..SUCCESS (4.1 s)
[INFO] Building: reloc-anno/pom.xml
[INFO] ..SUCCESS (3.5 s)
[INFO] Building: MSHADE-105/pom.xml
[INFO] run script verify.bsh
[INFO] ..SUCCESS (6.9 s)
[INFO] Building: dep-reduced-pom-relocated-result/pom.xml
[INFO] ..SUCCESS (2.7 s)
[INFO] Building: attached-artifact-type/pom.xml
[INFO] ..SUCCESS (3.0 s)
[INFO] Building: dep-reduced-pom/pom.xml
[INFO] run script verify.groovy
[INFO] ..SUCCESS (3.9 s)
[INFO] Building: rerun-with-reloc/pom.xml
[INFO] ..SUCCESS (5.2 s)
[INFO] Building: duplicate-classes-with-reloc/pom.xml
[INFO] ..SUCCESS (3.0 s)
[INFO] Building: filter-artifact-contents/pom.xml
[INFO] run script verify.bsh
[INFO] ..SUCCESS (3.9 s)
[INFO] Building: project-with-reactors-included/pom.xml
[INFO] run script verify.bsh
[INFO] ..SUCCESS (5.3 s)
[INFO] Building: reloc-enum-ref-from-anno/pom.xml
[INFO] ..SUCCESS (3.5 s)
[INFO] 
[INFO] --- maven-invoker-plugin:1.8:verify (integration-test) @ maven-shade-plugin ---
[INFO] -------------------------------------------------
[INFO] Build Summary:
[INFO]   Passed: 45, Failed: 0, Errors: 0, Skipped: 0
[INFO] -------------------------------------------------
[INFO] 
[INFO] --- maven-install-plugin:2.3.1:install (default-install) @ maven-shade-plugin ---
[INFO] Installing <https://builds.apache.org/job/maven-plugins-ITs-m3.0.3/ws/maven-shade-plugin/target/maven-shade-plugin-2.2-SNAPSHOT.jar>
to /home/jenkins/.m2/repository/org/apache/maven/plugins/maven-shade-plugin/2.2-SNAPSHOT/maven-shade-plugin-2.2-SNAPSHOT.jar
[INFO] Installing <https://builds.apache.org/job/maven-plugins-ITs-m3.0.3/ws/maven-shade-plugin/pom.xml>
to /home/jenkins/.m2/repository/org/apache/maven/plugins/maven-shade-plugin/2.2-SNAPSHOT/maven-shade-plugin-2.2-SNAPSHOT.pom
[INFO] Installing <https://builds.apache.org/job/maven-plugins-ITs-m3.0.3/ws/maven-shade-plugin/target/maven-shade-plugin-2.2-SNAPSHOT-tests.jar>
to /home/jenkins/.m2/repository/org/apache/maven/plugins/maven-shade-plugin/2.2-SNAPSHOT/maven-shade-plugin-2.2-SNAPSHOT-tests.jar
[INFO]                                                                         
[INFO] ------------------------------------------------------------------------
[INFO] Building Apache Maven Plugins Aggregator 1-SNAPSHOT
[INFO] ------------------------------------------------------------------------
[INFO] 
[INFO] --- maven-clean-plugin:2.4.1:clean (default-clean) @ maven-plugins-aggregator ---
[INFO] Deleting <https://builds.apache.org/job/maven-plugins-ITs-m3.0.3/ws/target>
[INFO] 
[INFO] --- maven-remote-resources-plugin:1.1:process (default) @ maven-plugins-aggregator
---
[INFO] Setting property: classpath.resource.loader.class => 'org.codehaus.plexus.velocity.ContextClassLoaderResourceLoader'.
[INFO] Setting property: velocimacro.messages.on => 'false'.
[INFO] Setting property: resource.loader => 'classpath'.
[INFO] Setting property: resource.manager.logwhenfound => 'false'.
[INFO] 
[INFO] --- maven-install-plugin:2.3.1:install (default-install) @ maven-plugins-aggregator
---
[INFO] Installing <https://builds.apache.org/job/maven-plugins-ITs-m3.0.3/ws/pom.xml>
to /home/jenkins/.m2/repository/org/apache/maven/plugins/maven-plugins-aggregator/1-SNAPSHOT/maven-plugins-aggregator-1-SNAPSHOT.pom
[INFO] ------------------------------------------------------------------------
[INFO] Reactor Summary:
[INFO] 
[INFO] Apache Maven Plugins .............................. SUCCESS [14.589s]
[INFO] Apache Maven ACR Plugin ........................... SUCCESS [25.596s]
[INFO] Apache Maven Ant Plugin ........................... SUCCESS [1:17.008s]
[INFO] Apache Maven AntRun Plugin ........................ SUCCESS [55.098s]
[INFO] Apache Maven Eclipse Plugin ....................... SUCCESS [6:43.148s]
[INFO] Apache Maven Assembly Plugin ...................... SUCCESS [11:33.471s]
[INFO] Apache Maven Changelog Plugin ..................... SUCCESS [52.871s]
[INFO] Apache Maven Changes Plugin ....................... SUCCESS [1:20.790s]
[INFO] Apache Maven Checkstyle Plugin .................... SUCCESS [1:50.013s]
[INFO] Apache Maven Clean Plugin ......................... SUCCESS [20.088s]
[INFO] Apache Maven Compiler Plugin ...................... SUCCESS [1:37.829s]
[INFO] Apache Maven Dependency Plugin .................... SUCCESS [3:07.974s]
[INFO] Apache Maven Deploy Plugin ........................ SUCCESS [1:05.245s]
[INFO] Apache Maven DOAP Plugin .......................... SUCCESS [19.513s]
[INFO] Apache Maven Documentation Checker Plugin ......... SUCCESS [5.771s]
[INFO] Apache Maven EAR Plugin ........................... SUCCESS [3:57.306s]
[INFO] Apache Maven EJB Plugin ........................... SUCCESS [29.653s]
[INFO] Apache Maven GPG Plugin ........................... SUCCESS [10.714s]
[INFO] Apache Maven Help Plugin .......................... SUCCESS [44.114s]
[INFO] Apache Maven Install Plugin ....................... SUCCESS [53.146s]
[INFO] Apache Maven JAR Plugin ........................... SUCCESS [1:13.500s]
[INFO] Apache Maven Jarsigner Plugin ..................... SUCCESS [25.983s]
[INFO] Apache Maven Javadoc Plugin ....................... SUCCESS [2:54.926s]
[INFO] Apache Maven Linkcheck Plugin ..................... SUCCESS [2.798s]
[INFO] Apache Maven Patch Plugin ......................... SUCCESS [13.467s]
[INFO] Apache Maven PDF Plugin ........................... SUCCESS [37.939s]
[INFO] Apache Maven PMD Plugin ........................... FAILURE [1:36.001s]
[INFO] Apache Maven RAR Plugin ........................... SUCCESS [10.803s]
[INFO] Apache Maven Reactor Plugin ....................... SUCCESS [2.442s]
[INFO] Apache Maven Repository Plugin .................... SUCCESS [39.303s]
[INFO] Apache Maven Resources Plugin ..................... SUCCESS [55.468s]
[INFO] Apache Maven Site Plugin 3 ........................ SUCCESS [6:50.271s]
[INFO] Apache Maven Source Plugin ........................ SUCCESS [49.405s]
[INFO] Apache Maven Stage Plugin ......................... SUCCESS [2.813s]
[INFO] Apache Maven Toolchains Plugin .................... SUCCESS [1.506s]
[INFO] Apache Maven Verifier Plugin ...................... SUCCESS [17.974s]
[INFO] Apache Maven WAR Plugin ........................... SUCCESS [1:31.980s]
[INFO] Apache Maven SCM Publish Plugin ................... SUCCESS [1:22.998s]
[INFO] Apache Maven Invoker Plugin ....................... SUCCESS [4:44.718s]
[INFO] Apache Maven Project Info Reports Plugin .......... SUCCESS [2:18.238s]
[INFO] Apache Maven Remote Resources Plugin .............. SUCCESS [1:00.670s]
[INFO] Apache Maven Shade Plugin ......................... SUCCESS [3:29.896s]
[INFO] Apache Maven Plugins Aggregator ................... SUCCESS [0.498s]
[INFO] ------------------------------------------------------------------------
[INFO] BUILD FAILURE
[INFO] ------------------------------------------------------------------------
[INFO] Total time: 1:09:36.775s
[INFO] Finished at: Thu Aug 22 19:41:54 UTC 2013
[INFO] Final Memory: 101M/425M
[INFO] ------------------------------------------------------------------------
[WARNING] The requested profile "apache.snapshots" could not be activated because it does
not exist.
[ERROR] Failed to execute goal org.apache.maven.plugins:maven-invoker-plugin:1.7:verify (integration-test)
on project maven-pmd-plugin: 2 builds failed. See console output above for details. ->
[Help 1]
[ERROR] 
[ERROR] To see the full stack trace of the errors, re-run Maven with the -e switch.
[ERROR] Re-run Maven using the -X switch to enable full debug logging.
[ERROR] 
[ERROR] For more information about the errors and possible solutions, please read the following
articles:
[ERROR] [Help 1] http://cwiki.apache.org/confluence/display/MAVEN/MojoFailureException
[ERROR] 
[ERROR] After correcting the problems, you can resume the build with the command
[ERROR]   mvn <goals> -rf :maven-pmd-plugin
Build step 'Invoke top-level Maven targets' marked build as failure
Recording test results

Mime
View raw message