maven-notifications mailing list archives

Site index · List index
Message view « Date » · « Thread »
Top « Date » · « Thread »
From Apache Jenkins Server <jenk...@builds.apache.org>
Subject Build failed in Jenkins: maven-plugin-testing » Maven Plugin Testing Mechanism #19
Date Wed, 31 Jul 2013 12:24:34 GMT
See <https://builds.apache.org/job/maven-plugin-testing/org.apache.maven.plugin-testing$maven-plugin-testing-harness/19/changes>

Changes:

[jvanzyl] o updating for maven 3.1.0
o updating to Eclipse Aether
o using new facilities in the container

[olamy] remove inherited from parent

[olamy] Update documentation.

[olamy] Implement MojoRule, so MojoTestcases are not forced to extend AbstractMojoTestCase.

------------------------------------------
<===[JENKINS REMOTING CAPACITY]===>   channel started
log4j:WARN No appenders could be found for logger (org.apache.commons.beanutils.converters.BooleanConverter).
log4j:WARN Please initialize the log4j system properly.
Executing Maven:  -B -f /home/jenkins/jenkins-slave/workspace/maven-plugin-testing/pom.xml
-Dmaven.repo.local=/home/jenkins/jenkins-slave/maven-repositories/1 clean install -B -U -e
-fae -V
Apache Maven 3.0.4 (r1232337; 2012-01-17 08:44:56+0000)
Maven home: /x1/jenkins/tools/maven/apache-maven-3.0.4
Java version: 1.6.0_45, vendor: Sun Microsystems Inc.
Java home: /x1/jenkins/tools/java/jdk1.6.0_45-32/jre
Default locale: en_US, platform encoding: ANSI_X3.4-1968
OS name: "linux", version: "3.2.0-40-generic", arch: "i386", family: "unix"
[INFO] Error stacktraces are turned on.
Jul 31, 2013 12:23:51 PM org.apache.maven.cli.event.ExecutionEventLogger projectDiscoveryStarted
INFO: Scanning for projects...
Jul 31, 2013 12:23:51 PM org.apache.maven.cli.event.ExecutionEventLogger sessionStarted
INFO: ------------------------------------------------------------------------
Jul 31, 2013 12:23:51 PM org.apache.maven.cli.event.ExecutionEventLogger sessionStarted
INFO: Reactor Build Order:
Jul 31, 2013 12:23:51 PM org.apache.maven.cli.event.ExecutionEventLogger sessionStarted
INFO: 
Jul 31, 2013 12:23:51 PM org.apache.maven.cli.event.ExecutionEventLogger sessionStarted
INFO: Maven Plugin Testing Mechanism
Jul 31, 2013 12:23:51 PM org.apache.maven.cli.event.ExecutionEventLogger sessionStarted
INFO: Maven Testing Tools
Jul 31, 2013 12:23:51 PM org.apache.maven.cli.event.ExecutionEventLogger sessionStarted
INFO: Maven Plugin Testing Tools
Jul 31, 2013 12:23:51 PM org.apache.maven.cli.event.ExecutionEventLogger sessionStarted
INFO: Maven Plugin Testing
Jul 31, 2013 12:23:51 PM org.apache.maven.cli.event.ExecutionEventLogger projectStarted
INFO:                                                                         
Jul 31, 2013 12:23:51 PM org.apache.maven.cli.event.ExecutionEventLogger projectStarted
INFO: ------------------------------------------------------------------------
Jul 31, 2013 12:23:51 PM org.apache.maven.cli.event.ExecutionEventLogger projectStarted
INFO: Building Maven Plugin Testing Mechanism 2.2-SNAPSHOT
Jul 31, 2013 12:23:51 PM org.apache.maven.cli.event.ExecutionEventLogger projectStarted
INFO: ------------------------------------------------------------------------
Jul 31, 2013 12:23:53 PM org.apache.maven.cli.event.ExecutionEventLogger mojoStarted
INFO: 
Jul 31, 2013 12:23:53 PM org.apache.maven.cli.event.ExecutionEventLogger mojoStarted
INFO: --- maven-clean-plugin:2.5:clean (default-clean) @ maven-plugin-testing-harness ---
Jul 31, 2013 12:23:55 PM org.apache.maven.cli.event.ExecutionEventLogger mojoStarted
INFO: 
Jul 31, 2013 12:23:55 PM org.apache.maven.cli.event.ExecutionEventLogger mojoStarted
INFO: --- maven-remote-resources-plugin:1.3:process (default) @ maven-plugin-testing-harness
---
Jul 31, 2013 12:23:56 PM org.apache.maven.cli.event.ExecutionEventLogger mojoStarted
INFO: 
Jul 31, 2013 12:23:56 PM org.apache.maven.cli.event.ExecutionEventLogger mojoStarted
INFO: --- maven-resources-plugin:2.5:resources (default-resources) @ maven-plugin-testing-harness
---
[debug] execute contextualize
[INFO] Using 'UTF-8' encoding to copy filtered resources.
[INFO] Copying 1 resource
[INFO] Copying 3 resources
Jul 31, 2013 12:23:56 PM org.apache.maven.cli.event.ExecutionEventLogger mojoStarted
INFO: 
Jul 31, 2013 12:23:56 PM org.apache.maven.cli.event.ExecutionEventLogger mojoStarted
INFO: --- maven-compiler-plugin:3.0:compile (default-compile) @ maven-plugin-testing-harness
---
[INFO] Changes detected - recompiling the module!
[INFO] Compiling 13 source files to <https://builds.apache.org/job/maven-plugin-testing/org.apache.maven.plugin-testing$maven-plugin-testing-harness/ws/target/classes>
[INFO] -------------------------------------------------------------
[WARNING] COMPILATION WARNING : 
[INFO] -------------------------------------------------------------
[WARNING] Note: Some input files use or override a deprecated API.
[WARNING] Note: Recompile with -Xlint:deprecation for details.
[INFO] 2 warnings 
[INFO] -------------------------------------------------------------
[INFO] -------------------------------------------------------------
[ERROR] COMPILATION ERROR : 
[INFO] -------------------------------------------------------------
[ERROR] <https://builds.apache.org/job/maven-plugin-testing/org.apache.maven.plugin-testing$maven-plugin-testing-harness/ws/src/main/java/org/apache/maven/plugin/testing/AbstractMojoTestCase.java>:[53,44]
cannot find symbol
symbol  : class MavenAetherModule
location: package org.apache.maven.repository.internal
[ERROR] <https://builds.apache.org/job/maven-plugin-testing/org.apache.maven.plugin-testing$maven-plugin-testing-harness/ws/src/main/java/org/apache/maven/plugin/testing/AbstractMojoTestCase.java>:[54,44]
cannot find symbol
symbol  : class MavenRepositorySystemUtils
location: package org.apache.maven.repository.internal
[ERROR] <https://builds.apache.org/job/maven-plugin-testing/org.apache.maven.plugin-testing$maven-plugin-testing-harness/ws/src/main/java/org/apache/maven/plugin/testing/AbstractMojoTestCase.java>:[53,44]
cannot find symbol
symbol  : class MavenAetherModule
location: package org.apache.maven.repository.internal
[ERROR] <https://builds.apache.org/job/maven-plugin-testing/org.apache.maven.plugin-testing$maven-plugin-testing-harness/ws/src/main/java/org/apache/maven/plugin/testing/AbstractMojoTestCase.java>:[54,44]
cannot find symbol
symbol  : class MavenRepositorySystemUtils
location: package org.apache.maven.repository.internal
[ERROR] <https://builds.apache.org/job/maven-plugin-testing/org.apache.maven.plugin-testing$maven-plugin-testing-harness/ws/src/main/java/org/apache/maven/plugin/testing/AbstractMojoTestCase.java>:[384,61]
cannot find symbol
symbol  : variable MavenRepositorySystemUtils
location: class org.apache.maven.plugin.testing.AbstractMojoTestCase
[INFO] 5 errors 
[INFO] -------------------------------------------------------------

Mime
View raw message