maven-notifications mailing list archives

Site index · List index
Message view « Date » · « Thread »
Top « Date » · « Thread »
From Apache Jenkins Server <jenk...@builds.apache.org>
Subject Build failed in Jenkins: dist-tool-plugin » dist-tool-plugin #135
Date Sun, 14 Jul 2013 00:14:02 GMT
See <https://builds.apache.org/job/dist-tool-plugin/org.apache.maven.dist.tools$dist-tool-plugin/135/>

------------------------------------------
[...truncated 2823 lines...]
[INFO] 
Loading source files for package org.apache.maven.dist.tools...
Constructing Javadoc information...
Registered Taglet org.apache.maven.tools.plugin.javadoc.MojoRequiresDirectInvocationTypeTaglet
...
Registered Taglet org.apache.maven.tools.plugin.javadoc.MojoParameterFieldTaglet ...
Registered Taglet org.apache.maven.tools.plugin.javadoc.MojoGoalTypeTaglet ...
Registered Taglet org.apache.maven.tools.plugin.javadoc.MojoInheritByDefaultTypeTaglet ...
Registered Taglet org.apache.maven.tools.plugin.javadoc.MojoExecuteTypeTaglet ...
Registered Taglet org.apache.maven.tools.plugin.javadoc.MojoRequiresDependencyCollectionTypeTaglet
...
Registered Taglet org.apache.maven.tools.plugin.javadoc.MojoConfiguratorTypeTaglet ...
Registered Taglet org.apache.maven.tools.plugin.javadoc.MojoRequiresDependencyResolutionTypeTaglet
...
Registered Taglet org.apache.maven.tools.plugin.javadoc.MojoRequiresReportsTypeTaglet ...
Registered Taglet org.apache.maven.tools.plugin.javadoc.MojoThreadSafeTypeTaglet ...
Registered Taglet org.apache.maven.tools.plugin.javadoc.MojoAggregatorTypeTaglet ...
Registered Taglet org.apache.maven.tools.plugin.javadoc.MojoRequiresOnLineTypeTaglet ...
Registered Taglet org.apache.maven.tools.plugin.javadoc.MojoRequiredFieldTaglet ...
Registered Taglet org.apache.maven.tools.plugin.javadoc.MojoPhaseTypeTaglet ...
Registered Taglet org.apache.maven.tools.plugin.javadoc.MojoReadOnlyFieldTaglet ...
Registered Taglet org.apache.maven.tools.plugin.javadoc.MojoComponentFieldTaglet ...
Registered Taglet org.apache.maven.tools.plugin.javadoc.MojoInstantiationStrategyTypeTaglet
...
Registered Taglet org.apache.maven.tools.plugin.javadoc.MojoRequiresProjectTypeTaglet ...
Registered Taglet org.apache.maven.tools.plugin.javadoc.MojoExecutionStrategyTypeTaglet ...
Registered Taglet org.codehaus.plexus.javadoc.PlexusConfigurationTaglet ...
Registered Taglet org.codehaus.plexus.javadoc.PlexusRequirementTaglet ...
Registered Taglet org.codehaus.plexus.javadoc.PlexusComponentTaglet ...
Standard Doclet version 1.7.0_04
Building tree for all the packages and classes...
Generating <https://builds.apache.org/job/dist-tool-plugin/org.apache.maven.dist.tools$dist-tool-plugin/ws/target/site/testapidocs/org/apache/maven/dist/tools/PatternTest.html...>
Generating <https://builds.apache.org/job/dist-tool-plugin/org.apache.maven.dist.tools$dist-tool-plugin/ws/target/site/testapidocs/org/apache/maven/dist/tools/package-frame.html...>
Generating <https://builds.apache.org/job/dist-tool-plugin/org.apache.maven.dist.tools$dist-tool-plugin/ws/target/site/testapidocs/org/apache/maven/dist/tools/package-summary.html...>
Generating <https://builds.apache.org/job/dist-tool-plugin/org.apache.maven.dist.tools$dist-tool-plugin/ws/target/site/testapidocs/org/apache/maven/dist/tools/package-tree.html...>
Generating <https://builds.apache.org/job/dist-tool-plugin/org.apache.maven.dist.tools$dist-tool-plugin/ws/target/site/testapidocs/constant-values.html...>
Generating <https://builds.apache.org/job/dist-tool-plugin/org.apache.maven.dist.tools$dist-tool-plugin/ws/target/site/testapidocs/org/apache/maven/dist/tools/class-use/PatternTest.html...>
Generating <https://builds.apache.org/job/dist-tool-plugin/org.apache.maven.dist.tools$dist-tool-plugin/ws/target/site/testapidocs/org/apache/maven/dist/tools/package-use.html...>
Building index for all the packages and classes...
Generating <https://builds.apache.org/job/dist-tool-plugin/org.apache.maven.dist.tools$dist-tool-plugin/ws/target/site/testapidocs/overview-tree.html...>
Generating <https://builds.apache.org/job/dist-tool-plugin/org.apache.maven.dist.tools$dist-tool-plugin/ws/target/site/testapidocs/index-all.html...>
Generating <https://builds.apache.org/job/dist-tool-plugin/org.apache.maven.dist.tools$dist-tool-plugin/ws/target/site/testapidocs/deprecated-list.html...>
Building index for all classes...
Generating <https://builds.apache.org/job/dist-tool-plugin/org.apache.maven.dist.tools$dist-tool-plugin/ws/target/site/testapidocs/allclasses-frame.html...>
Generating <https://builds.apache.org/job/dist-tool-plugin/org.apache.maven.dist.tools$dist-tool-plugin/ws/target/site/testapidocs/allclasses-noframe.html...>
Generating <https://builds.apache.org/job/dist-tool-plugin/org.apache.maven.dist.tools$dist-tool-plugin/ws/target/site/testapidocs/index.html...>
Generating <https://builds.apache.org/job/dist-tool-plugin/org.apache.maven.dist.tools$dist-tool-plugin/ws/target/site/testapidocs/help-doc.html...>
Note: Custom tags that could override future standard tags:  @requiresDependencyResolution,
@requiresReports, @execute, @configurator, @aggregator, @instantiationStrategy, @threadSafe,
@executionStrategy, @goal, @requiresOnline, @parameter, @requiresDirectInvocation, @component,
@inheritByDefault, @requiresProject, @required, @readonly, @phase, @requiresDependencyCollection.
To avoid potential overrides, use at least one period character (.) in custom tag names.
Note: Custom tags that were not seen:  @plexus.requirement, @parameter, @component, @plexus.configuration,
@required, @readonly
1 warning
[WARNING] Javadoc Warnings
[WARNING] javadoc: warning - Error fetching URL: http://commons.apache.org/collections/apidocs-COLLECTIONS_3_0/package-list
[INFO] Generating "FindBugs Report" report    --- findbugs-maven-plugin:2.5.2
[INFO] Locale is en
[INFO] Fork Value is true
     [java] The following classes needed for analysis were missing:
     [java]   org.apache.maven.artifact.repository.Authentication
     [java]   org.apache.maven.repository.Proxy
     [java] Warnings generated: 13
[INFO] Done FindBugs Analysis....
[warn] [XHTML Sink] Modified invalid anchor name: 'org.apache.maven.dist.tools.DistCheckSiteMojo$DistCheckSiteResult'
to 'org.apache.maven.dist.tools.DistCheckSiteMojoDistCheckSiteResult'
[INFO] Generating "Sonar" report    --- maven-report:0.1
[INFO] Generating "Disttool> Sites" report    --- dist-tool-plugin:0.0.1-SNAPSHOT
[INFO] ## line format:
[INFO] ## directory groupId [src+bin]
[INFO] ##   artifactId [forced version]
[INFO] ##
Downloading: http://repo.maven.apache.org/maven2/org/apache/maven/maven-ant-tasks/2.1.3/maven-ant-tasks-2.1.3.pom
Downloaded: http://repo.maven.apache.org/maven2/org/apache/maven/maven-ant-tasks/2.1.3/maven-ant-tasks-2.1.3.pom
(13 KB at 52.4 KB/sec)
Downloading: http://repo.maven.apache.org/maven2/org/apache/maven/archetype/maven-archetype/2.2/maven-archetype-2.2.pom
Downloaded: http://repo.maven.apache.org/maven2/org/apache/maven/archetype/maven-archetype/2.2/maven-archetype-2.2.pom
(15 KB at 642.1 KB/sec)
[INFO] ## binaries
[INFO] ##  doxia-book-maven-plugin
[INFO] ##  doxia-book-renderer
Downloading: http://repo.maven.apache.org/maven2/org/apache/maven/doxia/doxia-converter/1.2/doxia-converter-1.2.pom
Downloaded: http://repo.maven.apache.org/maven2/org/apache/maven/doxia/doxia-converter/1.2/doxia-converter-1.2.pom
(6 KB at 13.7 KB/sec)
Downloading: http://repo.maven.apache.org/maven2/org/apache/maven/doxia/doxia-tools/1.2/doxia-tools-1.2.pom
Downloaded: http://repo.maven.apache.org/maven2/org/apache/maven/doxia/doxia-tools/1.2/doxia-tools-1.2.pom
(9 KB at 21.4 KB/sec)
Downloading: http://repo.maven.apache.org/maven2/org/apache/maven/doxia/doxia-linkcheck/1.2/doxia-linkcheck-1.2.pom
Downloaded: http://repo.maven.apache.org/maven2/org/apache/maven/doxia/doxia-linkcheck/1.2/doxia-linkcheck-1.2.pom
(4 KB at 8.5 KB/sec)
Downloading: http://repo.maven.apache.org/maven2/org/apache/maven/enforcer/enforcer/1.3/enforcer-1.3.pom
Downloaded: http://repo.maven.apache.org/maven2/org/apache/maven/enforcer/enforcer/1.3/enforcer-1.3.pom
(12 KB at 51.6 KB/sec)
Downloading: http://repo.maven.apache.org/maven2/org/apache/maven/indexer/maven-indexer/5.1.1/maven-indexer-5.1.1.pom
Downloaded: http://repo.maven.apache.org/maven2/org/apache/maven/indexer/maven-indexer/5.1.1/maven-indexer-5.1.1.pom
(13 KB at 34.2 KB/sec)
[ERROR] HTTP result code: 404 for http://maven.apache.org/maven-indexer-archives/maven-indexer-5.1.1
[INFO] ## maven-1
[INFO] org.apache.maven:apache-maven metadata latest version value is 3.1.0 but check was
manually set to 2.0.11
Downloading: http://repo.maven.apache.org/maven2/org/apache/maven/apache-maven/2.0.11/apache-maven-2.0.11.pom
Downloaded: http://repo.maven.apache.org/maven2/org/apache/maven/apache-maven/2.0.11/apache-maven-2.0.11.pom
(7 KB at 20.6 KB/sec)
Downloading: http://repo.maven.apache.org/maven2/org/apache/maven/maven/2.0.11/maven-2.0.11.pom
Downloaded: http://repo.maven.apache.org/maven2/org/apache/maven/maven/2.0.11/maven-2.0.11.pom
(22 KB at 533.1 KB/sec)
Downloading: http://repo.maven.apache.org/maven2/org/apache/maven/maven-parent/12/maven-parent-12.pom
Downloaded: http://repo.maven.apache.org/maven2/org/apache/maven/maven-parent/12/maven-parent-12.pom
(22 KB at 786.3 KB/sec)
[ERROR] HTTP result code: 404 for http://maven.apache.org/apache-maven
[INFO] org.apache.maven:apache-maven metadata latest version value is 3.1.0 but check was
manually set to 2.2.1
Downloading: http://repo.maven.apache.org/maven2/org/apache/maven/apache-maven/2.2.1/apache-maven-2.2.1.pom
Downloaded: http://repo.maven.apache.org/maven2/org/apache/maven/apache-maven/2.2.1/apache-maven-2.2.1.pom
(8 KB at 34.6 KB/sec)
[ERROR] HTTP result code: 404 for http://maven.apache.org/apache-maven
[INFO] org.apache.maven:apache-maven metadata latest version value is 3.1.0 but check was
manually set to 3.0.5
Downloading: http://repo.maven.apache.org/maven2/org/apache/maven/apache-maven/3.0.5/apache-maven-3.0.5.pom
Downloaded: http://repo.maven.apache.org/maven2/org/apache/maven/apache-maven/3.0.5/apache-maven-3.0.5.pom
(6 KB at 14.4 KB/sec)
Downloading: http://repo.maven.apache.org/maven2/org/apache/maven/maven/3.0.5/maven-3.0.5.pom
Downloaded: http://repo.maven.apache.org/maven2/org/apache/maven/maven/3.0.5/maven-3.0.5.pom
(22 KB at 62.7 KB/sec)
Downloading: http://repo.maven.apache.org/maven2/org/apache/maven/apache-maven/3.1.0/apache-maven-3.1.0.pom
Downloaded: http://repo.maven.apache.org/maven2/org/apache/maven/apache-maven/3.1.0/apache-maven-3.1.0.pom
(6 KB at 26.6 KB/sec)
Downloading: http://repo.maven.apache.org/maven2/org/apache/maven/maven/3.1.0/maven-3.1.0.pom
Downloaded: http://repo.maven.apache.org/maven2/org/apache/maven/maven/3.1.0/maven-3.1.0.pom
(22 KB at 129.0 KB/sec)
Downloading: http://repo.maven.apache.org/maven2/org/apache/maven/plugin-testing/maven-plugin-testing/2.1/maven-plugin-testing-2.1.pom
Downloaded: http://repo.maven.apache.org/maven2/org/apache/maven/plugin-testing/maven-plugin-testing/2.1/maven-plugin-testing-2.1.pom
(10 KB at 31.0 KB/sec)
Downloading: http://repo.maven.apache.org/maven2/org/apache/maven/plugins/maven-acr-plugin/1.0/maven-acr-plugin-1.0.pom
Downloaded: http://repo.maven.apache.org/maven2/org/apache/maven/plugins/maven-acr-plugin/1.0/maven-acr-plugin-1.0.pom
(6 KB at 6.3 KB/sec)
Downloading: http://repo.maven.apache.org/maven2/org/apache/maven/plugins/maven-ant-plugin/2.3/maven-ant-plugin-2.3.pom
Downloaded: http://repo.maven.apache.org/maven2/org/apache/maven/plugins/maven-ant-plugin/2.3/maven-ant-plugin-2.3.pom
(6 KB at 15.6 KB/sec)
Downloading: http://repo.maven.apache.org/maven2/org/apache/maven/plugins/maven-plugins/16/maven-plugins-16.pom
Downloaded: http://repo.maven.apache.org/maven2/org/apache/maven/plugins/maven-plugins/16/maven-plugins-16.pom
(13 KB at 1264.6 KB/sec)
Downloading: http://repo.maven.apache.org/maven2/org/apache/maven/plugins/maven-antrun-plugin/1.7/maven-antrun-plugin-1.7.pom
Downloaded: http://repo.maven.apache.org/maven2/org/apache/maven/plugins/maven-antrun-plugin/1.7/maven-antrun-plugin-1.7.pom
(5 KB at 402.7 KB/sec)
Downloading: http://repo.maven.apache.org/maven2/org/apache/maven/plugins/maven-assembly-plugin/2.4/maven-assembly-plugin-2.4.pom
Downloaded: http://repo.maven.apache.org/maven2/org/apache/maven/plugins/maven-assembly-plugin/2.4/maven-assembly-plugin-2.4.pom
(17 KB at 514.0 KB/sec)
Downloading: http://repo.maven.apache.org/maven2/org/apache/maven/plugins/maven-changelog-plugin/2.2/maven-changelog-plugin-2.2.pom
Downloaded: http://repo.maven.apache.org/maven2/org/apache/maven/plugins/maven-changelog-plugin/2.2/maven-changelog-plugin-2.2.pom
(13 KB at 33.0 KB/sec)
Downloading: http://repo.maven.apache.org/maven2/org/apache/maven/plugins/maven-changes-plugin/2.9/maven-changes-plugin-2.9.pom
Downloaded: http://repo.maven.apache.org/maven2/org/apache/maven/plugins/maven-changes-plugin/2.9/maven-changes-plugin-2.9.pom
(19 KB at 46.8 KB/sec)
Downloading: http://repo.maven.apache.org/maven2/org/apache/maven/plugins/maven-dependency-plugin/2.8/maven-dependency-plugin-2.8.pom
Downloaded: http://repo.maven.apache.org/maven2/org/apache/maven/plugins/maven-dependency-plugin/2.8/maven-dependency-plugin-2.8.pom
(12 KB at 1118.6 KB/sec)
Downloading: http://repo.maven.apache.org/maven2/org/apache/maven/plugins/maven-doap-plugin/1.1/maven-doap-plugin-1.1.pom
Downloaded: http://repo.maven.apache.org/maven2/org/apache/maven/plugins/maven-doap-plugin/1.1/maven-doap-plugin-1.1.pom
(9 KB at 50.0 KB/sec)
Downloading: http://repo.maven.apache.org/maven2/org/apache/maven/plugins/maven-ear-plugin/2.8/maven-ear-plugin-2.8.pom
Downloaded: http://repo.maven.apache.org/maven2/org/apache/maven/plugins/maven-ear-plugin/2.8/maven-ear-plugin-2.8.pom
(9 KB at 29.9 KB/sec)
Downloading: http://repo.maven.apache.org/maven2/org/apache/maven/plugins/maven-eclipse-plugin/2.9/maven-eclipse-plugin-2.9.pom
Downloaded: http://repo.maven.apache.org/maven2/org/apache/maven/plugins/maven-eclipse-plugin/2.9/maven-eclipse-plugin-2.9.pom
(15 KB at 491.3 KB/sec)
Downloading: http://repo.maven.apache.org/maven2/org/apache/maven/plugins/maven-ejb-plugin/2.3/maven-ejb-plugin-2.3.pom
Downloaded: http://repo.maven.apache.org/maven2/org/apache/maven/plugins/maven-ejb-plugin/2.3/maven-ejb-plugin-2.3.pom
(6 KB at 24.7 KB/sec)
Downloading: http://repo.maven.apache.org/maven2/org/apache/maven/plugins/maven-help-plugin/2.2/maven-help-plugin-2.2.pom
Downloaded: http://repo.maven.apache.org/maven2/org/apache/maven/plugins/maven-help-plugin/2.2/maven-help-plugin-2.2.pom
(9 KB at 655.1 KB/sec)
Downloading: http://repo.maven.apache.org/maven2/org/apache/maven/plugins/maven-idea-plugin/2.2/maven-idea-plugin-2.2.pom
Downloaded: http://repo.maven.apache.org/maven2/org/apache/maven/plugins/maven-idea-plugin/2.2/maven-idea-plugin-2.2.pom
(14 KB at 275.8 KB/sec)
Downloading: http://repo.maven.apache.org/maven2/org/apache/maven/plugins/maven-plugins/11/maven-plugins-11.pom
Downloaded: http://repo.maven.apache.org/maven2/org/apache/maven/plugins/maven-plugins/11/maven-plugins-11.pom
(11 KB at 145.7 KB/sec)
Downloading: http://repo.maven.apache.org/maven2/org/apache/maven/plugins/maven-install-plugin/2.4/maven-install-plugin-2.4.pom
Downloaded: http://repo.maven.apache.org/maven2/org/apache/maven/plugins/maven-install-plugin/2.4/maven-install-plugin-2.4.pom
(7 KB at 9.8 KB/sec)
Downloading: http://repo.maven.apache.org/maven2/org/apache/maven/plugins/maven-invoker-plugin/1.8/maven-invoker-plugin-1.8.pom
Downloaded: http://repo.maven.apache.org/maven2/org/apache/maven/plugins/maven-invoker-plugin/1.8/maven-invoker-plugin-1.8.pom
(13 KB at 31.3 KB/sec)
Downloading: http://repo.maven.apache.org/maven2/org/apache/maven/plugins/maven-jarsigner-plugin/1.2/maven-jarsigner-plugin-1.2.pom
Downloaded: http://repo.maven.apache.org/maven2/org/apache/maven/plugins/maven-jarsigner-plugin/1.2/maven-jarsigner-plugin-1.2.pom
(6 KB at 13.3 KB/sec)
Downloading: http://repo.maven.apache.org/maven2/org/apache/maven/plugins/maven-plugins/14/maven-plugins-14.pom
Downloaded: http://repo.maven.apache.org/maven2/org/apache/maven/plugins/maven-plugins/14/maven-plugins-14.pom
(13 KB at 1020.3 KB/sec)
Downloading: http://repo.maven.apache.org/maven2/org/apache/maven/plugins/maven-javadoc-plugin/2.9.1/maven-javadoc-plugin-2.9.1.pom
Downloaded: http://repo.maven.apache.org/maven2/org/apache/maven/plugins/maven-javadoc-plugin/2.9.1/maven-javadoc-plugin-2.9.1.pom
(16 KB at 1386.6 KB/sec)
Downloading: http://repo.maven.apache.org/maven2/org/apache/maven/plugins/maven-linkcheck-plugin/1.1/maven-linkcheck-plugin-1.1.pom
Downloaded: http://repo.maven.apache.org/maven2/org/apache/maven/plugins/maven-linkcheck-plugin/1.1/maven-linkcheck-plugin-1.1.pom
(7 KB at 15.6 KB/sec)
Downloading: http://repo.maven.apache.org/maven2/org/apache/maven/plugins/maven-one-plugin/1.2/maven-one-plugin-1.2.pom
Downloaded: http://repo.maven.apache.org/maven2/org/apache/maven/plugins/maven-one-plugin/1.2/maven-one-plugin-1.2.pom
(6 KB at 18.0 KB/sec)
Downloading: http://repo.maven.apache.org/maven2/org/apache/maven/plugins/maven-plugins/8/maven-plugins-8.pom
Downloaded: http://repo.maven.apache.org/maven2/org/apache/maven/plugins/maven-plugins/8/maven-plugins-8.pom
(6 KB at 596.8 KB/sec)
Downloading: http://repo.maven.apache.org/maven2/org/apache/maven/plugins/maven-patch-plugin/1.1.1/maven-patch-plugin-1.1.1.pom
Downloaded: http://repo.maven.apache.org/maven2/org/apache/maven/plugins/maven-patch-plugin/1.1.1/maven-patch-plugin-1.1.1.pom
(4 KB at 11.0 KB/sec)
Downloading: http://repo.maven.apache.org/maven2/org/apache/maven/plugins/maven-pdf-plugin/1.2/maven-pdf-plugin-1.2.pom
Downloaded: http://repo.maven.apache.org/maven2/org/apache/maven/plugins/maven-pdf-plugin/1.2/maven-pdf-plugin-1.2.pom
(17 KB at 323.7 KB/sec)
Downloading: http://repo.maven.apache.org/maven2/org/apache/maven/plugins/maven-rar-plugin/2.3/maven-rar-plugin-2.3.pom
Downloaded: http://repo.maven.apache.org/maven2/org/apache/maven/plugins/maven-rar-plugin/2.3/maven-rar-plugin-2.3.pom
(6 KB at 15.7 KB/sec)
Downloading: http://repo.maven.apache.org/maven2/org/apache/maven/plugins/maven-reactor-plugin/1.0/maven-reactor-plugin-1.0.pom
Downloaded: http://repo.maven.apache.org/maven2/org/apache/maven/plugins/maven-reactor-plugin/1.0/maven-reactor-plugin-1.0.pom
(4 KB at 5.3 KB/sec)
Downloading: http://repo.maven.apache.org/maven2/org/apache/maven/plugins/maven-repository-plugin/2.3.1/maven-repository-plugin-2.3.1.pom
Downloaded: http://repo.maven.apache.org/maven2/org/apache/maven/plugins/maven-repository-plugin/2.3.1/maven-repository-plugin-2.3.1.pom
(9 KB at 49.0 KB/sec)
Downloading: http://repo.maven.apache.org/maven2/org/apache/maven/plugins/maven-shade-plugin/2.1/maven-shade-plugin-2.1.pom
Downloaded: http://repo.maven.apache.org/maven2/org/apache/maven/plugins/maven-shade-plugin/2.1/maven-shade-plugin-2.1.pom
(8 KB at 306.4 KB/sec)
Downloading: http://repo.maven.apache.org/maven2/org/apache/maven/plugins/maven-stage-plugin/1.0-alpha-2/maven-stage-plugin-1.0-alpha-2.pom
Downloaded: http://repo.maven.apache.org/maven2/org/apache/maven/plugins/maven-stage-plugin/1.0-alpha-2/maven-stage-plugin-1.0-alpha-2.pom
(8 KB at 19.9 KB/sec)
Downloading: http://repo.maven.apache.org/maven2/org/apache/maven/plugins/maven-plugins/13/maven-plugins-13.pom
Downloaded: http://repo.maven.apache.org/maven2/org/apache/maven/plugins/maven-plugins/13/maven-plugins-13.pom
(12 KB at 221.3 KB/sec)
Downloading: http://repo.maven.apache.org/maven2/org/apache/maven/plugins/maven-toolchains-plugin/1.0/maven-toolchains-plugin-1.0.pom
Downloaded: http://repo.maven.apache.org/maven2/org/apache/maven/plugins/maven-toolchains-plugin/1.0/maven-toolchains-plugin-1.0.pom
(4 KB at 10.1 KB/sec)
Downloading: http://repo.maven.apache.org/maven2/org/apache/maven/plugins/maven-verifier-plugin/1.0/maven-verifier-plugin-1.0.pom
Downloaded: http://repo.maven.apache.org/maven2/org/apache/maven/plugins/maven-verifier-plugin/1.0/maven-verifier-plugin-1.0.pom
(5 KB at 14.6 KB/sec)
Downloading: http://repo.maven.apache.org/maven2/org/apache/maven/plugins/maven-war-plugin/2.4/maven-war-plugin-2.4.pom
Downloaded: http://repo.maven.apache.org/maven2/org/apache/maven/plugins/maven-war-plugin/2.4/maven-war-plugin-2.4.pom
(10 KB at 34.9 KB/sec)
[INFO] org.apache.maven.release:maven-release metadata latest version value is 5 but check
was manually set to 2.4.1
Downloading: http://repo.maven.apache.org/maven2/org/apache/maven/release/maven-release/2.4.1/maven-release-2.4.1.pom
Downloaded: http://repo.maven.apache.org/maven2/org/apache/maven/release/maven-release/2.4.1/maven-release-2.4.1.pom
(6 KB at 30.0 KB/sec)
Downloading: http://repo.maven.apache.org/maven2/org/apache/apache/resources/apache-resource-bundles/4/apache-resource-bundles-4.pom
Downloaded: http://repo.maven.apache.org/maven2/org/apache/apache/resources/apache-resource-bundles/4/apache-resource-bundles-4.pom
(3 KB at 5.5 KB/sec)
Downloading: http://repo.maven.apache.org/maven2/org/apache/apache/resources/apache-source-release-assembly-descriptor/1.0.4/apache-source-release-assembly-descriptor-1.0.4.pom
Downloaded: http://repo.maven.apache.org/maven2/org/apache/apache/resources/apache-source-release-assembly-descriptor/1.0.4/apache-source-release-assembly-descriptor-1.0.4.pom
(8 KB at 29.7 KB/sec)
Downloading: http://repo.maven.apache.org/maven2/org/apache/maven/scm/maven-scm/1.8.1/maven-scm-1.8.1.pom
Downloaded: http://repo.maven.apache.org/maven2/org/apache/maven/scm/maven-scm/1.8.1/maven-scm-1.8.1.pom
(22 KB at 54.7 KB/sec)
[ERROR] HTTP result code: 404 for http://maven.apache.org/shared/file-management/
Downloading: http://repo.maven.apache.org/maven2/org/apache/maven/shared/maven-common-artifact-filters/1.4/maven-common-artifact-filters-1.4.pom
Downloaded: http://repo.maven.apache.org/maven2/org/apache/maven/shared/maven-common-artifact-filters/1.4/maven-common-artifact-filters-1.4.pom
(4 KB at 367.2 KB/sec)
Downloading: http://repo.maven.apache.org/maven2/org/apache/maven/shared/maven-dependency-analyzer/1.4/maven-dependency-analyzer-1.4.pom
Downloaded: http://repo.maven.apache.org/maven2/org/apache/maven/shared/maven-dependency-analyzer/1.4/maven-dependency-analyzer-1.4.pom
(6 KB at 218.8 KB/sec)
Downloading: http://repo.maven.apache.org/maven2/org/apache/maven/shared/maven-invoker/2.1.1/maven-invoker-2.1.1.pom
Downloaded: http://repo.maven.apache.org/maven2/org/apache/maven/shared/maven-invoker/2.1.1/maven-invoker-2.1.1.pom
(6 KB at 15.4 KB/sec)
Downloading: http://repo.maven.apache.org/maven2/org/apache/maven/shared/maven-jarsigner/1.0/maven-jarsigner-1.0.pom
Downloaded: http://repo.maven.apache.org/maven2/org/apache/maven/shared/maven-jarsigner/1.0/maven-jarsigner-1.0.pom
(4 KB at 9.8 KB/sec)
Downloading: http://repo.maven.apache.org/maven2/org/apache/maven/shared/maven-model-converter/2.2/maven-model-converter-2.2.pom
Downloaded: http://repo.maven.apache.org/maven2/org/apache/maven/shared/maven-model-converter/2.2/maven-model-converter-2.2.pom
(3 KB at 8.8 KB/sec)
Downloading: http://repo.maven.apache.org/maven2/org/apache/maven/shared/maven-repository-builder/1.0-alpha-2/maven-repository-builder-1.0-alpha-2.pom
Downloaded: http://repo.maven.apache.org/maven2/org/apache/maven/shared/maven-repository-builder/1.0-alpha-2/maven-repository-builder-1.0-alpha-2.pom
(4 KB at 75.1 KB/sec)
Downloading: http://repo.maven.apache.org/maven2/org/apache/maven/shared/maven-runtime/1.0-alpha-3/maven-runtime-1.0-alpha-3.pom
Downloaded: http://repo.maven.apache.org/maven2/org/apache/maven/shared/maven-runtime/1.0-alpha-3/maven-runtime-1.0-alpha-3.pom
(6 KB at 15.8 KB/sec)
Downloading: http://repo.maven.apache.org/maven2/org/apache/maven/shared/maven-script-interpreter/1.1/maven-script-interpreter-1.1.pom
Downloaded: http://repo.maven.apache.org/maven2/org/apache/maven/shared/maven-script-interpreter/1.1/maven-script-interpreter-1.1.pom
(4 KB at 10.1 KB/sec)
Downloading: http://repo.maven.apache.org/maven2/org/apache/maven/shared/maven-shared-resources/1/maven-shared-resources-1.pom
Downloaded: http://repo.maven.apache.org/maven2/org/apache/maven/shared/maven-shared-resources/1/maven-shared-resources-1.pom
(3 KB at 6.0 KB/sec)
Downloading: http://repo.maven.apache.org/maven2/org/apache/maven/shared/maven-shared-utils/0.4/maven-shared-utils-0.4.pom
Downloaded: http://repo.maven.apache.org/maven2/org/apache/maven/shared/maven-shared-utils/0.4/maven-shared-utils-0.4.pom
(4 KB at 26.7 KB/sec)
Downloading: http://repo.maven.apache.org/maven2/org/apache/maven/shared/maven-verifier/1.4/maven-verifier-1.4.pom
Downloaded: http://repo.maven.apache.org/maven2/org/apache/maven/shared/maven-verifier/1.4/maven-verifier-1.4.pom
(3 KB at 20.7 KB/sec)
Downloading: http://repo.maven.apache.org/maven2/org/apache/maven/skins/maven-application-skin/1.0/maven-application-skin-1.0.pom
Downloaded: http://repo.maven.apache.org/maven2/org/apache/maven/skins/maven-application-skin/1.0/maven-application-skin-1.0.pom
(5 KB at 9.1 KB/sec)
Downloading: http://repo.maven.apache.org/maven2/org/apache/maven/skins/maven-skins/6/maven-skins-6.pom
Downloaded: http://repo.maven.apache.org/maven2/org/apache/maven/skins/maven-skins/6/maven-skins-6.pom
(4 KB at 8.2 KB/sec)
Downloading: http://repo.maven.apache.org/maven2/org/apache/maven/skins/maven-classic-skin/1.1/maven-classic-skin-1.1.pom
Downloaded: http://repo.maven.apache.org/maven2/org/apache/maven/skins/maven-classic-skin/1.1/maven-classic-skin-1.1.pom
(5 KB at 11.8 KB/sec)
Downloading: http://repo.maven.apache.org/maven2/org/apache/maven/skins/maven-default-skin/1.1/maven-default-skin-1.1.pom
Downloaded: http://repo.maven.apache.org/maven2/org/apache/maven/skins/maven-default-skin/1.1/maven-default-skin-1.1.pom
(5 KB at 10.6 KB/sec)
Downloading: http://repo.maven.apache.org/maven2/org/apache/maven/skins/maven-fluido-skin/1.3.0/maven-fluido-skin-1.3.0.pom
Downloaded: http://repo.maven.apache.org/maven2/org/apache/maven/skins/maven-fluido-skin/1.3.0/maven-fluido-skin-1.3.0.pom
(23 KB at 106.4 KB/sec)
Downloading: http://repo.maven.apache.org/maven2/org/apache/maven/skins/maven-skins/7/maven-skins-7.pom
Downloaded: http://repo.maven.apache.org/maven2/org/apache/maven/skins/maven-skins/7/maven-skins-7.pom
(4 KB at 8.4 KB/sec)
Downloading: http://repo.maven.apache.org/maven2/org/apache/maven/skins/maven-stylus-skin/1.5/maven-stylus-skin-1.5.pom
Downloaded: http://repo.maven.apache.org/maven2/org/apache/maven/skins/maven-stylus-skin/1.5/maven-stylus-skin-1.5.pom
(6 KB at 14.5 KB/sec)
Downloading: http://repo.maven.apache.org/maven2/org/apache/maven/surefire/surefire/2.15/surefire-2.15.pom
Downloaded: http://repo.maven.apache.org/maven2/org/apache/maven/surefire/surefire/2.15/surefire-2.15.pom
(19 KB at 133.4 KB/sec)
Downloading: http://repo.maven.apache.org/maven2/org/apache/maven/wagon/wagon/2.4/wagon-2.4.pom
Downloaded: http://repo.maven.apache.org/maven2/org/apache/maven/wagon/wagon/2.4/wagon-2.4.pom
(20 KB at 92.8 KB/sec)
[INFO] Generating "Disttool> Source Release" report    --- dist-tool-plugin:0.0.1-SNAPSHOT
[INFO] ## line format:
[INFO] ## directory groupId [src+bin]
[INFO] ##   artifactId [forced version]
[INFO] ##
[INFO] ## binaries
[INFO] ##  doxia-book-maven-plugin
[INFO] ##  doxia-book-renderer
[ERROR] Missing file for doxia-linkcheck in http://repo.maven.apache.org/maven2/org/apache/maven/doxia/doxia-linkcheck/1.2
[ERROR]  > doxia-linkcheck-1.2-source-release.zip <
[ERROR]  > doxia-linkcheck-1.2-source-release.zip.asc <
[ERROR]  > doxia-linkcheck-1.2-source-release.zip.md5 <
[ERROR] Missing file for doxia-linkcheck in http://www.apache.org/dist/maven/doxia
[ERROR]  > doxia-linkcheck-1.2-source-release.zip <
[ERROR]  > doxia-linkcheck-1.2-source-release.zip.asc <
[ERROR]  > doxia-linkcheck-1.2-source-release.zip.md5 <
[INFO] ## maven-1
[INFO] org.apache.maven:apache-maven metadata latest version value is 3.1.0 but check was
manually set to 2.0.11
[ERROR] Missing file for apache-maven in http://repo.maven.apache.org/maven2/org/apache/maven/apache-maven/2.0.11
[ERROR]  > apache-maven-2.0.11-src.zip <
[ERROR]  > apache-maven-2.0.11-src.zip.asc <
[ERROR]  > apache-maven-2.0.11-src.zip.md5 <
[INFO] org.apache.maven:apache-maven metadata latest version value is 3.1.0 but check was
manually set to 2.2.1
[INFO] org.apache.maven:apache-maven metadata latest version value is 3.1.0 but check was
manually set to 3.0.5
[JENKINS] Archiving site from <https://builds.apache.org/job/dist-tool-plugin/org.apache.maven.dist.tools$dist-tool-plugin/ws/target/site>
to /home/hudson/hudson/jobs/dist-tool-plugin/site
Successfully loaded native POSIX impl.

Mime
View raw message