maven-notifications mailing list archives

Site index · List index
Message view « Date » · « Thread »
Top « Date » · « Thread »
From Apache Jenkins Server <jenk...@builds.apache.org>
Subject Build failed in Jenkins: maven-enforcer #43
Date Thu, 25 Jul 2013 12:03:04 GMT
See <https://builds.apache.org/job/maven-enforcer/43/changes>

Changes:

[olamy] bump to 2.0-SNAPSHOT version

[olamy] Apache formatting :-).

[olamy] Add an integration test, which only warns but does not fail the build.

[olamy] Implement switching between warnings and errors.

[olamy] Add new interface which includes level.

[olamy] Add invoker test.

[olamy] Change the displayed message for recommendations.

[olamy] Use Apache formatting rules.

[olamy] Use alternative solution for never failing the build when recommend is executed.

[olamy] Add recommend mojo. In contrast to enforce, this will never fail the build but only
display a warning.

[Robert Scholte] [maven-release-plugin] prepare for next development iteration

[Robert Scholte] [maven-release-plugin] prepare release enforcer-1.3.1

[Robert Scholte] Add license to file headers

[Robert Scholte] [MENFORCER-157] NOTICE file bad indentation & references software which
is not actually included

[Robert Scholte] [MENFORCER-157] NOTICE file bad indentation & references software which
is not actually included

[Robert Scholte] Remove floating comment
Remove @version

[Robert Scholte] Set version to 1.3.1-SNAPSHOT

[Robert Scholte] Lock version of maven-javadoc plugin to trigger security fix

[Robert Scholte] [MENFORCER-157][MENFORCER-158]
Move LICENSE and notice to root folder of enforcer project (http://www.apache.org/dev/licensing-howto.html#source-tree-location)
Fix content of NOTICE and LICENSE (now in sync with the files bundled in the jars)

[Robert Scholte] Fix invalid copy/paste of NOTICE file

[Robert Scholte] Adjust project name to better reflect its origin

[Robert Scholte] [MENFORCER-156] Upgrading maven-enforcer-plugin from 1.2 to 1.3 breaks maven-assembly-plugin
Remove requiresDependencyCollection from @Mojo annotation; this is covered by  the DependecyGraphBuilder

[Robert Scholte] Fix copy/paste URLs

[Robert Scholte] Add site-release profile + README.txt for the next release manager

[Robert Scholte] [maven-release-plugin] prepare for next development iteration

[Robert Scholte] [maven-release-plugin] prepare release enforcer-1.3

[Robert Scholte] [maven-release-plugin] rollback the release of enforcer-1.3

[Robert Scholte] [maven-release-plugin] prepare release enforcer-1.3

[Robert Scholte] Deprecate all public fields

[Robert Scholte] Revert visibility of fields, so external projects can still use them, even
though they should use the getters/setters

[Robert Scholte] Release dropped, set version back to 1.3-SNAPSHOT

[Robert Scholte] [maven-release-plugin] prepare for next development iteration

[Robert Scholte] [maven-release-plugin] prepare release enforcer-1.3

[Robert Scholte] Always use DependencyGraphBuilder to get the dependencies
Default lookup fails with M2, so when component lookup fails, fall back to Maven2DependencyGraphBuilder

[Robert Scholte] Restrict Maven version, plugin can only be used with M3+

[Robert Scholte] Make AbstractBanDependencies M2 proof

[Robert Scholte] Restrict IT to Maven 3.0+, since Maven-2.2.1 (core) fails to download the
file, so the rule is never tested.

[Robert Scholte] Fix for M2, which already succeeds for M3

[Robert Scholte] upgrade maven-common-artifact-filters to 1.4

[Robert Scholte] Fix checkstyle errors

[Robert Scholte] Fix checkstyle errors

[Robert Scholte] Fix checkstyle errors

[Robert Scholte] Fix checkstyle errors

[Robert Scholte] [MENFORCER-146] requireUpperBoundDeps inneffective when DependencyManagement
is used

[Robert Scholte] [MENFORCER-155] Add rule RequirePrerequisites

[Robert Scholte] [MENFORCER-153] Use Mock Repository Manager for ITs

[Robert Scholte] rename to match naming standards of other ITs

[Robert Scholte] rename to match naming standards of other ITs

[Robert Scholte] [MENFORCER-147] Add RequireSameVersions

[Robert Scholte] Avoid using if statements without curly braces

[Robert Scholte] Avoid inefficient String Buffering

[Robert Scholte] Add deploySite script for Windows users like me

[Robert Scholte] [MENFORCER-92] RequirePluginVersions fails when POM artifactId contains an
expression referring to a POM property

[Robert Scholte] [MENFORCER-126] requirePluginVersions misreports plugins with artifactIds
defined through properties

[Robert Scholte] [MENFORCER-134] Require Upper Bound Dependencies and matching Snapshot Dependencies

Improve IT

[Robert Scholte] [MENFORCER-134] Require Upper Bound Dependencies and matching Snapshot Dependencies

[Robert Scholte] [MENFORCER-153] Use Mock Repository Manager for ITs

[Robert Scholte] [MENFORCER-42] Maven-Enforcer-Plugin fails in multimodule project when artifacts
not in repository

[Robert Scholte] Skip for current Maven3.1 release, until tychoteam has fixed the plugin.
With every newer Maven-version this test should be active again, since it should test for
regression

[Robert Scholte] Apply generics

[Robert Scholte] [MENFORCER-123] BannedDependencies version number not taken into account

Update docs

[Robert Scholte] [MENFORCER-148] Broken hyperlink on Enforcer plugin usage page

[Robert Scholte] [MENFORCER-122] Adding repository causes NPE during mvn install
Add IT, can't reproduce issue although found a potential NPE when Repository.getReleases()
== null

[Robert Scholte] [MENFORCER-74] The bannedDependencies rule should support classifier
[MENFORCER-75] The bannedDependencies rule should support scope condition

[Robert Scholte] [MENFORCER-83] Banned dependencies should support regular expressions

[Robert Scholte] [MENFORCER-15] Use Mock Repository Manager for ITs

[Robert Scholte] [MENFORCER-15] Use Mock Repository Manager for ITs

[Robert Scholte] [MENFORCER-15] Use Mock Repository Manager for ITs

[Robert Scholte] [MENFORCER-154] Update maven-dependency-tree to 2.1 to make it work with
Maven-3.1+

[Robert Scholte] [MENFORCER-153] adjust projectsDirectory

[Robert Scholte] Move ITs to projects-folder, next to mrm-folder

[Robert Scholte] [MENFORCER-153] prepare new folder structure

[Robert Scholte] [MENFORCER-152] also check depManagement and profiles

[Robert Scholte] [MENFORCER-152] Refactor code, there are more spots with dependencies

[Robert Scholte] [MENFORCER-152] Add Rule: BanDuplicatePomDependencyVersions
See also MNG-5091: Add option to fail build if WARNING's appear in POM

[olamy] [MENFORCER-149] Broken links to properties of "Require OS Version" of Maven Enforcer
Plugin

[olamy] add aggregated javadoc

[olamy] configure site deployment with svnpubsub

[olamy] remove cobertura clean

[olamy] inherit assembly plugin version from parent

[olamy] we are now 1.5 java

[olamy] cobertura report is available in sonar instance

[olamy] remove section inherited from last parent

[olamy] inherit developpers list from parent

[olamy] use last parent

------------------------------------------
[...truncated 442 lines...]
INFO: ------------------------------------------------------------------------
Jul 25, 2013 11:55:47 AM org.apache.maven.cli.event.ExecutionEventLogger projectStarted
INFO: Building Apache Maven Enforcer 2.0-SNAPSHOT
Jul 25, 2013 11:55:47 AM org.apache.maven.cli.event.ExecutionEventLogger projectStarted
INFO: ------------------------------------------------------------------------
Jul 25, 2013 11:56:04 AM org.apache.maven.cli.event.ExecutionEventLogger mojoStarted
INFO: 
Jul 25, 2013 11:56:04 AM org.apache.maven.cli.event.ExecutionEventLogger mojoStarted
INFO: --- maven-clean-plugin:2.5:clean (default-clean) @ enforcer ---
Jul 25, 2013 11:58:30 AM org.apache.maven.cli.event.ExecutionEventLogger mojoStarted
INFO: 
Jul 25, 2013 11:58:30 AM org.apache.maven.cli.event.ExecutionEventLogger mojoStarted
INFO: --- maven-remote-resources-plugin:1.4:process (default) @ enforcer ---
Jul 25, 2013 11:59:01 AM org.apache.maven.cli.event.ExecutionEventLogger mojoStarted
INFO: 
Jul 25, 2013 11:59:01 AM org.apache.maven.cli.event.ExecutionEventLogger mojoStarted
INFO: --- maven-site-plugin:3.2:attach-descriptor (attach-descriptor) @ enforcer ---
Jul 25, 2013 11:59:28 AM org.apache.maven.cli.event.ExecutionEventLogger mojoStarted
INFO: 
Jul 25, 2013 11:59:28 AM org.apache.maven.cli.event.ExecutionEventLogger mojoStarted
INFO: --- maven-install-plugin:2.3.1:install (default-install) @ enforcer ---
[INFO] Installing <https://builds.apache.org/job/maven-enforcer/ws/pom.xml> to /export/home/hudson/hudson-slave/maven-repositories/0/org/apache/maven/enforcer/enforcer/2.0-SNAPSHOT/enforcer-2.0-SNAPSHOT.pom
[INFO] Installing <https://builds.apache.org/job/maven-enforcer/ws/target/enforcer-2.0-SNAPSHOT-site.xml>
to /export/home/hudson/hudson-slave/maven-repositories/0/org/apache/maven/enforcer/enforcer/2.0-SNAPSHOT/enforcer-2.0-SNAPSHOT-site.xml
Jul 25, 2013 11:59:35 AM org.apache.maven.cli.event.ExecutionEventLogger projectStarted
INFO:                                                                         
Jul 25, 2013 11:59:35 AM org.apache.maven.cli.event.ExecutionEventLogger projectStarted
INFO: ------------------------------------------------------------------------
Jul 25, 2013 11:59:35 AM org.apache.maven.cli.event.ExecutionEventLogger projectStarted
INFO: Building Apache Maven Enforcer API 2.0-SNAPSHOT
Jul 25, 2013 11:59:35 AM org.apache.maven.cli.event.ExecutionEventLogger projectStarted
INFO: ------------------------------------------------------------------------
Jul 25, 2013 11:59:44 AM org.apache.maven.cli.event.ExecutionEventLogger mojoStarted
INFO: 
Jul 25, 2013 11:59:44 AM org.apache.maven.cli.event.ExecutionEventLogger mojoStarted
INFO: --- maven-clean-plugin:2.5:clean (default-clean) @ enforcer-api ---
Jul 25, 2013 11:59:46 AM org.apache.maven.cli.event.ExecutionEventLogger mojoStarted
INFO: 
Jul 25, 2013 11:59:46 AM org.apache.maven.cli.event.ExecutionEventLogger mojoStarted
INFO: --- maven-remote-resources-plugin:1.4:process (default) @ enforcer-api ---
Jul 25, 2013 11:59:48 AM org.apache.maven.cli.event.ExecutionEventLogger mojoStarted
INFO: 
Jul 25, 2013 11:59:48 AM org.apache.maven.cli.event.ExecutionEventLogger mojoStarted
INFO: --- maven-resources-plugin:2.6:resources (default-resources) @ enforcer-api ---
[INFO] Using 'UTF-8' encoding to copy filtered resources.
[INFO] skip non existing resourceDirectory <https://builds.apache.org/job/maven-enforcer/ws/enforcer-api/src/main/resources>
[INFO] Copying 3 resources
Jul 25, 2013 11:59:49 AM org.apache.maven.cli.event.ExecutionEventLogger mojoStarted
INFO: 
Jul 25, 2013 11:59:49 AM org.apache.maven.cli.event.ExecutionEventLogger mojoStarted
INFO: --- maven-compiler-plugin:3.0:compile (default-compile) @ enforcer-api ---
[INFO] Changes detected - recompiling the module!
[INFO] Compiling 5 source files to <https://builds.apache.org/job/maven-enforcer/ws/enforcer-api/target/classes>
Jul 25, 2013 12:00:11 PM org.apache.maven.cli.event.ExecutionEventLogger mojoStarted
INFO: 
Jul 25, 2013 12:00:11 PM org.apache.maven.cli.event.ExecutionEventLogger mojoStarted
INFO: --- maven-resources-plugin:2.6:testResources (default-testResources) @ enforcer-api
---
[INFO] Using 'UTF-8' encoding to copy filtered resources.
[INFO] skip non existing resourceDirectory <https://builds.apache.org/job/maven-enforcer/ws/enforcer-api/src/test/resources>
[INFO] Copying 3 resources
Jul 25, 2013 12:00:12 PM org.apache.maven.cli.event.ExecutionEventLogger mojoStarted
INFO: 
Jul 25, 2013 12:00:12 PM org.apache.maven.cli.event.ExecutionEventLogger mojoStarted
INFO: --- maven-compiler-plugin:3.0:testCompile (default-testCompile) @ enforcer-api ---
[INFO] No sources to compile
Jul 25, 2013 12:00:15 PM org.apache.maven.cli.event.ExecutionEventLogger mojoStarted
INFO: 
Jul 25, 2013 12:00:15 PM org.apache.maven.cli.event.ExecutionEventLogger mojoStarted
INFO: --- maven-surefire-plugin:2.12.4:test (default-test) @ enforcer-api ---
[JENKINS] Recording test results
Jul 25, 2013 12:00:24 PM org.apache.maven.cli.event.ExecutionEventLogger mojoStarted
INFO: 
Jul 25, 2013 12:00:24 PM org.apache.maven.cli.event.ExecutionEventLogger mojoStarted
INFO: --- maven-jar-plugin:2.4:jar (default-jar) @ enforcer-api ---
[INFO] Building jar: <https://builds.apache.org/job/maven-enforcer/ws/enforcer-api/target/enforcer-api-2.0-SNAPSHOT.jar>
Jul 25, 2013 12:00:35 PM org.apache.maven.cli.event.ExecutionEventLogger mojoStarted
INFO: 
Jul 25, 2013 12:00:35 PM org.apache.maven.cli.event.ExecutionEventLogger mojoStarted
INFO: --- maven-site-plugin:3.2:attach-descriptor (attach-descriptor) @ enforcer-api ---
Jul 25, 2013 12:00:36 PM org.apache.maven.cli.event.ExecutionEventLogger mojoStarted
INFO: 
Jul 25, 2013 12:00:36 PM org.apache.maven.cli.event.ExecutionEventLogger mojoStarted
INFO: --- maven-install-plugin:2.3.1:install (default-install) @ enforcer-api ---
[INFO] Installing <https://builds.apache.org/job/maven-enforcer/ws/enforcer-api/target/enforcer-api-2.0-SNAPSHOT.jar>
to /export/home/hudson/hudson-slave/maven-repositories/0/org/apache/maven/enforcer/enforcer-api/2.0-SNAPSHOT/enforcer-api-2.0-SNAPSHOT.jar
[INFO] Installing <https://builds.apache.org/job/maven-enforcer/ws/enforcer-api/pom.xml>
to /export/home/hudson/hudson-slave/maven-repositories/0/org/apache/maven/enforcer/enforcer-api/2.0-SNAPSHOT/enforcer-api-2.0-SNAPSHOT.pom
Jul 25, 2013 12:00:43 PM org.apache.maven.cli.event.ExecutionEventLogger projectStarted
INFO:                                                                         
Jul 25, 2013 12:00:43 PM org.apache.maven.cli.event.ExecutionEventLogger projectStarted
INFO: ------------------------------------------------------------------------
Jul 25, 2013 12:00:43 PM org.apache.maven.cli.event.ExecutionEventLogger projectStarted
INFO: Building Apache Maven Enforcer Rules 2.0-SNAPSHOT
Jul 25, 2013 12:00:43 PM org.apache.maven.cli.event.ExecutionEventLogger projectStarted
INFO: ------------------------------------------------------------------------
Downloading: http://repo.maven.apache.org/maven2/org/mockito/mockito-core/1.9.0/mockito-core-1.9.0.pom
Downloaded: http://repo.maven.apache.org/maven2/org/mockito/mockito-core/1.9.0/mockito-core-1.9.0.pom
(2 KB at 3.3 KB/sec)
Downloading: http://repo.maven.apache.org/maven2/org/mockito/mockito-core/1.9.0/mockito-core-1.9.0.jar
Downloaded: http://repo.maven.apache.org/maven2/org/mockito/mockito-core/1.9.0/mockito-core-1.9.0.jar
(1382 KB at 11605.2 KB/sec)
Jul 25, 2013 12:01:05 PM org.apache.maven.cli.event.ExecutionEventLogger mojoStarted
INFO: 
Jul 25, 2013 12:01:05 PM org.apache.maven.cli.event.ExecutionEventLogger mojoStarted
INFO: --- maven-clean-plugin:2.5:clean (default-clean) @ enforcer-rules ---
Jul 25, 2013 12:01:06 PM org.apache.maven.cli.event.ExecutionEventLogger mojoStarted
INFO: 
Jul 25, 2013 12:01:06 PM org.apache.maven.cli.event.ExecutionEventLogger mojoStarted
INFO: --- maven-remote-resources-plugin:1.4:process (default) @ enforcer-rules ---
Jul 25, 2013 12:01:12 PM org.apache.maven.cli.event.ExecutionEventLogger mojoStarted
INFO: 
Jul 25, 2013 12:01:12 PM org.apache.maven.cli.event.ExecutionEventLogger mojoStarted
INFO: --- maven-resources-plugin:2.6:resources (default-resources) @ enforcer-rules ---
[INFO] Using 'UTF-8' encoding to copy filtered resources.
[INFO] skip non existing resourceDirectory <https://builds.apache.org/job/maven-enforcer/ws/enforcer-rules/src/main/resources>
[INFO] Copying 3 resources
Jul 25, 2013 12:01:13 PM org.apache.maven.cli.event.ExecutionEventLogger mojoStarted
INFO: 
Jul 25, 2013 12:01:13 PM org.apache.maven.cli.event.ExecutionEventLogger mojoStarted
INFO: --- maven-compiler-plugin:3.0:compile (default-compile) @ enforcer-rules ---
[INFO] Changes detected - recompiling the module!
[INFO] Compiling 37 source files to <https://builds.apache.org/job/maven-enforcer/ws/enforcer-rules/target/classes>
[WARNING] Note: Some input files use unchecked or unsafe operations.
[WARNING] Note: Recompile with -Xlint:unchecked for details.
Jul 25, 2013 12:01:45 PM org.apache.maven.cli.event.ExecutionEventLogger mojoStarted
INFO: 
Jul 25, 2013 12:01:45 PM org.apache.maven.cli.event.ExecutionEventLogger mojoStarted
INFO: --- maven-resources-plugin:2.6:testResources (default-testResources) @ enforcer-rules
---
[INFO] Using 'UTF-8' encoding to copy filtered resources.
[INFO] Copying 21 resources
[INFO] Copying 3 resources
Jul 25, 2013 12:01:47 PM org.apache.maven.cli.event.ExecutionEventLogger mojoStarted
INFO: 
Jul 25, 2013 12:01:47 PM org.apache.maven.cli.event.ExecutionEventLogger mojoStarted
INFO: --- maven-compiler-plugin:3.0:testCompile (default-testCompile) @ enforcer-rules ---
[INFO] Changes detected - recompiling the module!
[INFO] Compiling 28 source files to <https://builds.apache.org/job/maven-enforcer/ws/enforcer-rules/target/test-classes>
[WARNING] Note: Some input files use or override a deprecated API.
[WARNING] Note: Recompile with -Xlint:deprecation for details.
[WARNING] Note: Some input files use unchecked or unsafe operations.
[WARNING] Note: Recompile with -Xlint:unchecked for details.
Jul 25, 2013 12:01:57 PM org.apache.maven.cli.event.ExecutionEventLogger mojoStarted
INFO: 
Jul 25, 2013 12:01:57 PM org.apache.maven.cli.event.ExecutionEventLogger mojoStarted
INFO: --- maven-surefire-plugin:2.12.4:test (default-test) @ enforcer-rules ---
[INFO] Surefire report directory: <https://builds.apache.org/job/maven-enforcer/ws/enforcer-rules/target/surefire-reports>

-------------------------------------------------------
 T E S T S
-------------------------------------------------------

Results :

Tests run: 0, Failures: 0, Errors: 0, Skipped: 0

[JENKINS] Recording test results
Jul 25, 2013 12:02:10 PM org.apache.maven.cli.event.ExecutionEventLogger projectSkipped
INFO:                                                                         
Jul 25, 2013 12:02:10 PM org.apache.maven.cli.event.ExecutionEventLogger projectSkipped
INFO: ------------------------------------------------------------------------
Jul 25, 2013 12:02:10 PM org.apache.maven.cli.event.ExecutionEventLogger projectSkipped
INFO: Skipping Apache Maven Enforcer Plugin
Jul 25, 2013 12:02:10 PM org.apache.maven.cli.event.ExecutionEventLogger projectSkipped
INFO: This project has been banned from the build due to previous failures.
Jul 25, 2013 12:02:10 PM org.apache.maven.cli.event.ExecutionEventLogger projectSkipped
INFO: ------------------------------------------------------------------------
Jul 25, 2013 12:02:10 PM org.apache.maven.cli.event.ExecutionEventLogger logReactorSummary
INFO: ------------------------------------------------------------------------
Jul 25, 2013 12:02:10 PM org.apache.maven.cli.event.ExecutionEventLogger logReactorSummary
INFO: Reactor Summary:
Jul 25, 2013 12:02:10 PM org.apache.maven.cli.event.ExecutionEventLogger logReactorSummary
INFO: 
Jul 25, 2013 12:02:10 PM org.apache.maven.cli.event.ExecutionEventLogger logReactorSummary
INFO: Apache Maven Enforcer ............................. SUCCESS [3:52.604s]
Jul 25, 2013 12:02:10 PM org.apache.maven.cli.event.ExecutionEventLogger logReactorSummary
INFO: Apache Maven Enforcer API ......................... SUCCESS [1:06.316s]
Jul 25, 2013 12:02:10 PM org.apache.maven.cli.event.ExecutionEventLogger logReactorSummary
INFO: Apache Maven Enforcer Rules ....................... FAILURE [1:26.806s]
Jul 25, 2013 12:02:10 PM org.apache.maven.cli.event.ExecutionEventLogger logReactorSummary
INFO: Apache Maven Enforcer Plugin ...................... SKIPPED
Jul 25, 2013 12:02:10 PM org.apache.maven.cli.event.ExecutionEventLogger logResult
INFO: ------------------------------------------------------------------------
Jul 25, 2013 12:02:10 PM org.apache.maven.cli.event.ExecutionEventLogger logResult
INFO: BUILD FAILURE
Jul 25, 2013 12:02:10 PM org.apache.maven.cli.event.ExecutionEventLogger logStats
INFO: ------------------------------------------------------------------------
Jul 25, 2013 12:02:10 PM org.apache.maven.cli.event.ExecutionEventLogger logStats
INFO: Total time: 6:42.807s
Jul 25, 2013 12:02:10 PM org.apache.maven.cli.event.ExecutionEventLogger logStats
INFO: Finished at: Thu Jul 25 12:02:10 GMT+00:00 2013
Jul 25, 2013 12:02:11 PM org.apache.maven.cli.event.ExecutionEventLogger logStats
INFO: Final Memory: 18M/72M
Jul 25, 2013 12:02:11 PM org.apache.maven.cli.event.ExecutionEventLogger sessionEnded
INFO: ------------------------------------------------------------------------
[JENKINS] Archiving <https://builds.apache.org/job/maven-enforcer/ws/enforcer-api/pom.xml>
to /home/hudson/hudson/jobs/maven-enforcer/modules/org.apache.maven.enforcer$enforcer-api/builds/2013-07-25_11-53-02/archive/org.apache.maven.enforcer/enforcer-api/2.0-SNAPSHOT/enforcer-api-2.0-SNAPSHOT.pom
[JENKINS] Archiving <https://builds.apache.org/job/maven-enforcer/ws/enforcer-api/target/enforcer-api-2.0-SNAPSHOT.jar>
to /home/hudson/hudson/jobs/maven-enforcer/modules/org.apache.maven.enforcer$enforcer-api/builds/2013-07-25_11-53-02/archive/org.apache.maven.enforcer/enforcer-api/2.0-SNAPSHOT/enforcer-api-2.0-SNAPSHOT.jar
[JENKINS] Archiving <https://builds.apache.org/job/maven-enforcer/ws/pom.xml> to /home/hudson/hudson/jobs/maven-enforcer/modules/org.apache.maven.enforcer$enforcer/builds/2013-07-25_11-53-00/archive/org.apache.maven.enforcer/enforcer/2.0-SNAPSHOT/enforcer-2.0-SNAPSHOT.pom
[JENKINS] Archiving <https://builds.apache.org/job/maven-enforcer/ws/target/enforcer-2.0-SNAPSHOT-site.xml>
to /home/hudson/hudson/jobs/maven-enforcer/modules/org.apache.maven.enforcer$enforcer/builds/2013-07-25_11-53-00/archive/org.apache.maven.enforcer/enforcer/2.0-SNAPSHOT/enforcer-2.0-SNAPSHOT-site.xml
[JENKINS] Archiving <https://builds.apache.org/job/maven-enforcer/ws/enforcer-rules/pom.xml>
to /home/hudson/hudson/jobs/maven-enforcer/modules/org.apache.maven.enforcer$enforcer-rules/builds/2013-07-25_11-53-03/archive/org.apache.maven.enforcer/enforcer-rules/2.0-SNAPSHOT/enforcer-rules-2.0-SNAPSHOT.pom
[JENKINS] Archiving <https://builds.apache.org/job/maven-enforcer/ws/maven-enforcer-plugin/pom.xml>
to /home/hudson/hudson/jobs/maven-enforcer/modules/org.apache.maven.plugins$maven-enforcer-plugin/builds/2013-07-25_11-53-05/archive/org.apache.maven.plugins/maven-enforcer-plugin/2.0-SNAPSHOT/maven-enforcer-plugin-2.0-SNAPSHOT.pom
Waiting for Jenkins to finish collecting data
mavenExecutionResult exceptions not empty
message : Failed to execute goal org.apache.maven.plugins:maven-surefire-plugin:2.12.4:test
(default-test) on project enforcer-rules: Execution default-test of goal org.apache.maven.plugins:maven-surefire-plugin:2.12.4:test
failed: The forked VM terminated without saying properly goodbye. VM crash or System.exit
called ?
cause : Execution default-test of goal org.apache.maven.plugins:maven-surefire-plugin:2.12.4:test
failed: The forked VM terminated without saying properly goodbye. VM crash or System.exit
called ?
Stack trace : 
org.apache.maven.lifecycle.LifecycleExecutionException: Failed to execute goal org.apache.maven.plugins:maven-surefire-plugin:2.12.4:test
(default-test) on project enforcer-rules: Execution default-test of goal org.apache.maven.plugins:maven-surefire-plugin:2.12.4:test
failed: The forked VM terminated without saying properly goodbye. VM crash or System.exit
called ?
	at org.apache.maven.lifecycle.internal.MojoExecutor.execute(MojoExecutor.java:225)
	at org.apache.maven.lifecycle.internal.MojoExecutor.execute(MojoExecutor.java:153)
	at org.apache.maven.lifecycle.internal.MojoExecutor.execute(MojoExecutor.java:145)
	at org.apache.maven.lifecycle.internal.LifecycleModuleBuilder.buildProject(LifecycleModuleBuilder.java:84)
	at org.apache.maven.lifecycle.internal.LifecycleModuleBuilder.buildProject(LifecycleModuleBuilder.java:59)
	at org.apache.maven.lifecycle.internal.LifecycleStarter.singleThreadedBuild(LifecycleStarter.java:183)
	at org.apache.maven.lifecycle.internal.LifecycleStarter.execute(LifecycleStarter.java:161)
	at org.apache.maven.DefaultMaven.doExecute(DefaultMaven.java:320)
	at org.apache.maven.DefaultMaven.execute(DefaultMaven.java:156)
	at org.jvnet.hudson.maven3.launcher.Maven3Launcher.main(Maven3Launcher.java:117)
	at sun.reflect.NativeMethodAccessorImpl.invoke0(Native Method)
	at sun.reflect.NativeMethodAccessorImpl.invoke(NativeMethodAccessorImpl.java:39)
	at sun.reflect.DelegatingMethodAccessorImpl.invoke(DelegatingMethodAccessorImpl.java:25)
	at java.lang.reflect.Method.invoke(Method.java:597)
	at org.codehaus.plexus.classworlds.launcher.Launcher.launchStandard(Launcher.java:329)
	at org.codehaus.plexus.classworlds.launcher.Launcher.launch(Launcher.java:239)
	at org.jvnet.hudson.maven3.agent.Maven3Main.launch(Maven3Main.java:178)
	at sun.reflect.NativeMethodAccessorImpl.invoke0(Native Method)
	at sun.reflect.NativeMethodAccessorImpl.invoke(NativeMethodAccessorImpl.java:39)
	at sun.reflect.DelegatingMethodAccessorImpl.invoke(DelegatingMethodAccessorImpl.java:25)
	at java.lang.reflect.Method.invoke(Method.java:597)
	at hudson.maven.Maven3Builder.call(Maven3Builder.java:129)
	at hudson.maven.Maven3Builder.call(Maven3Builder.java:67)
	at hudson.remoting.UserRequest.perform(UserRequest.java:118)
	at hudson.remoting.UserRequest.perform(UserRequest.java:48)
	at hudson.remoting.Request$2.run(Request.java:326)
	at hudson.remoting.InterceptingExecutorService$1.call(InterceptingExecutorService.java:72)
	at java.util.concurrent.FutureTask$Sync.innerRun(FutureTask.java:303)
	at java.util.concurrent.FutureTask.run(FutureTask.java:138)
	at java.util.concurrent.ThreadPoolExecutor$Worker.runTask(ThreadPoolExecutor.java:886)
	at java.util.concurrent.ThreadPoolExecutor$Worker.run(ThreadPoolExecutor.java:908)
	at java.lang.Thread.run(Thread.java:662)
Caused by: org.apache.maven.plugin.PluginExecutionException: Execution default-test of goal
org.apache.maven.plugins:maven-surefire-plugin:2.12.4:test failed: The forked VM terminated
without saying properly goodbye. VM crash or System.exit called ?
	at org.apache.maven.plugin.DefaultBuildPluginManager.executeMojo(DefaultBuildPluginManager.java:110)
	at org.apache.maven.lifecycle.internal.MojoExecutor.execute(MojoExecutor.java:209)
	... 31 more
Caused by: java.lang.RuntimeException: The forked VM terminated without saying properly goodbye.
VM crash or System.exit called ?
	at org.apache.maven.plugin.surefire.booterclient.output.ForkClient.close(ForkClient.java:257)
	at org.apache.maven.plugin.surefire.booterclient.ForkStarter.fork(ForkStarter.java:301)
	at org.apache.maven.plugin.surefire.booterclient.ForkStarter.run(ForkStarter.java:116)
	at org.apache.maven.plugin.surefire.AbstractSurefireMojo.executeProvider(AbstractSurefireMojo.java:740)
	at org.apache.maven.plugin.surefire.AbstractSurefireMojo.executeAllProviders(AbstractSurefireMojo.java:682)
	at org.apache.maven.plugin.surefire.AbstractSurefireMojo.executeAfterPreconditionsChecked(AbstractSurefireMojo.java:648)
	at org.apache.maven.plugin.surefire.AbstractSurefireMojo.execute(AbstractSurefireMojo.java:586)
	at org.apache.maven.plugin.DefaultBuildPluginManager.executeMojo(DefaultBuildPluginManager.java:101)
	... 32 more
Sending e-mails to: notifications@maven.apache.org rfscholte@apache.org olamy@apache.org
channel stopped

Mime
View raw message