maven-notifications mailing list archives

Site index · List index
Message view « Date » · « Thread »
Top « Date » · « Thread »
From Apache Jenkins Server <jenk...@builds.apache.org>
Subject Build failed in Jenkins: maven-plugins-ITs-m3.0.3 #271
Date Mon, 08 Jul 2013 17:43:34 GMT
See <https://builds.apache.org/job/maven-plugins-ITs-m3.0.3/271/changes>

Changes:

[dkulp] [MRRESOURCES-58] Map version ranges into something that can actually be compared.
Patch from Sergei Ivanov applied.

[dkulp] Use unique VelocityEngine each execution to avoid problems with common named templates.

[dkulp] The properties can contain objects, not just strings.  Add the ResouceManager in to
the properties.

------------------------------------------
[...truncated 11678 lines...]
[INFO] Installing /home/hudson/jenkins-slave/workspace/maven-plugins-ITs-m3.0.3/maven-site-plugin/dependency-reduced-pom.xml
to /home/hudson/jenkins-slave/workspace/maven-plugins-ITs-m3.0.3/maven-shade-plugin/target/local-repo/org/apache/maven/plugins/maven-site-plugin/3.4-SNAPSHOT/maven-site-plugin-3.4-SNAPSHOT.pom
[INFO] Installing /home/hudson/jenkins-slave/workspace/maven-plugins-ITs-m3.0.3/maven-source-plugin/pom.xml
to /home/hudson/jenkins-slave/workspace/maven-plugins-ITs-m3.0.3/maven-shade-plugin/target/local-repo/org/apache/maven/plugins/maven-source-plugin/2.3-SNAPSHOT/maven-source-plugin-2.3-SNAPSHOT.pom
[INFO] Installing /home/hudson/jenkins-slave/workspace/maven-plugins-ITs-m3.0.3/maven-source-plugin/target/maven-source-plugin-2.3-SNAPSHOT.jar
to /home/hudson/jenkins-slave/workspace/maven-plugins-ITs-m3.0.3/maven-shade-plugin/target/local-repo/org/apache/maven/plugins/maven-source-plugin/2.3-SNAPSHOT/maven-source-plugin-2.3-SNAPSHOT.jar
[INFO] Installing /home/hudson/jenkins-slave/workspace/maven-plugins-ITs-m3.0.3/maven-source-plugin/pom.xml
to /home/hudson/jenkins-slave/workspace/maven-plugins-ITs-m3.0.3/maven-shade-plugin/target/local-repo/org/apache/maven/plugins/maven-source-plugin/2.3-SNAPSHOT/maven-source-plugin-2.3-SNAPSHOT.pom
[INFO] Installing /home/hudson/jenkins-slave/workspace/maven-plugins-ITs-m3.0.3/maven-stage-plugin/pom.xml
to /home/hudson/jenkins-slave/workspace/maven-plugins-ITs-m3.0.3/maven-shade-plugin/target/local-repo/org/apache/maven/plugins/maven-stage-plugin/1.0-SNAPSHOT/maven-stage-plugin-1.0-SNAPSHOT.pom
[INFO] Installing /home/hudson/jenkins-slave/workspace/maven-plugins-ITs-m3.0.3/maven-stage-plugin/target/maven-stage-plugin-1.0-SNAPSHOT.jar
to /home/hudson/jenkins-slave/workspace/maven-plugins-ITs-m3.0.3/maven-shade-plugin/target/local-repo/org/apache/maven/plugins/maven-stage-plugin/1.0-SNAPSHOT/maven-stage-plugin-1.0-SNAPSHOT.jar
[INFO] Installing /home/hudson/jenkins-slave/workspace/maven-plugins-ITs-m3.0.3/maven-stage-plugin/pom.xml
to /home/hudson/jenkins-slave/workspace/maven-plugins-ITs-m3.0.3/maven-shade-plugin/target/local-repo/org/apache/maven/plugins/maven-stage-plugin/1.0-SNAPSHOT/maven-stage-plugin-1.0-SNAPSHOT.pom
[INFO] Installing /home/hudson/jenkins-slave/workspace/maven-plugins-ITs-m3.0.3/maven-toolchains-plugin/pom.xml
to /home/hudson/jenkins-slave/workspace/maven-plugins-ITs-m3.0.3/maven-shade-plugin/target/local-repo/org/apache/maven/plugins/maven-toolchains-plugin/1.1-SNAPSHOT/maven-toolchains-plugin-1.1-SNAPSHOT.pom
[INFO] Installing /home/hudson/jenkins-slave/workspace/maven-plugins-ITs-m3.0.3/maven-toolchains-plugin/target/maven-toolchains-plugin-1.1-SNAPSHOT.jar
to /home/hudson/jenkins-slave/workspace/maven-plugins-ITs-m3.0.3/maven-shade-plugin/target/local-repo/org/apache/maven/plugins/maven-toolchains-plugin/1.1-SNAPSHOT/maven-toolchains-plugin-1.1-SNAPSHOT.jar
[INFO] Installing /home/hudson/jenkins-slave/workspace/maven-plugins-ITs-m3.0.3/maven-toolchains-plugin/pom.xml
to /home/hudson/jenkins-slave/workspace/maven-plugins-ITs-m3.0.3/maven-shade-plugin/target/local-repo/org/apache/maven/plugins/maven-toolchains-plugin/1.1-SNAPSHOT/maven-toolchains-plugin-1.1-SNAPSHOT.pom
[INFO] Installing /home/hudson/jenkins-slave/workspace/maven-plugins-ITs-m3.0.3/maven-verifier-plugin/pom.xml
to /home/hudson/jenkins-slave/workspace/maven-plugins-ITs-m3.0.3/maven-shade-plugin/target/local-repo/org/apache/maven/plugins/maven-verifier-plugin/1.1-SNAPSHOT/maven-verifier-plugin-1.1-SNAPSHOT.pom
[INFO] Installing /home/hudson/jenkins-slave/workspace/maven-plugins-ITs-m3.0.3/maven-verifier-plugin/target/maven-verifier-plugin-1.1-SNAPSHOT.jar
to /home/hudson/jenkins-slave/workspace/maven-plugins-ITs-m3.0.3/maven-shade-plugin/target/local-repo/org/apache/maven/plugins/maven-verifier-plugin/1.1-SNAPSHOT/maven-verifier-plugin-1.1-SNAPSHOT.jar
[INFO] Installing /home/hudson/jenkins-slave/workspace/maven-plugins-ITs-m3.0.3/maven-verifier-plugin/pom.xml
to /home/hudson/jenkins-slave/workspace/maven-plugins-ITs-m3.0.3/maven-shade-plugin/target/local-repo/org/apache/maven/plugins/maven-verifier-plugin/1.1-SNAPSHOT/maven-verifier-plugin-1.1-SNAPSHOT.pom
[INFO] Installing /home/hudson/jenkins-slave/workspace/maven-plugins-ITs-m3.0.3/maven-war-plugin/pom.xml
to /home/hudson/jenkins-slave/workspace/maven-plugins-ITs-m3.0.3/maven-shade-plugin/target/local-repo/org/apache/maven/plugins/maven-war-plugin/2.5-SNAPSHOT/maven-war-plugin-2.5-SNAPSHOT.pom
[INFO] Installing /home/hudson/jenkins-slave/workspace/maven-plugins-ITs-m3.0.3/maven-war-plugin/target/maven-war-plugin-2.5-SNAPSHOT.jar
to /home/hudson/jenkins-slave/workspace/maven-plugins-ITs-m3.0.3/maven-shade-plugin/target/local-repo/org/apache/maven/plugins/maven-war-plugin/2.5-SNAPSHOT/maven-war-plugin-2.5-SNAPSHOT.jar
[INFO] Installing /home/hudson/jenkins-slave/workspace/maven-plugins-ITs-m3.0.3/maven-war-plugin/pom.xml
to /home/hudson/jenkins-slave/workspace/maven-plugins-ITs-m3.0.3/maven-shade-plugin/target/local-repo/org/apache/maven/plugins/maven-war-plugin/2.5-SNAPSHOT/maven-war-plugin-2.5-SNAPSHOT.pom
[INFO] Installing /home/hudson/jenkins-slave/workspace/maven-plugins-ITs-m3.0.3/maven-scm-publish-plugin/pom.xml
to /home/hudson/jenkins-slave/workspace/maven-plugins-ITs-m3.0.3/maven-shade-plugin/target/local-repo/org/apache/maven/plugins/maven-scm-publish-plugin/1.0-SNAPSHOT/maven-scm-publish-plugin-1.0-SNAPSHOT.pom
[INFO] Installing /home/hudson/jenkins-slave/workspace/maven-plugins-ITs-m3.0.3/maven-scm-publish-plugin/target/maven-scm-publish-plugin-1.0-SNAPSHOT.jar
to /home/hudson/jenkins-slave/workspace/maven-plugins-ITs-m3.0.3/maven-shade-plugin/target/local-repo/org/apache/maven/plugins/maven-scm-publish-plugin/1.0-SNAPSHOT/maven-scm-publish-plugin-1.0-SNAPSHOT.jar
[INFO] Installing /home/hudson/jenkins-slave/workspace/maven-plugins-ITs-m3.0.3/maven-scm-publish-plugin/pom.xml
to /home/hudson/jenkins-slave/workspace/maven-plugins-ITs-m3.0.3/maven-shade-plugin/target/local-repo/org/apache/maven/plugins/maven-scm-publish-plugin/1.0-SNAPSHOT/maven-scm-publish-plugin-1.0-SNAPSHOT.pom
[INFO] Installing /home/hudson/jenkins-slave/workspace/maven-plugins-ITs-m3.0.3/maven-invoker-plugin/pom.xml
to /home/hudson/jenkins-slave/workspace/maven-plugins-ITs-m3.0.3/maven-shade-plugin/target/local-repo/org/apache/maven/plugins/maven-invoker-plugin/1.9-SNAPSHOT/maven-invoker-plugin-1.9-SNAPSHOT.pom
[INFO] Installing /home/hudson/jenkins-slave/workspace/maven-plugins-ITs-m3.0.3/maven-invoker-plugin/target/maven-invoker-plugin-1.9-SNAPSHOT.jar
to /home/hudson/jenkins-slave/workspace/maven-plugins-ITs-m3.0.3/maven-shade-plugin/target/local-repo/org/apache/maven/plugins/maven-invoker-plugin/1.9-SNAPSHOT/maven-invoker-plugin-1.9-SNAPSHOT.jar
[INFO] Installing /home/hudson/jenkins-slave/workspace/maven-plugins-ITs-m3.0.3/maven-invoker-plugin/pom.xml
to /home/hudson/jenkins-slave/workspace/maven-plugins-ITs-m3.0.3/maven-shade-plugin/target/local-repo/org/apache/maven/plugins/maven-invoker-plugin/1.9-SNAPSHOT/maven-invoker-plugin-1.9-SNAPSHOT.pom
[INFO] Installing /home/hudson/jenkins-slave/workspace/maven-plugins-ITs-m3.0.3/maven-project-info-reports-plugin/pom.xml
to /home/hudson/jenkins-slave/workspace/maven-plugins-ITs-m3.0.3/maven-shade-plugin/target/local-repo/org/apache/maven/plugins/maven-project-info-reports-plugin/2.8-SNAPSHOT/maven-project-info-reports-plugin-2.8-SNAPSHOT.pom
[INFO] Installing /home/hudson/jenkins-slave/workspace/maven-plugins-ITs-m3.0.3/maven-project-info-reports-plugin/target/maven-project-info-reports-plugin-2.8-SNAPSHOT.jar
to /home/hudson/jenkins-slave/workspace/maven-plugins-ITs-m3.0.3/maven-shade-plugin/target/local-repo/org/apache/maven/plugins/maven-project-info-reports-plugin/2.8-SNAPSHOT/maven-project-info-reports-plugin-2.8-SNAPSHOT.jar
[INFO] Installing /home/hudson/jenkins-slave/workspace/maven-plugins-ITs-m3.0.3/maven-project-info-reports-plugin/pom.xml
to /home/hudson/jenkins-slave/workspace/maven-plugins-ITs-m3.0.3/maven-shade-plugin/target/local-repo/org/apache/maven/plugins/maven-project-info-reports-plugin/2.8-SNAPSHOT/maven-project-info-reports-plugin-2.8-SNAPSHOT.pom
[INFO] Installing /home/hudson/jenkins-slave/workspace/maven-plugins-ITs-m3.0.3/maven-remote-resources-plugin/pom.xml
to /home/hudson/jenkins-slave/workspace/maven-plugins-ITs-m3.0.3/maven-shade-plugin/target/local-repo/org/apache/maven/plugins/maven-remote-resources-plugin/1.5-SNAPSHOT/maven-remote-resources-plugin-1.5-SNAPSHOT.pom
[INFO] Installing /home/hudson/jenkins-slave/workspace/maven-plugins-ITs-m3.0.3/maven-remote-resources-plugin/target/maven-remote-resources-plugin-1.5-SNAPSHOT.jar
to /home/hudson/jenkins-slave/workspace/maven-plugins-ITs-m3.0.3/maven-shade-plugin/target/local-repo/org/apache/maven/plugins/maven-remote-resources-plugin/1.5-SNAPSHOT/maven-remote-resources-plugin-1.5-SNAPSHOT.jar
[INFO] Installing /home/hudson/jenkins-slave/workspace/maven-plugins-ITs-m3.0.3/maven-remote-resources-plugin/pom.xml
to /home/hudson/jenkins-slave/workspace/maven-plugins-ITs-m3.0.3/maven-shade-plugin/target/local-repo/org/apache/maven/plugins/maven-remote-resources-plugin/1.5-SNAPSHOT/maven-remote-resources-plugin-1.5-SNAPSHOT.pom
[INFO] Installing /home/hudson/jenkins-slave/workspace/maven-plugins-ITs-m3.0.3/maven-shade-plugin/pom.xml
to /home/hudson/jenkins-slave/workspace/maven-plugins-ITs-m3.0.3/maven-shade-plugin/target/local-repo/org/apache/maven/plugins/maven-shade-plugin/2.2-SNAPSHOT/maven-shade-plugin-2.2-SNAPSHOT.pom
[INFO] Installing /home/hudson/jenkins-slave/workspace/maven-plugins-ITs-m3.0.3/maven-shade-plugin/target/maven-shade-plugin-2.2-SNAPSHOT.jar
to /home/hudson/jenkins-slave/workspace/maven-plugins-ITs-m3.0.3/maven-shade-plugin/target/local-repo/org/apache/maven/plugins/maven-shade-plugin/2.2-SNAPSHOT/maven-shade-plugin-2.2-SNAPSHOT.jar
[INFO] Installing /home/hudson/jenkins-slave/workspace/maven-plugins-ITs-m3.0.3/maven-shade-plugin/target/maven-shade-plugin-2.2-SNAPSHOT-tests.jar
to /home/hudson/jenkins-slave/workspace/maven-plugins-ITs-m3.0.3/maven-shade-plugin/target/local-repo/org/apache/maven/plugins/maven-shade-plugin/2.2-SNAPSHOT/maven-shade-plugin-2.2-SNAPSHOT-tests.jar
[INFO] 
[INFO] --- maven-invoker-plugin:1.8:integration-test (integration-test) @ maven-shade-plugin
---
[INFO] Building: duplicate-classes-without-reloc/pom.xml
[INFO] ..SUCCESS (3.1 s)
[INFO] Building: filter-artifact-contents/pom.xml
[INFO] run script verify.bsh
[INFO] ..SUCCESS (3.9 s)
[INFO] Building: project-with-reactors-included/pom.xml
[INFO] run script verify.bsh
[INFO] ..SUCCESS (9.7 s)
[INFO] Building: reloc-includes-excludes/pom.xml
[INFO] run script verify.bsh
[INFO] ..SUCCESS (4.4 s)
[INFO] Building: mini-jar-respect-includes/pom.xml
[INFO] run script verify.bsh
[INFO] ..SUCCESS (4.8 s)
[INFO] Building: attached-artifact-type/pom.xml
[INFO] ..SUCCESS (5.2 s)
[INFO] Building: services-resource-transformer/pom.xml
[INFO] run script verify.bsh
[INFO] ..SUCCESS (3.8 s)
[INFO] Building: reloc-enum-ref-from-anno/pom.xml
[INFO] ..SUCCESS (3.7 s)
[INFO] Building: finalNameBuild/pom.xml
[INFO] run script setup.bsh
[INFO] run script verify.bsh
[INFO] ..SUCCESS (4.2 s)
[INFO] Building: reloc-anno/pom.xml
[INFO] ..SUCCESS (3.6 s)
[INFO] Building: dep-reduced-pom-use-base-version/pom.xml
[INFO] run script verify.groovy
[INFO] ..SUCCESS (3.8 s)
[INFO] Building: shadePomDependency/pom.xml
[INFO] ..SUCCESS (4.7 s)
[INFO] Building: users-shader-impl/pom.xml
[INFO] run script verify.groovy
[INFO] ..SUCCESS (4.8 s)
[INFO] Building: duplicate-classes-with-reloc/pom.xml
[INFO] ..SUCCESS (3.5 s)
[INFO] Building: dep-reduced-pom/pom.xml
[INFO] run script verify.groovy
[INFO] ..SUCCESS (3.5 s)
[INFO] Building: reloc-abs-resource-path/pom.xml
[INFO] ..SUCCESS (6.1 s)
[INFO] Building: component-descriptor-relocation/pom.xml
[INFO] ..SUCCESS (4.5 s)
[INFO] Building: empty-relocation-shaded-pattern/pom.xml
[INFO] ..SUCCESS (3.5 s)
[INFO] Building: non-runtime-scope-excluded/pom.xml
[INFO] run script verify.bsh
[INFO] ..SUCCESS (3.7 s)
[INFO] Building: plugin-descriptor-relocation/pom.xml
[INFO] run script verify.groovy
[INFO] ..SUCCESS (13.2 s)
[INFO] Building: mini-jar/pom.xml
[INFO] run script verify.bsh
[INFO] ..SUCCESS (4.1 s)
[INFO] Building: finalNameShade/pom.xml
[INFO] run script setup.bsh
[INFO] run script verify.bsh
[INFO] ..SUCCESS (3.8 s)
[INFO] Building: artifact-includes-excludes/pom.xml
[INFO] run script verify.bsh
[INFO] ..SUCCESS (3.9 s)
[INFO] Building: MSHADE-114/pom.xml
[INFO] ..SUCCESS (3.6 s)
[INFO] Building: xml-transformer-ignores-dtd/pom.xml
[INFO] run script verify.bsh
[INFO] ..SUCCESS (3.8 s)
[INFO] Building: reloc-class-from-string-pool/pom.xml
[INFO] ..SUCCESS (3.4 s)
[INFO] Building: dep-reduced-pom-with-local-parent/pom.xml
[INFO] ..SUCCESS (2.8 s)
[INFO] Building: mini-jar-package-info/pom.xml
[INFO] run script verify.bsh
[INFO] ..SUCCESS (4.4 s)
[INFO] Building: attach-after-lifecycle-fork/pom.xml
[INFO] run script setup.bsh
[INFO] run script verify.bsh
[INFO] ..SUCCESS (3.2 s)
[INFO] Building: manifest-transformed/pom.xml
[INFO] run script verify.bsh
[INFO] ..SUCCESS (5.0 s)
[INFO] Building: dep-reduced-pom-unique/pom.xml
[INFO] run script verify.groovy
[INFO] ..SUCCESS (4.2 s)
[INFO] Building: MSHADE-133/pom.xml
[INFO] run script verify.groovy
[INFO] ..SUCCESS (3.8 s)
[INFO] Building: pom-packaging/pom.xml
[INFO] run script verify.bsh
[INFO] ..SUCCESS (2.6 s)
[INFO] Building: MSHADE-105/pom.xml
[INFO] run script verify.bsh
[INFO] ..SUCCESS (7.5 s)
[INFO] Building: rerun-with-reloc/pom.xml
[INFO] ..SUCCESS (5.0 s)
[INFO] Building: rerun-without-reloc/pom.xml
[INFO] ..SUCCESS (3.4 s)
[INFO] Building: implicit-inclusion-of-project-artifact/pom.xml
[INFO] run script verify.bsh
[INFO] ..SUCCESS (4.2 s)
[INFO] Building: mini-jar-malformed-dependencies/pom.xml
[INFO] ..SUCCESS (7.1 s)
[INFO] Building: empty-apache-notice-transform/pom.xml
[INFO] ..SUCCESS (4.1 s)
[INFO] Building: finalNameShade-attached/pom.xml
[INFO] run script setup.bsh
[INFO] run script verify.bsh
[INFO] ..SUCCESS (3.7 s)
[INFO] Building: mshade-123/pom.xml
[INFO] ..SUCCESS (5.6 s)
[INFO] Building: dep-reduced-pom-relocated-result/pom.xml
[INFO] ..SUCCESS (2.9 s)
[INFO] Building: empty-relocation-pattern/pom.xml
[INFO] ..SUCCESS (3.6 s)
[INFO] Building: finalNameBuild-attached/pom.xml
[INFO] run script setup.bsh
[INFO] run script verify.bsh
[INFO] ..SUCCESS (3.7 s)
[INFO] Building: manifest-retained/pom.xml
[INFO] run script verify.bsh
[INFO] ..SUCCESS (4.5 s)
[INFO] 
[INFO] --- maven-invoker-plugin:1.8:verify (integration-test) @ maven-shade-plugin ---
[INFO] -------------------------------------------------
[INFO] Build Summary:
[INFO]   Passed: 45, Failed: 0, Errors: 0, Skipped: 0
[INFO] -------------------------------------------------
[INFO] 
[INFO] --- maven-install-plugin:2.3.1:install (default-install) @ maven-shade-plugin ---
[INFO] Installing /home/hudson/jenkins-slave/workspace/maven-plugins-ITs-m3.0.3/maven-shade-plugin/target/maven-shade-plugin-2.2-SNAPSHOT.jar
to /home/jenkins/.m2/repository/org/apache/maven/plugins/maven-shade-plugin/2.2-SNAPSHOT/maven-shade-plugin-2.2-SNAPSHOT.jar
[INFO] Installing /home/hudson/jenkins-slave/workspace/maven-plugins-ITs-m3.0.3/maven-shade-plugin/pom.xml
to /home/jenkins/.m2/repository/org/apache/maven/plugins/maven-shade-plugin/2.2-SNAPSHOT/maven-shade-plugin-2.2-SNAPSHOT.pom
[INFO] Installing /home/hudson/jenkins-slave/workspace/maven-plugins-ITs-m3.0.3/maven-shade-plugin/target/maven-shade-plugin-2.2-SNAPSHOT-tests.jar
to /home/jenkins/.m2/repository/org/apache/maven/plugins/maven-shade-plugin/2.2-SNAPSHOT/maven-shade-plugin-2.2-SNAPSHOT-tests.jar
[INFO]                                                                         
[INFO] ------------------------------------------------------------------------
[INFO] Building Maven Plugins Aggregator 1-SNAPSHOT
[INFO] ------------------------------------------------------------------------
[INFO] 
[INFO] --- maven-clean-plugin:2.4.1:clean (default-clean) @ maven-plugins-aggregator ---
[INFO] Deleting /home/hudson/jenkins-slave/workspace/maven-plugins-ITs-m3.0.3/target
[INFO] 
[INFO] --- maven-remote-resources-plugin:1.1:process (default) @ maven-plugins-aggregator
---
[INFO] Setting property: classpath.resource.loader.class => 'org.codehaus.plexus.velocity.ContextClassLoaderResourceLoader'.
[INFO] Setting property: velocimacro.messages.on => 'false'.
[INFO] Setting property: resource.loader => 'classpath'.
[INFO] Setting property: resource.manager.logwhenfound => 'false'.
[INFO] 
[INFO] --- maven-install-plugin:2.3.1:install (default-install) @ maven-plugins-aggregator
---
[INFO] Installing /home/hudson/jenkins-slave/workspace/maven-plugins-ITs-m3.0.3/pom.xml to
/home/jenkins/.m2/repository/org/apache/maven/plugins/maven-plugins-aggregator/1-SNAPSHOT/maven-plugins-aggregator-1-SNAPSHOT.pom
[INFO] ------------------------------------------------------------------------
[INFO] Reactor Summary:
[INFO] 
[INFO] Maven Plugins ..................................... SUCCESS [15.062s]
[INFO] Maven ACR Plugin .................................. SUCCESS [1:09.896s]
[INFO] Maven Ant Plugin .................................. SUCCESS [1:38.117s]
[INFO] Maven AntRun Plugin ............................... SUCCESS [2:04.505s]
[INFO] Maven Eclipse Plugin .............................. SUCCESS [9:08.366s]
[INFO] Maven Assembly Plugin ............................. SUCCESS [11:19.620s]
[INFO] Maven Changelog Plugin ............................ SUCCESS [51.543s]
[INFO] Maven Changes Report Plugin ....................... SUCCESS [1:07.671s]
[INFO] Maven Checkstyle Plugin ........................... SUCCESS [1:49.030s]
[INFO] Maven Clean Plugin ................................ SUCCESS [22.527s]
[INFO] Maven Compiler Plugin ............................. SUCCESS [1:28.972s]
[INFO] Maven Dependency Plugin ........................... SUCCESS [3:16.050s]
[INFO] Maven Deploy Plugin ............................... SUCCESS [1:12.701s]
[INFO] Maven DOAP Plugin ................................. SUCCESS [24.440s]
[INFO] Maven Documentation Checker Plugin ................ SUCCESS [8.259s]
[INFO] Maven EAR Plugin .................................. SUCCESS [3:53.452s]
[INFO] Maven EJB Plugin .................................. SUCCESS [29.801s]
[INFO] Maven GPG Plugin .................................. SUCCESS [12.041s]
[INFO] Maven Help Plugin ................................. SUCCESS [48.237s]
[INFO] Maven IDEA Plugin ................................. SUCCESS [11.364s]
[INFO] Maven Install Plugin .............................. SUCCESS [48.102s]
[INFO] Maven JAR Plugin .................................. SUCCESS [1:11.593s]
[INFO] Maven Jarsigner Plugin ............................ SUCCESS [26.774s]
[INFO] Apache Maven Javadoc Plugin ....................... SUCCESS [3:21.098s]
[INFO] Maven Linkcheck Plugin ............................ SUCCESS [3.266s]
[INFO] Maven One Plugin .................................. SUCCESS [3.991s]
[INFO] Maven Patch Plugin ................................ SUCCESS [15.967s]
[INFO] Maven PDF Plugin .................................. SUCCESS [37.862s]
[INFO] Apache Maven PMD Plugin ........................... FAILURE [1:43.297s]
[INFO] Maven RAR Plugin .................................. SUCCESS [11.897s]
[INFO] Maven Reactor Plugin .............................. SUCCESS [4.080s]
[INFO] Maven Repository Plugin ........................... SUCCESS [42.638s]
[INFO] Maven Resources Plugin ............................ SUCCESS [1:02.222s]
[INFO] Maven Site Plugin 3 ............................... SUCCESS [7:47.797s]
[INFO] Maven Source Plugin ............................... SUCCESS [56.423s]
[INFO] Maven Stage Plugin ................................ SUCCESS [3.927s]
[INFO] Maven Toolchains Plugin ........................... SUCCESS [1.953s]
[INFO] Maven Verifier Plugin ............................. SUCCESS [20.629s]
[INFO] Apache Maven WAR Plugin ........................... SUCCESS [1:32.064s]
[INFO] Maven SCM Publish Plugin .......................... SUCCESS [2:06.516s]
[INFO] Maven Invoker Plugin .............................. SUCCESS [5:03.251s]
[INFO] Maven Project Info Reports Plugin ................. SUCCESS [2:46.776s]
[INFO] Maven Remote Resources Plugin ..................... SUCCESS [1:05.242s]
[INFO] Maven Shade Plugin ................................ SUCCESS [4:01.451s]
[INFO] Maven Plugins Aggregator .......................... SUCCESS [0.864s]
[INFO] ------------------------------------------------------------------------
[INFO] BUILD FAILURE
[INFO] ------------------------------------------------------------------------
[INFO] Total time: 1:18:13.483s
[INFO] Finished at: Mon Jul 08 17:42:43 UTC 2013
[INFO] Final Memory: 95M/314M
[INFO] ------------------------------------------------------------------------
[WARNING] The requested profile "apache.snapshots" could not be activated because it does
not exist.
[ERROR] Failed to execute goal org.apache.maven.plugins:maven-invoker-plugin:1.7:verify (integration-test)
on project maven-pmd-plugin: 2 builds failed. See console output above for details. ->
[Help 1]
[ERROR] 
[ERROR] To see the full stack trace of the errors, re-run Maven with the -e switch.
[ERROR] Re-run Maven using the -X switch to enable full debug logging.
[ERROR] 
[ERROR] For more information about the errors and possible solutions, please read the following
articles:
[ERROR] [Help 1] http://cwiki.apache.org/confluence/display/MAVEN/MojoFailureException
[ERROR] 
[ERROR] After correcting the problems, you can resume the build with the command
[ERROR]   mvn <goals> -rf :maven-pmd-plugin
Build step 'Invoke top-level Maven targets' marked build as failure
Recording test results

Mime
View raw message