maven-notifications mailing list archives

Site index · List index
Message view « Date » · « Thread »
Top « Date » · « Thread »
From Apache Jenkins Server <jenk...@builds.apache.org>
Subject Build failed in Jenkins: dist-tool-plugin #136
Date Sun, 14 Jul 2013 02:57:21 GMT
See <https://builds.apache.org/job/dist-tool-plugin/136/>

------------------------------------------
[...truncated 310 lines...]
Registered Taglet org.apache.maven.tools.plugin.javadoc.MojoRequiresReportsTypeTaglet ...
Registered Taglet org.apache.maven.tools.plugin.javadoc.MojoThreadSafeTypeTaglet ...
Registered Taglet org.apache.maven.tools.plugin.javadoc.MojoAggregatorTypeTaglet ...
Registered Taglet org.apache.maven.tools.plugin.javadoc.MojoRequiresOnLineTypeTaglet ...
Registered Taglet org.apache.maven.tools.plugin.javadoc.MojoRequiredFieldTaglet ...
Registered Taglet org.apache.maven.tools.plugin.javadoc.MojoPhaseTypeTaglet ...
Registered Taglet org.apache.maven.tools.plugin.javadoc.MojoReadOnlyFieldTaglet ...
Registered Taglet org.apache.maven.tools.plugin.javadoc.MojoComponentFieldTaglet ...
Registered Taglet org.apache.maven.tools.plugin.javadoc.MojoInstantiationStrategyTypeTaglet
...
Registered Taglet org.apache.maven.tools.plugin.javadoc.MojoRequiresProjectTypeTaglet ...
Registered Taglet org.apache.maven.tools.plugin.javadoc.MojoExecutionStrategyTypeTaglet ...
Registered Taglet org.codehaus.plexus.javadoc.PlexusConfigurationTaglet ...
Registered Taglet org.codehaus.plexus.javadoc.PlexusRequirementTaglet ...
Registered Taglet org.codehaus.plexus.javadoc.PlexusComponentTaglet ...
Standard Doclet version 1.7.0_04
Building tree for all the packages and classes...
Generating <https://builds.apache.org/job/dist-tool-plugin/ws/target/site/apidocs/org/apache/maven/dist/tools/AbstractDistCheckMojo.html...>
Generating <https://builds.apache.org/job/dist-tool-plugin/ws/target/site/apidocs/org/apache/maven/dist/tools/DistCheckSiteMojo.html...>
Generating <https://builds.apache.org/job/dist-tool-plugin/ws/target/site/apidocs/org/apache/maven/dist/tools/DistCheckSourceReleaseMojo.html...>
Generating <https://builds.apache.org/job/dist-tool-plugin/ws/target/site/apidocs/org/apache/maven/dist/tools/DummyFailureMojo.html...>
Generating <https://builds.apache.org/job/dist-tool-plugin/ws/target/site/apidocs/org/apache/maven/dist/tools/HelpMojo.html...>
Generating <https://builds.apache.org/job/dist-tool-plugin/ws/target/site/apidocs/org/apache/maven/dist/tools/checkers/FluidoHTMLChecker.html...>
Generating <https://builds.apache.org/job/dist-tool-plugin/ws/target/site/apidocs/org/apache/maven/dist/tools/checkers/HTMLChecker.html...>
Generating <https://builds.apache.org/job/dist-tool-plugin/ws/target/site/apidocs/org/apache/maven/dist/tools/checkers/HTMLCheckerFactory.html...>
Generating <https://builds.apache.org/job/dist-tool-plugin/ws/target/site/apidocs/org/apache/maven/dist/tools/checkers/StylusLeftHTMLChecker.html...>
Generating <https://builds.apache.org/job/dist-tool-plugin/ws/target/site/apidocs/org/apache/maven/dist/tools/checkers/StylusRightHTMLChecker.html...>
Generating <https://builds.apache.org/job/dist-tool-plugin/ws/target/site/apidocs/overview-frame.html...>
Generating <https://builds.apache.org/job/dist-tool-plugin/ws/target/site/apidocs/org/apache/maven/dist/tools/package-frame.html...>
Generating <https://builds.apache.org/job/dist-tool-plugin/ws/target/site/apidocs/org/apache/maven/dist/tools/package-summary.html...>
Generating <https://builds.apache.org/job/dist-tool-plugin/ws/target/site/apidocs/org/apache/maven/dist/tools/package-tree.html...>
Generating <https://builds.apache.org/job/dist-tool-plugin/ws/target/site/apidocs/org/apache/maven/dist/tools/checkers/package-frame.html...>
Generating <https://builds.apache.org/job/dist-tool-plugin/ws/target/site/apidocs/org/apache/maven/dist/tools/checkers/package-summary.html...>
Generating <https://builds.apache.org/job/dist-tool-plugin/ws/target/site/apidocs/org/apache/maven/dist/tools/checkers/package-tree.html...>
Generating <https://builds.apache.org/job/dist-tool-plugin/ws/target/site/apidocs/constant-values.html...>
Generating <https://builds.apache.org/job/dist-tool-plugin/ws/target/site/apidocs/org/apache/maven/dist/tools/class-use/AbstractDistCheckMojo.html...>
Generating <https://builds.apache.org/job/dist-tool-plugin/ws/target/site/apidocs/org/apache/maven/dist/tools/class-use/DistCheckSourceReleaseMojo.html...>
Generating <https://builds.apache.org/job/dist-tool-plugin/ws/target/site/apidocs/org/apache/maven/dist/tools/class-use/DistCheckSiteMojo.html...>
Generating <https://builds.apache.org/job/dist-tool-plugin/ws/target/site/apidocs/org/apache/maven/dist/tools/class-use/DummyFailureMojo.html...>
Generating <https://builds.apache.org/job/dist-tool-plugin/ws/target/site/apidocs/org/apache/maven/dist/tools/class-use/HelpMojo.html...>
Generating <https://builds.apache.org/job/dist-tool-plugin/ws/target/site/apidocs/org/apache/maven/dist/tools/checkers/class-use/HTMLChecker.html...>
Generating <https://builds.apache.org/job/dist-tool-plugin/ws/target/site/apidocs/org/apache/maven/dist/tools/checkers/class-use/FluidoHTMLChecker.html...>
Generating <https://builds.apache.org/job/dist-tool-plugin/ws/target/site/apidocs/org/apache/maven/dist/tools/checkers/class-use/StylusLeftHTMLChecker.html...>
Generating <https://builds.apache.org/job/dist-tool-plugin/ws/target/site/apidocs/org/apache/maven/dist/tools/checkers/class-use/StylusRightHTMLChecker.html...>
Generating <https://builds.apache.org/job/dist-tool-plugin/ws/target/site/apidocs/org/apache/maven/dist/tools/checkers/class-use/HTMLCheckerFactory.html...>
Generating <https://builds.apache.org/job/dist-tool-plugin/ws/target/site/apidocs/org/apache/maven/dist/tools/package-use.html...>
Generating <https://builds.apache.org/job/dist-tool-plugin/ws/target/site/apidocs/org/apache/maven/dist/tools/checkers/package-use.html...>
Building index for all the packages and classes...
Generating <https://builds.apache.org/job/dist-tool-plugin/ws/target/site/apidocs/overview-tree.html...>
Generating <https://builds.apache.org/job/dist-tool-plugin/ws/target/site/apidocs/index-all.html...>
Generating <https://builds.apache.org/job/dist-tool-plugin/ws/target/site/apidocs/deprecated-list.html...>
Building index for all classes...
Generating <https://builds.apache.org/job/dist-tool-plugin/ws/target/site/apidocs/allclasses-frame.html...>
Generating <https://builds.apache.org/job/dist-tool-plugin/ws/target/site/apidocs/allclasses-noframe.html...>
Generating <https://builds.apache.org/job/dist-tool-plugin/ws/target/site/apidocs/index.html...>
Generating <https://builds.apache.org/job/dist-tool-plugin/ws/target/site/apidocs/overview-summary.html...>
Generating <https://builds.apache.org/job/dist-tool-plugin/ws/target/site/apidocs/help-doc.html...>
Note: Custom tags that could override future standard tags:  @requiresDependencyResolution,
@requiresReports, @execute, @configurator, @aggregator, @instantiationStrategy, @threadSafe,
@executionStrategy, @goal, @requiresOnline, @parameter, @requiresDirectInvocation, @component,
@inheritByDefault, @requiresProject, @required, @readonly, @phase, @requiresDependencyCollection.
To avoid potential overrides, use at least one period character (.) in custom tag names.
3 warnings
[WARNING] Javadoc Warnings
[WARNING] javadoc: warning - Error fetching URL: http://commons.apache.org/collections/apidocs-COLLECTIONS_3_0/package-list
[WARNING] <https://builds.apache.org/job/dist-tool-plugin/ws/target/generated-sources/plugin/org/apache/maven/dist/tools/HelpMojo.java>:30:
warning - @author tag has no arguments.
[WARNING] <https://builds.apache.org/job/dist-tool-plugin/ws/target/generated-sources/plugin/org/apache/maven/dist/tools/HelpMojo.java>:30:
warning - @version tag has no arguments.
[INFO] Generating "Test JavaDocs" report    --- maven-javadoc-plugin:2.9
[ERROR] Error fetching link: http://www.eclipse.org/aether/aether-api/apidocs/package-list.
Ignored it.
[ERROR] Error fetching link: http://www.eclipse.org/aether/aether-util/apidocs/package-list.
Ignored it.
[ERROR] Error fetching link: http://xml.apache.org/commons/components/external/apidocs/package-list.
Ignored it.
[ERROR] Error fetching link: http://selenium.googlecode.com/selenium-firefox-driver/apidocs/package-list.
Ignored it.
[ERROR] Error fetching link: http://junit.org/apidocs/package-list. Ignored it.
[ERROR] Error fetching link: http://hc.apache.org/httpcomponents-client/apidocs/package-list.
Ignored it.
[INFO] 
Loading source files for package org.apache.maven.dist.tools...
Constructing Javadoc information...
Registered Taglet org.apache.maven.tools.plugin.javadoc.MojoRequiresDirectInvocationTypeTaglet
...
Registered Taglet org.apache.maven.tools.plugin.javadoc.MojoParameterFieldTaglet ...
Registered Taglet org.apache.maven.tools.plugin.javadoc.MojoGoalTypeTaglet ...
Registered Taglet org.apache.maven.tools.plugin.javadoc.MojoInheritByDefaultTypeTaglet ...
Registered Taglet org.apache.maven.tools.plugin.javadoc.MojoExecuteTypeTaglet ...
Registered Taglet org.apache.maven.tools.plugin.javadoc.MojoRequiresDependencyCollectionTypeTaglet
...
Registered Taglet org.apache.maven.tools.plugin.javadoc.MojoConfiguratorTypeTaglet ...
Registered Taglet org.apache.maven.tools.plugin.javadoc.MojoRequiresDependencyResolutionTypeTaglet
...
Registered Taglet org.apache.maven.tools.plugin.javadoc.MojoRequiresReportsTypeTaglet ...
Registered Taglet org.apache.maven.tools.plugin.javadoc.MojoThreadSafeTypeTaglet ...
Registered Taglet org.apache.maven.tools.plugin.javadoc.MojoAggregatorTypeTaglet ...
Registered Taglet org.apache.maven.tools.plugin.javadoc.MojoRequiresOnLineTypeTaglet ...
Registered Taglet org.apache.maven.tools.plugin.javadoc.MojoRequiredFieldTaglet ...
Registered Taglet org.apache.maven.tools.plugin.javadoc.MojoPhaseTypeTaglet ...
Registered Taglet org.apache.maven.tools.plugin.javadoc.MojoReadOnlyFieldTaglet ...
Registered Taglet org.apache.maven.tools.plugin.javadoc.MojoComponentFieldTaglet ...
Registered Taglet org.apache.maven.tools.plugin.javadoc.MojoInstantiationStrategyTypeTaglet
...
Registered Taglet org.apache.maven.tools.plugin.javadoc.MojoRequiresProjectTypeTaglet ...
Registered Taglet org.apache.maven.tools.plugin.javadoc.MojoExecutionStrategyTypeTaglet ...
Registered Taglet org.codehaus.plexus.javadoc.PlexusConfigurationTaglet ...
Registered Taglet org.codehaus.plexus.javadoc.PlexusRequirementTaglet ...
Registered Taglet org.codehaus.plexus.javadoc.PlexusComponentTaglet ...
Standard Doclet version 1.7.0_04
Building tree for all the packages and classes...
Generating <https://builds.apache.org/job/dist-tool-plugin/ws/target/site/testapidocs/org/apache/maven/dist/tools/PatternTest.html...>
Generating <https://builds.apache.org/job/dist-tool-plugin/ws/target/site/testapidocs/org/apache/maven/dist/tools/package-frame.html...>
Generating <https://builds.apache.org/job/dist-tool-plugin/ws/target/site/testapidocs/org/apache/maven/dist/tools/package-summary.html...>
Generating <https://builds.apache.org/job/dist-tool-plugin/ws/target/site/testapidocs/org/apache/maven/dist/tools/package-tree.html...>
Generating <https://builds.apache.org/job/dist-tool-plugin/ws/target/site/testapidocs/constant-values.html...>
Generating <https://builds.apache.org/job/dist-tool-plugin/ws/target/site/testapidocs/org/apache/maven/dist/tools/class-use/PatternTest.html...>
Generating <https://builds.apache.org/job/dist-tool-plugin/ws/target/site/testapidocs/org/apache/maven/dist/tools/package-use.html...>
Building index for all the packages and classes...
Generating <https://builds.apache.org/job/dist-tool-plugin/ws/target/site/testapidocs/overview-tree.html...>
Generating <https://builds.apache.org/job/dist-tool-plugin/ws/target/site/testapidocs/index-all.html...>
Generating <https://builds.apache.org/job/dist-tool-plugin/ws/target/site/testapidocs/deprecated-list.html...>
Building index for all classes...
Generating <https://builds.apache.org/job/dist-tool-plugin/ws/target/site/testapidocs/allclasses-frame.html...>
Generating <https://builds.apache.org/job/dist-tool-plugin/ws/target/site/testapidocs/allclasses-noframe.html...>
Generating <https://builds.apache.org/job/dist-tool-plugin/ws/target/site/testapidocs/index.html...>
Generating <https://builds.apache.org/job/dist-tool-plugin/ws/target/site/testapidocs/help-doc.html...>
Note: Custom tags that could override future standard tags:  @requiresDependencyResolution,
@requiresReports, @execute, @configurator, @aggregator, @instantiationStrategy, @threadSafe,
@executionStrategy, @goal, @requiresOnline, @parameter, @requiresDirectInvocation, @component,
@inheritByDefault, @requiresProject, @required, @readonly, @phase, @requiresDependencyCollection.
To avoid potential overrides, use at least one period character (.) in custom tag names.
Note: Custom tags that were not seen:  @plexus.requirement, @parameter, @component, @plexus.configuration,
@required, @readonly
1 warning
[WARNING] Javadoc Warnings
[WARNING] javadoc: warning - Error fetching URL: http://commons.apache.org/collections/apidocs-COLLECTIONS_3_0/package-list
[INFO] Generating "FindBugs Report" report    --- findbugs-maven-plugin:2.5.2
[INFO] Locale is en
[INFO] Fork Value is true
     [java] The following classes needed for analysis were missing:
     [java]   org.apache.maven.artifact.repository.Authentication
     [java]   org.apache.maven.repository.Proxy
     [java] Warnings generated: 13
[INFO] Done FindBugs Analysis....
[warn] [XHTML Sink] Modified invalid anchor name: 'org.apache.maven.dist.tools.DistCheckSiteMojo$DistCheckSiteResult'
to 'org.apache.maven.dist.tools.DistCheckSiteMojoDistCheckSiteResult'
[INFO] Generating "Sonar" report    --- maven-report:0.1
[INFO] Generating "Disttool> Sites" report    --- dist-tool-plugin:0.0.1-SNAPSHOT
[INFO] ## line format:
[INFO] ## directory groupId [src+bin]
[INFO] ##   artifactId [forced version]
[INFO] ##
[INFO] ## binaries
[INFO] ##  doxia-book-maven-plugin
[INFO] ##  doxia-book-renderer
[ERROR] HTTP result code: 404 for http://maven.apache.org/maven-indexer-archives/maven-indexer-5.1.1
[INFO] ## maven-1
[INFO] org.apache.maven:apache-maven metadata latest version value is 3.1.0 but check was
manually set to 2.0.11
[ERROR] HTTP result code: 404 for http://maven.apache.org/apache-maven
[INFO] org.apache.maven:apache-maven metadata latest version value is 3.1.0 but check was
manually set to 2.2.1
[ERROR] HTTP result code: 404 for http://maven.apache.org/apache-maven
[INFO] org.apache.maven:apache-maven metadata latest version value is 3.1.0 but check was
manually set to 3.0.5
[INFO] org.apache.maven.release:maven-release metadata latest version value is 5 but check
was manually set to 2.4.1
[ERROR] HTTP result code: 404 for http://maven.apache.org/shared/file-management/
[INFO] Generating "Disttool> Source Release" report    --- dist-tool-plugin:0.0.1-SNAPSHOT
[INFO] ## line format:
[INFO] ## directory groupId [src+bin]
[INFO] ##   artifactId [forced version]
[INFO] ##
[INFO] ## binaries
[INFO] ##  doxia-book-maven-plugin
[INFO] ##  doxia-book-renderer
[ERROR] Missing file for doxia-linkcheck in http://repo.maven.apache.org/maven2/org/apache/maven/doxia/doxia-linkcheck/1.2
[ERROR]  > doxia-linkcheck-1.2-source-release.zip <
[ERROR]  > doxia-linkcheck-1.2-source-release.zip.asc <
[ERROR]  > doxia-linkcheck-1.2-source-release.zip.md5 <
[ERROR] Missing file for doxia-linkcheck in http://www.apache.org/dist/maven/doxia
[ERROR]  > doxia-linkcheck-1.2-source-release.zip <
[ERROR]  > doxia-linkcheck-1.2-source-release.zip.asc <
[ERROR]  > doxia-linkcheck-1.2-source-release.zip.md5 <
[INFO] ## maven-1
[INFO] org.apache.maven:apache-maven metadata latest version value is 3.1.0 but check was
manually set to 2.0.11
[ERROR] Missing file for apache-maven in http://repo.maven.apache.org/maven2/org/apache/maven/apache-maven/2.0.11
[ERROR]  > apache-maven-2.0.11-src.zip <
[ERROR]  > apache-maven-2.0.11-src.zip.asc <
[ERROR]  > apache-maven-2.0.11-src.zip.md5 <
[INFO] org.apache.maven:apache-maven metadata latest version value is 3.1.0 but check was
manually set to 2.2.1
[INFO] org.apache.maven:apache-maven metadata latest version value is 3.1.0 but check was
manually set to 3.0.5
[JENKINS] Archiving site from <https://builds.apache.org/job/dist-tool-plugin/ws/target/site>
to /home/hudson/hudson/jobs/dist-tool-plugin/site
Successfully loaded native POSIX impl.
[INFO] ------------------------------------------------------------------------
[INFO] BUILD FAILURE
[INFO] ------------------------------------------------------------------------
[INFO] Total time: 2:53.471s
[INFO] Finished at: Sun Jul 14 02:57:14 UTC 2013
[INFO] Final Memory: 66M/743M
[INFO] ------------------------------------------------------------------------
[JENKINS] Archiving <https://builds.apache.org/job/dist-tool-plugin/ws/pom.xml> to /home/hudson/hudson/jobs/dist-tool-plugin/modules/org.apache.maven.dist.tools$dist-tool-plugin/builds/2013-07-14_02-54-07/archive/org.apache.maven.dist.tools/dist-tool-plugin/0.0.1-SNAPSHOT/dist-tool-plugin-0.0.1-SNAPSHOT.pom
[JENKINS] Archiving <https://builds.apache.org/job/dist-tool-plugin/ws/target/dist-tool-plugin-0.0.1-SNAPSHOT.jar>
to /home/hudson/hudson/jobs/dist-tool-plugin/modules/org.apache.maven.dist.tools$dist-tool-plugin/builds/2013-07-14_02-54-07/archive/org.apache.maven.dist.tools/dist-tool-plugin/0.0.1-SNAPSHOT/dist-tool-plugin-0.0.1-SNAPSHOT.jar
Waiting for Jenkins to finish collecting data
mavenExecutionResult exceptions not empty
message : Failed to execute goal org.apache.maven.plugins:maven-site-plugin:3.3:site (default-site)
on project dist-tool-plugin: Error during page generation
cause : Error during page generation
Stack trace : 
org.apache.maven.lifecycle.LifecycleExecutionException: Failed to execute goal org.apache.maven.plugins:maven-site-plugin:3.3:site
(default-site) on project dist-tool-plugin: Error during page generation
	at org.apache.maven.lifecycle.internal.MojoExecutor.execute(MojoExecutor.java:217)
	at org.apache.maven.lifecycle.internal.MojoExecutor.execute(MojoExecutor.java:153)
	at org.apache.maven.lifecycle.internal.MojoExecutor.execute(MojoExecutor.java:145)
	at org.apache.maven.lifecycle.internal.LifecycleModuleBuilder.buildProject(LifecycleModuleBuilder.java:84)
	at org.apache.maven.lifecycle.internal.LifecycleModuleBuilder.buildProject(LifecycleModuleBuilder.java:59)
	at org.apache.maven.lifecycle.internal.LifecycleStarter.singleThreadedBuild(LifecycleStarter.java:183)
	at org.apache.maven.lifecycle.internal.LifecycleStarter.execute(LifecycleStarter.java:161)
	at org.apache.maven.DefaultMaven.doExecute(DefaultMaven.java:320)
	at org.apache.maven.DefaultMaven.execute(DefaultMaven.java:156)
	at org.jvnet.hudson.maven3.launcher.Maven3Launcher.main(Maven3Launcher.java:79)
	at sun.reflect.NativeMethodAccessorImpl.invoke0(Native Method)
	at sun.reflect.NativeMethodAccessorImpl.invoke(NativeMethodAccessorImpl.java:57)
	at sun.reflect.DelegatingMethodAccessorImpl.invoke(DelegatingMethodAccessorImpl.java:43)
	at java.lang.reflect.Method.invoke(Method.java:601)
	at org.codehaus.plexus.classworlds.launcher.Launcher.launchStandard(Launcher.java:329)
	at org.codehaus.plexus.classworlds.launcher.Launcher.launch(Launcher.java:239)
	at org.jvnet.hudson.maven3.agent.Maven3Main.launch(Maven3Main.java:158)
	at hudson.maven.Maven3Builder.call(Maven3Builder.java:100)
	at hudson.maven.Maven3Builder.call(Maven3Builder.java:66)
	at hudson.remoting.UserRequest.perform(UserRequest.java:118)
	at hudson.remoting.UserRequest.perform(UserRequest.java:48)
	at hudson.remoting.Request$2.run(Request.java:326)
	at hudson.remoting.InterceptingExecutorService$1.call(InterceptingExecutorService.java:72)
	at java.util.concurrent.FutureTask$Sync.innerRun(FutureTask.java:334)
	at java.util.concurrent.FutureTask.run(FutureTask.java:166)
	at java.util.concurrent.ThreadPoolExecutor.runWorker(ThreadPoolExecutor.java:1110)
	at java.util.concurrent.ThreadPoolExecutor$Worker.run(ThreadPoolExecutor.java:603)
	at java.lang.Thread.run(Thread.java:722)
Caused by: org.apache.maven.plugin.MojoExecutionException: Error during page generation
	at org.apache.maven.plugins.site.SiteMojo.execute(SiteMojo.java:143)
	at org.apache.maven.plugin.DefaultBuildPluginManager.executeMojo(DefaultBuildPluginManager.java:101)
	at org.apache.maven.lifecycle.internal.MojoExecutor.execute(MojoExecutor.java:209)
	... 27 more
Caused by: org.apache.maven.doxia.siterenderer.RendererException: Error rendering Maven report:
IOException while reading http://www.apache.org/dist/maven/maven-3/3.1.0/source
	at org.apache.maven.plugins.site.ReportDocumentRenderer.renderDocument(ReportDocumentRenderer.java:233)
	at org.apache.maven.doxia.siterenderer.DefaultSiteRenderer.renderModule(DefaultSiteRenderer.java:319)
	at org.apache.maven.doxia.siterenderer.DefaultSiteRenderer.render(DefaultSiteRenderer.java:135)
	at org.apache.maven.plugins.site.SiteMojo.renderLocale(SiteMojo.java:175)
	at org.apache.maven.plugins.site.SiteMojo.execute(SiteMojo.java:138)
	... 29 more
Caused by: org.apache.maven.reporting.MavenReportException: IOException while reading http://www.apache.org/dist/maven/maven-3/3.1.0/source
	at org.apache.maven.dist.tools.DistCheckSourceReleaseMojo.executeReport(DistCheckSourceReleaseMojo.java:275)
	at org.apache.maven.reporting.AbstractMavenReport.generate(AbstractMavenReport.java:196)
	at org.apache.maven.plugins.site.ReportDocumentRenderer.renderDocument(ReportDocumentRenderer.java:219)
	... 33 more
Caused by: org.apache.maven.plugin.MojoExecutionException: IOException while reading http://www.apache.org/dist/maven/maven-3/3.1.0/source
	at org.apache.maven.dist.tools.DistCheckSourceReleaseMojo.checkArtifact(DistCheckSourceReleaseMojo.java:513)
	at org.apache.maven.dist.tools.AbstractDistCheckMojo.execute(AbstractDistCheckMojo.java:167)
	at org.apache.maven.dist.tools.DistCheckSourceReleaseMojo.executeReport(DistCheckSourceReleaseMojo.java:271)
	... 35 more
Caused by: java.io.IOException: IOException while reading http://www.apache.org/dist/maven/maven-3/3.1.0/source
	at org.apache.maven.dist.tools.DistCheckSourceReleaseMojo.selectLinks(DistCheckSourceReleaseMojo.java:418)
	at org.apache.maven.dist.tools.DistCheckSourceReleaseMojo.checkDirectoryIndex(DistCheckSourceReleaseMojo.java:467)
	at org.apache.maven.dist.tools.DistCheckSourceReleaseMojo.checkArtifact(DistCheckSourceReleaseMojo.java:508)
	... 37 more
Caused by: org.jsoup.HttpStatusException: HTTP error fetching URL. Status=404, URL=http://www.apache.org/dist/maven/maven-3/3.1.0/source
	at org.jsoup.helper.HttpConnection$Response.execute(HttpConnection.java:435)
	at org.jsoup.helper.HttpConnection$Response.execute(HttpConnection.java:410)
	at org.jsoup.helper.HttpConnection.execute(HttpConnection.java:164)
	at org.jsoup.helper.HttpConnection.get(HttpConnection.java:153)
	at org.apache.maven.dist.tools.DistCheckSourceReleaseMojo.selectLinks(DistCheckSourceReleaseMojo.java:413)
	... 39 more
Sending e-mails to: notifications@maven.apache.org
channel stopped

Mime
View raw message