maven-notifications mailing list archives

Site index · List index
Message view « Date » · « Thread »
Top « Date » · « Thread »
From Apache Jenkins Server <jenk...@builds.apache.org>
Subject Build failed in Jenkins: maven-plugins-windows #110
Date Tue, 07 May 2013 05:13:20 GMT
See <https://builds.apache.org/job/maven-plugins-windows/110/>

------------------------------------------
[...truncated 7419 lines...]

-------------------------------------------------------
 T E S T S
-------------------------------------------------------
Running org.apache.maven.plugins.shade.DefaultShaderTest
2013-05-07 06:12:59.394::INFO:  Shutdown hook complete
2013-05-07 06:13:00.298::INFO:  Shutdown hook complete
Tests run: 4, Failures: 0, Errors: 0, Skipped: 0, Time elapsed: 1.812 sec
Running org.apache.maven.plugins.shade.filter.SimpleFilterTest
Tests run: 1, Failures: 0, Errors: 0, Skipped: 0, Time elapsed: 0.001 sec
Running org.apache.maven.plugins.shade.mojo.ArtifactIdTest
Tests run: 2, Failures: 0, Errors: 0, Skipped: 0, Time elapsed: 0 sec
Running org.apache.maven.plugins.shade.mojo.ArtifactSelectorTest
Tests run: 1, Failures: 0, Errors: 0, Skipped: 0, Time elapsed: 0 sec
Running org.apache.maven.plugins.shade.mojo.RelativizePathTest
Tests run: 1, Failures: 0, Errors: 0, Skipped: 0, Time elapsed: 0.019 sec
Running org.apache.maven.plugins.shade.mojo.ShadeMojoTest
2013-05-07 06:13:01.361::INFO:  Shutdown hook complete

Results :

Tests run: 17, Failures: 0, Errors: 0, Skipped: 0

[JENKINS] Recording test results
[INFO] 
[INFO] --- maven-jar-plugin:2.4:jar (default-jar) @ maven-project-info-reports-plugin ---
[INFO] Building jar: F:\hudson\hudson-slave\workspace\maven-plugins-windows\maven-project-info-reports-plugin\target\maven-project-info-reports-plugin-2.7-SNAPSHOT.jar
Tests run: 4, Failures: 0, Errors: 0, Skipped: 0, Time elapsed: 1.774 sec
Running org.apache.maven.plugins.shade.relocation.SimpleRelocatorParameterTest
Tests run: 2, Failures: 0, Errors: 0, Skipped: 0, Time elapsed: 0.002 sec
Running org.apache.maven.plugins.shade.relocation.SimpleRelocatorTest
Tests run: 7, Failures: 0, Errors: 0, Skipped: 0, Time elapsed: 0 sec
Running org.apache.maven.plugins.shade.resource.ApacheLicenseResourceTransformerTest
Tests run: 1, Failures: 0, Errors: 0, Skipped: 0, Time elapsed: 0 sec
Running org.apache.maven.plugins.shade.resource.ApacheNoticeResourceTransformerTest
Tests run: 1, Failures: 0, Errors: 0, Skipped: 0, Time elapsed: 0 sec
Running org.apache.maven.plugins.shade.resource.AppendingTransformerTest
Tests run: 1, Failures: 0, Errors: 0, Skipped: 0, Time elapsed: 0.001 sec
Running org.apache.maven.plugins.shade.resource.ComponentsXmlResourceTransformerTest
Tests run: 1, Failures: 0, Errors: 0, Skipped: 0, Time elapsed: 0.04 sec
Running org.apache.maven.plugins.shade.resource.XmlAppendingTransformerTest
Tests run: 1, Failures: 0, Errors: 0, Skipped: 0, Time elapsed: 0.001 sec

Results :

Tests run: 27, Failures: 0, Errors: 0, Skipped: 0

[JENKINS] Recording test results
[INFO] 
[INFO] --- maven-plugin-plugin:3.2:addPluginArtifactMetadata (default-addPluginArtifactMetadata)
@ maven-project-info-reports-plugin ---
[INFO] 
[INFO] --- maven-jarsigner-plugin:1.2:sign (sign) @ maven-project-info-reports-plugin ---
[INFO] 
[INFO] --- maven-jar-plugin:2.4:jar (default-jar) @ maven-shade-plugin ---
[INFO] Building jar: F:\hudson\hudson-slave\workspace\maven-plugins-windows\maven-shade-plugin\target\maven-shade-plugin-3.0-SNAPSHOT.jar
[INFO] 
[INFO] --- maven-plugin-plugin:3.2:addPluginArtifactMetadata (default-addPluginArtifactMetadata)
@ maven-shade-plugin ---
[INFO] [INFO] Installing F:\hudson\hudson-slave\workspace\maven-plugins-windows\maven-shade-plugin\target\maven-shade-plugin-3.0-SNAPSHOT.jar
to f:\hudson\hudson-slave\maven-repositories\1\org\apache\maven\plugins\maven-shade-plugin\3.0-SNAPSHOT\maven-shade-plugin-3.0-SNAPSHOT.jar

[INFO] --- maven-install-plugin:2.3.1:install (default-install) @ maven-shade-plugin ---
[INFO] Installing F:\hudson\hudson-slave\workspace\maven-plugins-windows\maven-shade-plugin\pom.xml
to f:\hudson\hudson-slave\maven-repositories\1\org\apache\maven\plugins\maven-shade-plugin\3.0-SNAPSHOT\maven-shade-plugin-3.0-SNAPSHOT.pom
[INFO] 1 archive(s) processed
[INFO] 
[INFO] --- maven-jarsigner-plugin:1.2:verify (verify) @ maven-project-info-reports-plugin
---
[INFO] 1 archive(s) processed
[INFO] Installing F:\hudson\hudson-slave\workspace\maven-plugins-windows\maven-project-info-reports-plugin\target\maven-project-info-reports-plugin-2.7-SNAPSHOT.jar
to f:\hudson\hudson-slave\maven-repositories\1\org\apache\maven\plugins\maven-project-info-reports-plugin\2.7-SNAPSHOT\maven-project-info-reports-plugin-2.7-SNAPSHOT.jar
[INFO] 
[INFO] --- maven-install-plugin:2.3.1:install (default-install) @ maven-project-info-reports-plugin
---
[INFO] Installing F:\hudson\hudson-slave\workspace\maven-plugins-windows\maven-project-info-reports-plugin\pom.xml
to f:\hudson\hudson-slave\maven-repositories\1\org\apache\maven\plugins\maven-project-info-reports-plugin\2.7-SNAPSHOT\maven-project-info-reports-plugin-2.7-SNAPSHOT.pom
[INFO] ------------------------------------------------------------------------
[INFO] Reactor Summary:
[INFO] 
[INFO] Maven Plugins ..................................... SUCCESS [18.548s]
[INFO] Maven ACR Plugin .................................. SUCCESS [29.371s]
[INFO] Maven Ant Plugin .................................. SUCCESS [46.411s]
[INFO] Maven AntRun Plugin ............................... SUCCESS [10.860s]
[INFO] Maven Eclipse Plugin .............................. SUCCESS [1:47.261s]
[INFO] Maven Assembly Plugin ............................. SUCCESS [1:12.717s]
[INFO] Maven Changelog Plugin ............................ SUCCESS [49.380s]
[INFO] Maven Changes Report Plugin ....................... SUCCESS [33.086s]
[INFO] Maven Checkstyle Plugin ........................... SUCCESS [31.523s]
[INFO] Maven Clean Plugin ................................ SUCCESS [6.101s]
[INFO] Maven Compiler Plugin ............................. SUCCESS [31.928s]
[INFO] Maven Dependency Plugin ........................... FAILURE [53.296s]
[INFO] Maven Deploy Plugin ............................... SUCCESS [29.882s]
[INFO] Maven DOAP Plugin ................................. SUCCESS [20.659s]
[INFO] Maven Documentation Checker Plugin ................ SUCCESS [3.273s]
[INFO] Maven EAR Plugin .................................. SUCCESS [19.834s]
[INFO] Maven EJB Plugin .................................. SUCCESS [6.900s]
[INFO] Maven GPG Plugin .................................. SUCCESS [2.291s]
[INFO] Maven Help Plugin ................................. SUCCESS [10.654s]
[INFO] Maven IDEA Plugin ................................. SUCCESS [16.182s]
[INFO] Maven Install Plugin .............................. SUCCESS [7.723s]
[INFO] Maven JAR Plugin .................................. SUCCESS [5.678s]
[INFO] Maven Jarsigner Plugin ............................ SUCCESS [3.465s]
[INFO] Maven Javadoc Plugin .............................. SUCCESS [2:19.059s]
[INFO] Maven Linkcheck Plugin ............................ SUCCESS [3.562s]
[INFO] Maven One Plugin .................................. SUCCESS [3.357s]
[INFO] Maven Patch Plugin ................................ SUCCESS [1.148s]
[INFO] Maven PDF Plugin .................................. SUCCESS [38.383s]
[INFO] Maven PMD Plugin .................................. SUCCESS [41.371s]
[INFO] Maven RAR Plugin .................................. SUCCESS [8.317s]
[INFO] Maven Reactor Plugin .............................. SUCCESS [5.930s]
[INFO] Maven Repository Plugin ........................... SUCCESS [8.941s]
[INFO] Maven Resources Plugin ............................ SUCCESS [10.060s]
[INFO] Maven Site Plugin 3 ............................... SUCCESS [22.270s]
[INFO] Maven Source Plugin ............................... SUCCESS [6.526s]
[INFO] Maven Stage Plugin ................................ SUCCESS [4.132s]
[INFO] Maven Toolchains Plugin ........................... SUCCESS [3.419s]
[INFO] Maven Verifier Plugin ............................. SUCCESS [3.595s]
[INFO] Maven WAR Plugin .................................. SUCCESS [25.326s]
[INFO] Maven SCM Publish Plugin .......................... SUCCESS [12.997s]
[INFO] Maven Invoker Plugin .............................. SUCCESS [32.064s]
[INFO] Maven Project Info Reports Plugin ................. SUCCESS [47.202s]
[INFO] Maven Remote Resources Plugin ..................... SUCCESS [8.833s]
[INFO] Maven Shade Plugin ................................ SUCCESS [15.405s]
[INFO] Maven Plugins Aggregator .......................... SUCCESS [1.630s]
[INFO] ------------------------------------------------------------------------
[INFO] BUILD FAILURE
[INFO] ------------------------------------------------------------------------
[INFO] Total time: 6:03.952s (Wall Clock)
[INFO] Finished at: Tue May 07 06:13:04 BST 2013
[INFO] Final Memory: 87M/344M
[INFO] ------------------------------------------------------------------------
[JENKINS] Archiving F:\hudson\hudson-slave\workspace\maven-plugins-windows\maven-war-plugin\pom.xml
to /home/hudson/hudson/jobs/maven-plugins-windows/modules/org.apache.maven.plugins$maven-war-plugin/builds/2013-05-07_05-06-54/archive/org.apache.maven.plugins/maven-war-plugin/2.4-SNAPSHOT/maven-war-plugin-2.4-SNAPSHOT.pom
[JENKINS] Archiving F:\hudson\hudson-slave\workspace\maven-plugins-windows\maven-war-plugin\target\maven-war-plugin-2.4-SNAPSHOT.jar
to /home/hudson/hudson/jobs/maven-plugins-windows/modules/org.apache.maven.plugins$maven-war-plugin/builds/2013-05-07_05-06-54/archive/org.apache.maven.plugins/maven-war-plugin/2.4-SNAPSHOT/maven-war-plugin-2.4-SNAPSHOT.jar
[JENKINS] Archiving F:\hudson\hudson-slave\workspace\maven-plugins-windows\maven-docck-plugin\pom.xml
to /home/hudson/hudson/jobs/maven-plugins-windows/modules/org.apache.maven.plugins$maven-docck-plugin/builds/2013-05-07_05-06-53/archive/org.apache.maven.plugins/maven-docck-plugin/1.1-SNAPSHOT/maven-docck-plugin-1.1-SNAPSHOT.pom
[JENKINS] Archiving F:\hudson\hudson-slave\workspace\maven-plugins-windows\maven-docck-plugin\target\maven-docck-plugin-1.1-SNAPSHOT.jar
to /home/hudson/hudson/jobs/maven-plugins-windows/modules/org.apache.maven.plugins$maven-docck-plugin/builds/2013-05-07_05-06-53/archive/org.apache.maven.plugins/maven-docck-plugin/1.1-SNAPSHOT/maven-docck-plugin-1.1-SNAPSHOT.jar
[JENKINS] Archiving <https://builds.apache.org/job/maven-plugins-windows/ws/pom.xml>
to /home/hudson/hudson/jobs/maven-plugins-windows/modules/org.apache.maven.plugins$maven-plugins-aggregator/builds/2013-05-07_05-06-53/archive/org.apache.maven.plugins/maven-plugins-aggregator/1-SNAPSHOT/maven-plugins-aggregator-1-SNAPSHOT.pom
[JENKINS] Archiving F:\hudson\hudson-slave\workspace\maven-plugins-windows\maven-idea-plugin\pom.xml
to /home/hudson/hudson/jobs/maven-plugins-windows/modules/org.apache.maven.plugins$maven-idea-plugin/builds/2013-05-07_05-06-53/archive/org.apache.maven.plugins/maven-idea-plugin/2.3-SNAPSHOT/maven-idea-plugin-2.3-SNAPSHOT.pom
[JENKINS] Archiving F:\hudson\hudson-slave\workspace\maven-plugins-windows\maven-idea-plugin\target\maven-idea-plugin-2.3-SNAPSHOT.jar
to /home/hudson/hudson/jobs/maven-plugins-windows/modules/org.apache.maven.plugins$maven-idea-plugin/builds/2013-05-07_05-06-53/archive/org.apache.maven.plugins/maven-idea-plugin/2.3-SNAPSHOT/maven-idea-plugin-2.3-SNAPSHOT.jar
[JENKINS] Archiving F:\hudson\hudson-slave\workspace\maven-plugins-windows\maven-toolchains-plugin\pom.xml
to /home/hudson/hudson/jobs/maven-plugins-windows/modules/org.apache.maven.plugins$maven-toolchains-plugin/builds/2013-05-07_05-06-54/archive/org.apache.maven.plugins/maven-toolchains-plugin/1.1-SNAPSHOT/maven-toolchains-plugin-1.1-SNAPSHOT.pom
[JENKINS] Archiving F:\hudson\hudson-slave\workspace\maven-plugins-windows\maven-toolchains-plugin\target\maven-toolchains-plugin-1.1-SNAPSHOT.jar
to /home/hudson/hudson/jobs/maven-plugins-windows/modules/org.apache.maven.plugins$maven-toolchains-plugin/builds/2013-05-07_05-06-54/archive/org.apache.maven.plugins/maven-toolchains-plugin/1.1-SNAPSHOT/maven-toolchains-plugin-1.1-SNAPSHOT.jar
[JENKINS] Archiving F:\hudson\hudson-slave\workspace\maven-plugins-windows\maven-pmd-plugin\pom.xml
to /home/hudson/hudson/jobs/maven-plugins-windows/modules/org.apache.maven.plugins$maven-pmd-plugin/builds/2013-05-07_05-06-54/archive/org.apache.maven.plugins/maven-pmd-plugin/3.0.2-SNAPSHOT/maven-pmd-plugin-3.0.2-SNAPSHOT.pom
[JENKINS] Archiving F:\hudson\hudson-slave\workspace\maven-plugins-windows\maven-pmd-plugin\target\maven-pmd-plugin-3.0.2-SNAPSHOT.jar
to /home/hudson/hudson/jobs/maven-plugins-windows/modules/org.apache.maven.plugins$maven-pmd-plugin/builds/2013-05-07_05-06-54/archive/org.apache.maven.plugins/maven-pmd-plugin/3.0.2-SNAPSHOT/maven-pmd-plugin-3.0.2-SNAPSHOT.jar
[JENKINS] Archiving F:\hudson\hudson-slave\workspace\maven-plugins-windows\maven-eclipse-plugin\pom.xml
to /home/hudson/hudson/jobs/maven-plugins-windows/modules/org.apache.maven.plugins$maven-eclipse-plugin/builds/2013-05-07_05-06-53/archive/org.apache.maven.plugins/maven-eclipse-plugin/2.10-SNAPSHOT/maven-eclipse-plugin-2.10-SNAPSHOT.pom
[JENKINS] Archiving F:\hudson\hudson-slave\workspace\maven-plugins-windows\maven-eclipse-plugin\target\maven-eclipse-plugin-2.10-SNAPSHOT.jar
to /home/hudson/hudson/jobs/maven-plugins-windows/modules/org.apache.maven.plugins$maven-eclipse-plugin/builds/2013-05-07_05-06-53/archive/org.apache.maven.plugins/maven-eclipse-plugin/2.10-SNAPSHOT/maven-eclipse-plugin-2.10-SNAPSHOT.jar
[JENKINS] Archiving F:\hudson\hudson-slave\workspace\maven-plugins-windows\maven-gpg-plugin\pom.xml
to /home/hudson/hudson/jobs/maven-plugins-windows/modules/org.apache.maven.plugins$maven-gpg-plugin/builds/2013-05-07_05-06-53/archive/org.apache.maven.plugins/maven-gpg-plugin/1.5-SNAPSHOT/maven-gpg-plugin-1.5-SNAPSHOT.pom
[JENKINS] Archiving F:\hudson\hudson-slave\workspace\maven-plugins-windows\maven-gpg-plugin\target\maven-gpg-plugin-1.5-SNAPSHOT.jar
to /home/hudson/hudson/jobs/maven-plugins-windows/modules/org.apache.maven.plugins$maven-gpg-plugin/builds/2013-05-07_05-06-53/archive/org.apache.maven.plugins/maven-gpg-plugin/1.5-SNAPSHOT/maven-gpg-plugin-1.5-SNAPSHOT.jar
[JENKINS] Archiving F:\hudson\hudson-slave\workspace\maven-plugins-windows\maven-clean-plugin\pom.xml
to /home/hudson/hudson/jobs/maven-plugins-windows/modules/org.apache.maven.plugins$maven-clean-plugin/builds/2013-05-07_05-06-53/archive/org.apache.maven.plugins/maven-clean-plugin/2.6-SNAPSHOT/maven-clean-plugin-2.6-SNAPSHOT.pom
[JENKINS] Archiving F:\hudson\hudson-slave\workspace\maven-plugins-windows\maven-clean-plugin\target\maven-clean-plugin-2.6-SNAPSHOT.jar
to /home/hudson/hudson/jobs/maven-plugins-windows/modules/org.apache.maven.plugins$maven-clean-plugin/builds/2013-05-07_05-06-53/archive/org.apache.maven.plugins/maven-clean-plugin/2.6-SNAPSHOT/maven-clean-plugin-2.6-SNAPSHOT.jar
[JENKINS] Archiving F:\hudson\hudson-slave\workspace\maven-plugins-windows\maven-jar-plugin\pom.xml
to /home/hudson/hudson/jobs/maven-plugins-windows/modules/org.apache.maven.plugins$maven-jar-plugin/builds/2013-05-07_05-06-53/archive/org.apache.maven.plugins/maven-jar-plugin/2.5-SNAPSHOT/maven-jar-plugin-2.5-SNAPSHOT.pom
[JENKINS] Archiving F:\hudson\hudson-slave\workspace\maven-plugins-windows\maven-jar-plugin\target\maven-jar-plugin-2.5-SNAPSHOT.jar
to /home/hudson/hudson/jobs/maven-plugins-windows/modules/org.apache.maven.plugins$maven-jar-plugin/builds/2013-05-07_05-06-53/archive/org.apache.maven.plugins/maven-jar-plugin/2.5-SNAPSHOT/maven-jar-plugin-2.5-SNAPSHOT.jar
[JENKINS] Archiving F:\hudson\hudson-slave\workspace\maven-plugins-windows\maven-site-plugin\dependency-reduced-pom.xml
to /home/hudson/hudson/jobs/maven-plugins-windows/modules/org.apache.maven.plugins$maven-site-plugin/builds/2013-05-07_05-06-54/archive/org.apache.maven.plugins/maven-site-plugin/3.3-SNAPSHOT/maven-site-plugin-3.3-SNAPSHOT.pom
[JENKINS] Archiving F:\hudson\hudson-slave\workspace\maven-plugins-windows\maven-site-plugin\target\maven-site-plugin-3.3-SNAPSHOT.jar
to /home/hudson/hudson/jobs/maven-plugins-windows/modules/org.apache.maven.plugins$maven-site-plugin/builds/2013-05-07_05-06-54/archive/org.apache.maven.plugins/maven-site-plugin/3.3-SNAPSHOT/maven-site-plugin-3.3-SNAPSHOT.jar
[JENKINS] Archiving F:\hudson\hudson-slave\workspace\maven-plugins-windows\maven-patch-plugin\pom.xml
to /home/hudson/hudson/jobs/maven-plugins-windows/modules/org.apache.maven.plugins$maven-patch-plugin/builds/2013-05-07_05-06-54/archive/org.apache.maven.plugins/maven-patch-plugin/1.2-SNAPSHOT/maven-patch-plugin-1.2-SNAPSHOT.pom
[JENKINS] Archiving F:\hudson\hudson-slave\workspace\maven-plugins-windows\maven-patch-plugin\target\maven-patch-plugin-1.2-SNAPSHOT.jar
to /home/hudson/hudson/jobs/maven-plugins-windows/modules/org.apache.maven.plugins$maven-patch-plugin/builds/2013-05-07_05-06-54/archive/org.apache.maven.plugins/maven-patch-plugin/1.2-SNAPSHOT/maven-patch-plugin-1.2-SNAPSHOT.jar
[JENKINS] Archiving F:\hudson\hudson-slave\workspace\maven-plugins-windows\maven-install-plugin\pom.xml
to /home/hudson/hudson/jobs/maven-plugins-windows/modules/org.apache.maven.plugins$maven-install-plugin/builds/2013-05-07_05-06-53/archive/org.apache.maven.plugins/maven-install-plugin/2.5-SNAPSHOT/maven-install-plugin-2.5-SNAPSHOT.pom
[JENKINS] Archiving F:\hudson\hudson-slave\workspace\maven-plugins-windows\maven-install-plugin\target\maven-install-plugin-2.5-SNAPSHOT.jar
to /home/hudson/hudson/jobs/maven-plugins-windows/modules/org.apache.maven.plugins$maven-install-plugin/builds/2013-05-07_05-06-53/archive/org.apache.maven.plugins/maven-install-plugin/2.5-SNAPSHOT/maven-install-plugin-2.5-SNAPSHOT.jar
[JENKINS] Archiving F:\hudson\hudson-slave\workspace\maven-plugins-windows\maven-antrun-plugin\pom.xml
to /home/hudson/hudson/jobs/maven-plugins-windows/modules/org.apache.maven.plugins$maven-antrun-plugin/builds/2013-05-07_05-06-53/archive/org.apache.maven.plugins/maven-antrun-plugin/1.8-SNAPSHOT/maven-antrun-plugin-1.8-SNAPSHOT.pom
[JENKINS] Archiving F:\hudson\hudson-slave\workspace\maven-plugins-windows\maven-antrun-plugin\target\maven-antrun-plugin-1.8-SNAPSHOT.jar
to /home/hudson/hudson/jobs/maven-plugins-windows/modules/org.apache.maven.plugins$maven-antrun-plugin/builds/2013-05-07_05-06-53/archive/org.apache.maven.plugins/maven-antrun-plugin/1.8-SNAPSHOT/maven-antrun-plugin-1.8-SNAPSHOT.jar
[JENKINS] Archiving F:\hudson\hudson-slave\workspace\maven-plugins-windows\maven-changes-plugin\pom.xml
to /home/hudson/hudson/jobs/maven-plugins-windows/modules/org.apache.maven.plugins$maven-changes-plugin/builds/2013-05-07_05-06-53/archive/org.apache.maven.plugins/maven-changes-plugin/2.10-SNAPSHOT/maven-changes-plugin-2.10-SNAPSHOT.pom
[JENKINS] Archiving F:\hudson\hudson-slave\workspace\maven-plugins-windows\maven-changes-plugin\target\maven-changes-plugin-2.10-SNAPSHOT.jar
to /home/hudson/hudson/jobs/maven-plugins-windows/modules/org.apache.maven.plugins$maven-changes-plugin/builds/2013-05-07_05-06-53/archive/org.apache.maven.plugins/maven-changes-plugin/2.10-SNAPSHOT/maven-changes-plugin-2.10-SNAPSHOT.jar
[JENKINS] Archiving F:\hudson\hudson-slave\workspace\maven-plugins-windows\maven-rar-plugin\pom.xml
to /home/hudson/hudson/jobs/maven-plugins-windows/modules/org.apache.maven.plugins$maven-rar-plugin/builds/2013-05-07_05-06-54/archive/org.apache.maven.plugins/maven-rar-plugin/2.4-SNAPSHOT/maven-rar-plugin-2.4-SNAPSHOT.pom
[JENKINS] Archiving F:\hudson\hudson-slave\workspace\maven-plugins-windows\maven-rar-plugin\target\maven-rar-plugin-2.4-SNAPSHOT.jar
to /home/hudson/hudson/jobs/maven-plugins-windows/modules/org.apache.maven.plugins$maven-rar-plugin/builds/2013-05-07_05-06-54/archive/org.apache.maven.plugins/maven-rar-plugin/2.4-SNAPSHOT/maven-rar-plugin-2.4-SNAPSHOT.jar
[JENKINS] Archiving F:\hudson\hudson-slave\workspace\maven-plugins-windows\maven-jarsigner-plugin\pom.xml
to /home/hudson/hudson/jobs/maven-plugins-windows/modules/org.apache.maven.plugins$maven-jarsigner-plugin/builds/2013-05-07_05-06-54/archive/org.apache.maven.plugins/maven-jarsigner-plugin/1.3-SNAPSHOT/maven-jarsigner-plugin-1.3-SNAPSHOT.pom
[JENKINS] Archiving F:\hudson\hudson-slave\workspace\maven-plugins-windows\maven-jarsigner-plugin\target\maven-jarsigner-plugin-1.3-SNAPSHOT.jar
to /home/hudson/hudson/jobs/maven-plugins-windows/modules/org.apache.maven.plugins$maven-jarsigner-plugin/builds/2013-05-07_05-06-54/archive/org.apache.maven.plugins/maven-jarsigner-plugin/1.3-SNAPSHOT/maven-jarsigner-plugin-1.3-SNAPSHOT.jar
[JENKINS] Archiving F:\hudson\hudson-slave\workspace\maven-plugins-windows\maven-ear-plugin\pom.xml
to /home/hudson/hudson/jobs/maven-plugins-windows/modules/org.apache.maven.plugins$maven-ear-plugin/builds/2013-05-07_05-06-53/archive/org.apache.maven.plugins/maven-ear-plugin/2.9-SNAPSHOT/maven-ear-plugin-2.9-SNAPSHOT.pom
[JENKINS] Archiving F:\hudson\hudson-slave\workspace\maven-plugins-windows\maven-ear-plugin\target\maven-ear-plugin-2.9-SNAPSHOT.jar
to /home/hudson/hudson/jobs/maven-plugins-windows/modules/org.apache.maven.plugins$maven-ear-plugin/builds/2013-05-07_05-06-53/archive/org.apache.maven.plugins/maven-ear-plugin/2.9-SNAPSHOT/maven-ear-plugin-2.9-SNAPSHOT.jar
[JENKINS] Archiving F:\hudson\hudson-slave\workspace\maven-plugins-windows\maven-changelog-plugin\pom.xml
to /home/hudson/hudson/jobs/maven-plugins-windows/modules/org.apache.maven.plugins$maven-changelog-plugin/builds/2013-05-07_05-06-53/archive/org.apache.maven.plugins/maven-changelog-plugin/2.3-SNAPSHOT/maven-changelog-plugin-2.3-SNAPSHOT.pom
[JENKINS] Archiving F:\hudson\hudson-slave\workspace\maven-plugins-windows\maven-changelog-plugin\target\maven-changelog-plugin-2.3-SNAPSHOT.jar
to /home/hudson/hudson/jobs/maven-plugins-windows/modules/org.apache.maven.plugins$maven-changelog-plugin/builds/2013-05-07_05-06-53/archive/org.apache.maven.plugins/maven-changelog-plugin/2.3-SNAPSHOT/maven-changelog-plugin-2.3-SNAPSHOT.jar
[JENKINS] Archiving F:\hudson\hudson-slave\workspace\maven-plugins-windows\maven-verifier-plugin\pom.xml
to /home/hudson/hudson/jobs/maven-plugins-windows/modules/org.apache.maven.plugins$maven-verifier-plugin/builds/2013-05-07_05-06-54/archive/org.apache.maven.plugins/maven-verifier-plugin/1.1-SNAPSHOT/maven-verifier-plugin-1.1-SNAPSHOT.pom
[JENKINS] Archiving F:\hudson\hudson-slave\workspace\maven-plugins-windows\maven-verifier-plugin\target\maven-verifier-plugin-1.1-SNAPSHOT.jar
to /home/hudson/hudson/jobs/maven-plugins-windows/modules/org.apache.maven.plugins$maven-verifier-plugin/builds/2013-05-07_05-06-54/archive/org.apache.maven.plugins/maven-verifier-plugin/1.1-SNAPSHOT/maven-verifier-plugin-1.1-SNAPSHOT.jar
[JENKINS] Archiving F:\hudson\hudson-slave\workspace\maven-plugins-windows\maven-ant-plugin\pom.xml
to /home/hudson/hudson/jobs/maven-plugins-windows/modules/org.apache.maven.plugins$maven-ant-plugin/builds/2013-05-07_05-06-53/archive/org.apache.maven.plugins/maven-ant-plugin/2.4-SNAPSHOT/maven-ant-plugin-2.4-SNAPSHOT.pom
[JENKINS] Archiving F:\hudson\hudson-slave\workspace\maven-plugins-windows\maven-ant-plugin\target\maven-ant-plugin-2.4-SNAPSHOT.jar
to /home/hudson/hudson/jobs/maven-plugins-windows/modules/org.apache.maven.plugins$maven-ant-plugin/builds/2013-05-07_05-06-53/archive/org.apache.maven.plugins/maven-ant-plugin/2.4-SNAPSHOT/maven-ant-plugin-2.4-SNAPSHOT.jar
[JENKINS] Archiving F:\hudson\hudson-slave\workspace\maven-plugins-windows\maven-ejb-plugin\pom.xml
to /home/hudson/hudson/jobs/maven-plugins-windows/modules/org.apache.maven.plugins$maven-ejb-plugin/builds/2013-05-07_05-06-53/archive/org.apache.maven.plugins/maven-ejb-plugin/2.4-SNAPSHOT/maven-ejb-plugin-2.4-SNAPSHOT.pom
[JENKINS] Archiving F:\hudson\hudson-slave\workspace\maven-plugins-windows\maven-ejb-plugin\target\maven-ejb-plugin-2.4-SNAPSHOT.jar
to /home/hudson/hudson/jobs/maven-plugins-windows/modules/org.apache.maven.plugins$maven-ejb-plugin/builds/2013-05-07_05-06-53/archive/org.apache.maven.plugins/maven-ejb-plugin/2.4-SNAPSHOT/maven-ejb-plugin-2.4-SNAPSHOT.jar
[JENKINS] Archiving F:\hudson\hudson-slave\workspace\maven-plugins-windows\maven-stage-plugin\pom.xml
to /home/hudson/hudson/jobs/maven-plugins-windows/modules/org.apache.maven.plugins$maven-stage-plugin/builds/2013-05-07_05-06-54/archive/org.apache.maven.plugins/maven-stage-plugin/1.0-SNAPSHOT/maven-stage-plugin-1.0-SNAPSHOT.pom
[JENKINS] Archiving F:\hudson\hudson-slave\workspace\maven-plugins-windows\maven-stage-plugin\target\maven-stage-plugin-1.0-SNAPSHOT.jar
to /home/hudson/hudson/jobs/maven-plugins-windows/modules/org.apache.maven.plugins$maven-stage-plugin/builds/2013-05-07_05-06-54/archive/org.apache.maven.plugins/maven-stage-plugin/1.0-SNAPSHOT/maven-stage-plugin-1.0-SNAPSHOT.jar
[JENKINS] Archiving F:\hudson\hudson-slave\workspace\maven-plugins-windows\maven-scm-publish-plugin\pom.xml
to /home/hudson/hudson/jobs/maven-plugins-windows/modules/org.apache.maven.plugins$maven-scm-publish-plugin/builds/2013-05-07_05-06-54/archive/org.apache.maven.plugins/maven-scm-publish-plugin/1.0-SNAPSHOT/maven-scm-publish-plugin-1.0-SNAPSHOT.pom
[JENKINS] Archiving F:\hudson\hudson-slave\workspace\maven-plugins-windows\maven-scm-publish-plugin\target\maven-scm-publish-plugin-1.0-SNAPSHOT.jar
to /home/hudson/hudson/jobs/maven-plugins-windows/modules/org.apache.maven.plugins$maven-scm-publish-plugin/builds/2013-05-07_05-06-54/archive/org.apache.maven.plugins/maven-scm-publish-plugin/1.0-SNAPSHOT/maven-scm-publish-plugin-1.0-SNAPSHOT.jar
[JENKINS] Archiving F:\hudson\hudson-slave\workspace\maven-plugins-windows\maven-compiler-plugin\pom.xml
to /home/hudson/hudson/jobs/maven-plugins-windows/modules/org.apache.maven.plugins$maven-compiler-plugin/builds/2013-05-07_05-06-53/archive/org.apache.maven.plugins/maven-compiler-plugin/3.2-SNAPSHOT/maven-compiler-plugin-3.2-SNAPSHOT.pom
[JENKINS] Archiving F:\hudson\hudson-slave\workspace\maven-plugins-windows\maven-compiler-plugin\target\maven-compiler-plugin-3.2-SNAPSHOT.jar
to /home/hudson/hudson/jobs/maven-plugins-windows/modules/org.apache.maven.plugins$maven-compiler-plugin/builds/2013-05-07_05-06-53/archive/org.apache.maven.plugins/maven-compiler-plugin/3.2-SNAPSHOT/maven-compiler-plugin-3.2-SNAPSHOT.jar
[JENKINS] Archiving F:\hudson\hudson-slave\workspace\maven-plugins-windows\maven-reactor-plugin\pom.xml
to /home/hudson/hudson/jobs/maven-plugins-windows/modules/org.apache.maven.plugins$maven-reactor-plugin/builds/2013-05-07_05-06-54/archive/org.apache.maven.plugins/maven-reactor-plugin/1.1-SNAPSHOT/maven-reactor-plugin-1.1-SNAPSHOT.pom
[JENKINS] Archiving F:\hudson\hudson-slave\workspace\maven-plugins-windows\maven-reactor-plugin\target\maven-reactor-plugin-1.1-SNAPSHOT.jar
to /home/hudson/hudson/jobs/maven-plugins-windows/modules/org.apache.maven.plugins$maven-reactor-plugin/builds/2013-05-07_05-06-54/archive/org.apache.maven.plugins/maven-reactor-plugin/1.1-SNAPSHOT/maven-reactor-plugin-1.1-SNAPSHOT.jar
[JENKINS] Archiving F:\hudson\hudson-slave\workspace\maven-plugins-windows\maven-doap-plugin\pom.xml
to /home/hudson/hudson/jobs/maven-plugins-windows/modules/org.apache.maven.plugins$maven-doap-plugin/builds/2013-05-07_05-06-53/archive/org.apache.maven.plugins/maven-doap-plugin/1.2-SNAPSHOT/maven-doap-plugin-1.2-SNAPSHOT.pom
[JENKINS] Archiving F:\hudson\hudson-slave\workspace\maven-plugins-windows\maven-doap-plugin\target\maven-doap-plugin-1.2-SNAPSHOT.jar
to /home/hudson/hudson/jobs/maven-plugins-windows/modules/org.apache.maven.plugins$maven-doap-plugin/builds/2013-05-07_05-06-53/archive/org.apache.maven.plugins/maven-doap-plugin/1.2-SNAPSHOT/maven-doap-plugin-1.2-SNAPSHOT.jar
[JENKINS] Archiving F:\hudson\hudson-slave\workspace\maven-plugins-windows\maven-checkstyle-plugin\pom.xml
to /home/hudson/hudson/jobs/maven-plugins-windows/modules/org.apache.maven.plugins$maven-checkstyle-plugin/builds/2013-05-07_05-06-53/archive/org.apache.maven.plugins/maven-checkstyle-plugin/2.11-SNAPSHOT/maven-checkstyle-plugin-2.11-SNAPSHOT.pom
[JENKINS] Archiving F:\hudson\hudson-slave\workspace\maven-plugins-windows\maven-checkstyle-plugin\target\maven-checkstyle-plugin-2.11-SNAPSHOT.jar
to /home/hudson/hudson/jobs/maven-plugins-windows/modules/org.apache.maven.plugins$maven-checkstyle-plugin/builds/2013-05-07_05-06-53/archive/org.apache.maven.plugins/maven-checkstyle-plugin/2.11-SNAPSHOT/maven-checkstyle-plugin-2.11-SNAPSHOT.jar
[JENKINS] Archiving F:\hudson\hudson-slave\workspace\maven-plugins-windows\maven-source-plugin\pom.xml
to /home/hudson/hudson/jobs/maven-plugins-windows/modules/org.apache.maven.plugins$maven-source-plugin/builds/2013-05-07_05-06-54/archive/org.apache.maven.plugins/maven-source-plugin/2.3-SNAPSHOT/maven-source-plugin-2.3-SNAPSHOT.pom
[JENKINS] Archiving F:\hudson\hudson-slave\workspace\maven-plugins-windows\maven-source-plugin\target\maven-source-plugin-2.3-SNAPSHOT.jar
to /home/hudson/hudson/jobs/maven-plugins-windows/modules/org.apache.maven.plugins$maven-source-plugin/builds/2013-05-07_05-06-54/archive/org.apache.maven.plugins/maven-source-plugin/2.3-SNAPSHOT/maven-source-plugin-2.3-SNAPSHOT.jar
[JENKINS] Archiving F:\hudson\hudson-slave\workspace\maven-plugins-windows\maven-dependency-plugin\pom.xml
to /home/hudson/hudson/jobs/maven-plugins-windows/modules/org.apache.maven.plugins$maven-dependency-plugin/builds/2013-05-07_05-06-53/archive/org.apache.maven.plugins/maven-dependency-plugin/2.8-SNAPSHOT/maven-dependency-plugin-2.8-SNAPSHOT.pom
[JENKINS] Archiving F:\hudson\hudson-slave\workspace\maven-plugins-windows\maven-javadoc-plugin\pom.xml
to /home/hudson/hudson/jobs/maven-plugins-windows/modules/org.apache.maven.plugins$maven-javadoc-plugin/builds/2013-05-07_05-06-54/archive/org.apache.maven.plugins/maven-javadoc-plugin/2.10-SNAPSHOT/maven-javadoc-plugin-2.10-SNAPSHOT.pom
[JENKINS] Archiving F:\hudson\hudson-slave\workspace\maven-plugins-windows\maven-javadoc-plugin\target\maven-javadoc-plugin-2.10-SNAPSHOT.jar
to /home/hudson/hudson/jobs/maven-plugins-windows/modules/org.apache.maven.plugins$maven-javadoc-plugin/builds/2013-05-07_05-06-54/archive/org.apache.maven.plugins/maven-javadoc-plugin/2.10-SNAPSHOT/maven-javadoc-plugin-2.10-SNAPSHOT.jar
[JENKINS] Archiving F:\hudson\hudson-slave\workspace\maven-plugins-windows\maven-deploy-plugin\pom.xml
to /home/hudson/hudson/jobs/maven-plugins-windows/modules/org.apache.maven.plugins$maven-deploy-plugin/builds/2013-05-07_05-06-53/archive/org.apache.maven.plugins/maven-deploy-plugin/2.8-SNAPSHOT/maven-deploy-plugin-2.8-SNAPSHOT.pom
[JENKINS] Archiving F:\hudson\hudson-slave\workspace\maven-plugins-windows\maven-deploy-plugin\target\maven-deploy-plugin-2.8-SNAPSHOT.jar
to /home/hudson/hudson/jobs/maven-plugins-windows/modules/org.apache.maven.plugins$maven-deploy-plugin/builds/2013-05-07_05-06-53/archive/org.apache.maven.plugins/maven-deploy-plugin/2.8-SNAPSHOT/maven-deploy-plugin-2.8-SNAPSHOT.jar
[JENKINS] Archiving F:\hudson\hudson-slave\workspace\maven-plugins-windows\maven-acr-plugin\pom.xml
to /home/hudson/hudson/jobs/maven-plugins-windows/modules/org.apache.maven.plugins$maven-acr-plugin/builds/2013-05-07_05-06-53/archive/org.apache.maven.plugins/maven-acr-plugin/1.0.1-SNAPSHOT/maven-acr-plugin-1.0.1-SNAPSHOT.pom
[JENKINS] Archiving F:\hudson\hudson-slave\workspace\maven-plugins-windows\maven-acr-plugin\target\maven-acr-plugin-1.0.1-SNAPSHOT.jar
to /home/hudson/hudson/jobs/maven-plugins-windows/modules/org.apache.maven.plugins$maven-acr-plugin/builds/2013-05-07_05-06-53/archive/org.apache.maven.plugins/maven-acr-plugin/1.0.1-SNAPSHOT/maven-acr-plugin-1.0.1-SNAPSHOT.jar
[JENKINS] Archiving F:\hudson\hudson-slave\workspace\maven-plugins-windows\maven-repository-plugin\pom.xml
to /home/hudson/hudson/jobs/maven-plugins-windows/modules/org.apache.maven.plugins$maven-repository-plugin/builds/2013-05-07_05-06-54/archive/org.apache.maven.plugins/maven-repository-plugin/2.3.2-SNAPSHOT/maven-repository-plugin-2.3.2-SNAPSHOT.pom
[JENKINS] Archiving F:\hudson\hudson-slave\workspace\maven-plugins-windows\maven-repository-plugin\target\maven-repository-plugin-2.3.2-SNAPSHOT.jar
to /home/hudson/hudson/jobs/maven-plugins-windows/modules/org.apache.maven.plugins$maven-repository-plugin/builds/2013-05-07_05-06-54/archive/org.apache.maven.plugins/maven-repository-plugin/2.3.2-SNAPSHOT/maven-repository-plugin-2.3.2-SNAPSHOT.jar
[JENKINS] Archiving F:\hudson\hudson-slave\workspace\maven-plugins-windows\maven-assembly-plugin\pom.xml
to /home/hudson/hudson/jobs/maven-plugins-windows/modules/org.apache.maven.plugins$maven-assembly-plugin/builds/2013-05-07_05-06-53/archive/org.apache.maven.plugins/maven-assembly-plugin/2.5-SNAPSHOT/maven-assembly-plugin-2.5-SNAPSHOT.pom
[JENKINS] Archiving F:\hudson\hudson-slave\workspace\maven-plugins-windows\maven-assembly-plugin\target\maven-assembly-plugin-2.5-SNAPSHOT.jar
to /home/hudson/hudson/jobs/maven-plugins-windows/modules/org.apache.maven.plugins$maven-assembly-plugin/builds/2013-05-07_05-06-53/archive/org.apache.maven.plugins/maven-assembly-plugin/2.5-SNAPSHOT/maven-assembly-plugin-2.5-SNAPSHOT.jar
[JENKINS] Archiving F:\hudson\hudson-slave\workspace\maven-plugins-windows\maven-project-info-reports-plugin\pom.xml
to /home/hudson/hudson/jobs/maven-plugins-windows/modules/org.apache.maven.plugins$maven-project-info-reports-plugin/builds/2013-05-07_05-06-54/archive/org.apache.maven.plugins/maven-project-info-reports-plugin/2.7-SNAPSHOT/maven-project-info-reports-plugin-2.7-SNAPSHOT.pom
[JENKINS] Archiving F:\hudson\hudson-slave\workspace\maven-plugins-windows\maven-project-info-reports-plugin\target\maven-project-info-reports-plugin-2.7-SNAPSHOT.jar
to /home/hudson/hudson/jobs/maven-plugins-windows/modules/org.apache.maven.plugins$maven-project-info-reports-plugin/builds/2013-05-07_05-06-54/archive/org.apache.maven.plugins/maven-project-info-reports-plugin/2.7-SNAPSHOT/maven-project-info-reports-plugin-2.7-SNAPSHOT.jar
[JENKINS] Archiving F:\hudson\hudson-slave\workspace\maven-plugins-windows\maven-one-plugin\pom.xml
to /home/hudson/hudson/jobs/maven-plugins-windows/modules/org.apache.maven.plugins$maven-one-plugin/builds/2013-05-07_05-06-54/archive/org.apache.maven.plugins/maven-one-plugin/1.3-SNAPSHOT/maven-one-plugin-1.3-SNAPSHOT.pom
[JENKINS] Archiving F:\hudson\hudson-slave\workspace\maven-plugins-windows\maven-one-plugin\target\maven-one-plugin-1.3-SNAPSHOT.jar
to /home/hudson/hudson/jobs/maven-plugins-windows/modules/org.apache.maven.plugins$maven-one-plugin/builds/2013-05-07_05-06-54/archive/org.apache.maven.plugins/maven-one-plugin/1.3-SNAPSHOT/maven-one-plugin-1.3-SNAPSHOT.jar
[JENKINS] Archiving F:\hudson\hudson-slave\workspace\maven-plugins-windows\maven-help-plugin\pom.xml
to /home/hudson/hudson/jobs/maven-plugins-windows/modules/org.apache.maven.plugins$maven-help-plugin/builds/2013-05-07_05-06-53/archive/org.apache.maven.plugins/maven-help-plugin/2.2.1-SNAPSHOT/maven-help-plugin-2.2.1-SNAPSHOT.pom
[JENKINS] Archiving F:\hudson\hudson-slave\workspace\maven-plugins-windows\maven-help-plugin\target\maven-help-plugin-2.2.1-SNAPSHOT.jar
to /home/hudson/hudson/jobs/maven-plugins-windows/modules/org.apache.maven.plugins$maven-help-plugin/builds/2013-05-07_05-06-53/archive/org.apache.maven.plugins/maven-help-plugin/2.2.1-SNAPSHOT/maven-help-plugin-2.2.1-SNAPSHOT.jar
[JENKINS] Archiving F:\hudson\hudson-slave\workspace\maven-plugins-windows\maven-invoker-plugin\pom.xml
to /home/hudson/hudson/jobs/maven-plugins-windows/modules/org.apache.maven.plugins$maven-invoker-plugin/builds/2013-05-07_05-06-54/archive/org.apache.maven.plugins/maven-invoker-plugin/1.9-SNAPSHOT/maven-invoker-plugin-1.9-SNAPSHOT.pom
[JENKINS] Archiving F:\hudson\hudson-slave\workspace\maven-plugins-windows\maven-invoker-plugin\target\maven-invoker-plugin-1.9-SNAPSHOT.jar
to /home/hudson/hudson/jobs/maven-plugins-windows/modules/org.apache.maven.plugins$maven-invoker-plugin/builds/2013-05-07_05-06-54/archive/org.apache.maven.plugins/maven-invoker-plugin/1.9-SNAPSHOT/maven-invoker-plugin-1.9-SNAPSHOT.jar
[JENKINS] Archiving F:\hudson\hudson-slave\workspace\maven-plugins-windows\maven-remote-resources-plugin\pom.xml
to /home/hudson/hudson/jobs/maven-plugins-windows/modules/org.apache.maven.plugins$maven-remote-resources-plugin/builds/2013-05-07_05-06-54/archive/org.apache.maven.plugins/maven-remote-resources-plugin/1.5-SNAPSHOT/maven-remote-resources-plugin-1.5-SNAPSHOT.pom
[JENKINS] Archiving F:\hudson\hudson-slave\workspace\maven-plugins-windows\maven-remote-resources-plugin\target\maven-remote-resources-plugin-1.5-SNAPSHOT.jar
to /home/hudson/hudson/jobs/maven-plugins-windows/modules/org.apache.maven.plugins$maven-remote-resources-plugin/builds/2013-05-07_05-06-54/archive/org.apache.maven.plugins/maven-remote-resources-plugin/1.5-SNAPSHOT/maven-remote-resources-plugin-1.5-SNAPSHOT.jar
[JENKINS] Archiving F:\hudson\hudson-slave\workspace\maven-plugins-windows\maven-pdf-plugin\pom.xml
to /home/hudson/hudson/jobs/maven-plugins-windows/modules/org.apache.maven.plugins$maven-pdf-plugin/builds/2013-05-07_05-06-54/archive/org.apache.maven.plugins/maven-pdf-plugin/1.3-SNAPSHOT/maven-pdf-plugin-1.3-SNAPSHOT.pom
[JENKINS] Archiving F:\hudson\hudson-slave\workspace\maven-plugins-windows\maven-pdf-plugin\target\maven-pdf-plugin-1.3-SNAPSHOT.jar
to /home/hudson/hudson/jobs/maven-plugins-windows/modules/org.apache.maven.plugins$maven-pdf-plugin/builds/2013-05-07_05-06-54/archive/org.apache.maven.plugins/maven-pdf-plugin/1.3-SNAPSHOT/maven-pdf-plugin-1.3-SNAPSHOT.jar
[JENKINS] Archiving F:\hudson\hudson-slave\workspace\maven-plugins-windows\maven-shade-plugin\pom.xml
to /home/hudson/hudson/jobs/maven-plugins-windows/modules/org.apache.maven.plugins$maven-shade-plugin/builds/2013-05-07_05-06-54/archive/org.apache.maven.plugins/maven-shade-plugin/3.0-SNAPSHOT/maven-shade-plugin-3.0-SNAPSHOT.pom
[JENKINS] Archiving F:\hudson\hudson-slave\workspace\maven-plugins-windows\maven-shade-plugin\target\maven-shade-plugin-3.0-SNAPSHOT.jar
to /home/hudson/hudson/jobs/maven-plugins-windows/modules/org.apache.maven.plugins$maven-shade-plugin/builds/2013-05-07_05-06-54/archive/org.apache.maven.plugins/maven-shade-plugin/3.0-SNAPSHOT/maven-shade-plugin-3.0-SNAPSHOT.jar
[JENKINS] Archiving F:\hudson\hudson-slave\workspace\maven-plugins-windows\maven-plugins\pom.xml
to /home/hudson/hudson/jobs/maven-plugins-windows/modules/org.apache.maven.plugins$maven-plugins/builds/2013-05-07_05-06-53/archive/org.apache.maven.plugins/maven-plugins/25-SNAPSHOT/maven-plugins-25-SNAPSHOT.pom
[JENKINS] Archiving F:\hudson\hudson-slave\workspace\maven-plugins-windows\maven-plugins\target\maven-plugins-25-SNAPSHOT-site.xml
to /home/hudson/hudson/jobs/maven-plugins-windows/modules/org.apache.maven.plugins$maven-plugins/builds/2013-05-07_05-06-53/archive/org.apache.maven.plugins/maven-plugins/25-SNAPSHOT/maven-plugins-25-SNAPSHOT-site.xml
Downloading: http://repository.apache.org/snapshots/org/apache/maven/maven-parent/24-SNAPSHOT/maven-metadata.xml
Downloaded: http://repository.apache.org/snapshots/org/apache/maven/maven-parent/24-SNAPSHOT/maven-metadata.xml
(807 B at 6.1 KB/sec)
[JENKINS] Archiving F:\hudson\hudson-slave\workspace\maven-plugins-windows\maven-linkcheck-plugin\pom.xml
to /home/hudson/hudson/jobs/maven-plugins-windows/modules/org.apache.maven.plugins$maven-linkcheck-plugin/builds/2013-05-07_05-06-54/archive/org.apache.maven.plugins/maven-linkcheck-plugin/1.2-SNAPSHOT/maven-linkcheck-plugin-1.2-SNAPSHOT.pom
[JENKINS] Archiving F:\hudson\hudson-slave\workspace\maven-plugins-windows\maven-linkcheck-plugin\target\maven-linkcheck-plugin-1.2-SNAPSHOT.jar
to /home/hudson/hudson/jobs/maven-plugins-windows/modules/org.apache.maven.plugins$maven-linkcheck-plugin/builds/2013-05-07_05-06-54/archive/org.apache.maven.plugins/maven-linkcheck-plugin/1.2-SNAPSHOT/maven-linkcheck-plugin-1.2-SNAPSHOT.jar
[JENKINS] Archiving F:\hudson\hudson-slave\workspace\maven-plugins-windows\maven-resources-plugin\pom.xml
to /home/hudson/hudson/jobs/maven-plugins-windows/modules/org.apache.maven.plugins$maven-resources-plugin/builds/2013-05-07_05-06-54/archive/org.apache.maven.plugins/maven-resources-plugin/2.7-SNAPSHOT/maven-resources-plugin-2.7-SNAPSHOT.pom
[JENKINS] Archiving F:\hudson\hudson-slave\workspace\maven-plugins-windows\maven-resources-plugin\target\maven-resources-plugin-2.7-SNAPSHOT.jar
to /home/hudson/hudson/jobs/maven-plugins-windows/modules/org.apache.maven.plugins$maven-resources-plugin/builds/2013-05-07_05-06-54/archive/org.apache.maven.plugins/maven-resources-plugin/2.7-SNAPSHOT/maven-resources-plugin-2.7-SNAPSHOT.jar
Waiting for Jenkins to finish collecting data
mavenExecutionResult exceptions not empty
message : Failed to execute goal org.apache.maven.plugins:maven-surefire-plugin:2.12.2:test
(default-test) on project maven-dependency-plugin: Execution default-test of goal org.apache.maven.plugins:maven-surefire-plugin:2.12.2:test
failed: The forked VM terminated without saying properly goodbye. VM crash or System.exit
called ?
cause : Execution default-test of goal org.apache.maven.plugins:maven-surefire-plugin:2.12.2:test
failed: The forked VM terminated without saying properly goodbye. VM crash or System.exit
called ?
Stack trace : 
org.apache.maven.lifecycle.LifecycleExecutionException: Failed to execute goal org.apache.maven.plugins:maven-surefire-plugin:2.12.2:test
(default-test) on project maven-dependency-plugin: Execution default-test of goal org.apache.maven.plugins:maven-surefire-plugin:2.12.2:test
failed: The forked VM terminated without saying properly goodbye. VM crash or System.exit
called ?
	at org.apache.maven.lifecycle.internal.MojoExecutor.execute(MojoExecutor.java:225)
	at org.apache.maven.lifecycle.internal.MojoExecutor.execute(MojoExecutor.java:153)
	at org.apache.maven.lifecycle.internal.MojoExecutor.execute(MojoExecutor.java:145)
	at org.apache.maven.lifecycle.internal.LifecycleModuleBuilder.buildProject(LifecycleModuleBuilder.java:84)
	at org.apache.maven.lifecycle.internal.LifecycleThreadedBuilder$1.call(LifecycleThreadedBuilder.java:167)
	at org.apache.maven.lifecycle.internal.LifecycleThreadedBuilder$1.call(LifecycleThreadedBuilder.java:164)
	at java.util.concurrent.FutureTask$Sync.innerRun(FutureTask.java:269)
	at java.util.concurrent.FutureTask.run(FutureTask.java:123)
	at java.util.concurrent.ThreadPoolExecutor$Worker.runTask(ThreadPoolExecutor.java:651)
	at java.util.concurrent.ThreadPoolExecutor$Worker.run(ThreadPoolExecutor.java:676)
	at java.lang.Thread.run(Thread.java:595)
Caused by: org.apache.maven.plugin.PluginExecutionException: Execution default-test of goal
org.apache.maven.plugins:maven-surefire-plugin:2.12.2:test failed: The forked VM terminated
without saying properly goodbye. VM crash or System.exit called ?
	at org.apache.maven.plugin.DefaultBuildPluginManager.executeMojo(DefaultBuildPluginManager.java:116)
	at org.apache.maven.lifecycle.internal.MojoExecutor.execute(MojoExecutor.java:209)
	... 10 more
Caused by: java.lang.RuntimeException: The forked VM terminated without saying properly goodbye.
VM crash or System.exit called ?
	at org.apache.maven.plugin.surefire.booterclient.output.ForkClient.close(ForkClient.java:245)
	at org.apache.maven.plugin.surefire.booterclient.ForkStarter.fork(ForkStarter.java:282)
	at org.apache.maven.plugin.surefire.booterclient.ForkStarter.run(ForkStarter.java:116)
	at org.apache.maven.plugin.surefire.AbstractSurefireMojo.executeProvider(AbstractSurefireMojo.java:695)
	at org.apache.maven.plugin.surefire.AbstractSurefireMojo.executeAllProviders(AbstractSurefireMojo.java:666)
	at org.apache.maven.plugin.surefire.AbstractSurefireMojo.executeAfterPreconditionsChecked(AbstractSurefireMojo.java:624)
	at org.apache.maven.plugin.surefire.AbstractSurefireMojo.execute(AbstractSurefireMojo.java:587)
	at org.apache.maven.plugin.DefaultBuildPluginManager.executeMojo(DefaultBuildPluginManager.java:107)
	... 11 more
Maven failed with error.
Sending e-mails to: notifications@maven.apache.org
channel stopped
[WARNINGS] Skipping publisher since build result is FAILURE

Mime
View raw message