maven-notifications mailing list archives

Site index · List index
Message view « Date » · « Thread »
Top « Date » · « Thread »
From Apache Jenkins Server <jenk...@builds.apache.org>
Subject Build failed in Jenkins: maven-plugins-ITs-m3 #969
Date Wed, 08 May 2013 18:06:18 GMT
See <https://builds.apache.org/job/maven-plugins-ITs-m3/969/changes>

Changes:

[hboutemy] replaced Beanshell verify scripts with Groovy ones: tests are a lot easier to read

------------------------------------------
[...truncated 11379 lines...]
[INFO] Installing <https://builds.apache.org/job/maven-plugins-ITs-m3/ws/maven-resources-plugin/pom.xml>
to <https://builds.apache.org/job/maven-plugins-ITs-m3/ws/maven-shade-plugin/target/local-repo/org/apache/maven/plugins/maven-resources-plugin/2.7-SNAPSHOT/maven-resources-plugin-2.7-SNAPSHOT.pom>
[INFO] Installing <https://builds.apache.org/job/maven-plugins-ITs-m3/ws/maven-resources-plugin/target/maven-resources-plugin-2.7-SNAPSHOT.jar>
to <https://builds.apache.org/job/maven-plugins-ITs-m3/ws/maven-shade-plugin/target/local-repo/org/apache/maven/plugins/maven-resources-plugin/2.7-SNAPSHOT/maven-resources-plugin-2.7-SNAPSHOT.jar>
[INFO] Installing <https://builds.apache.org/job/maven-plugins-ITs-m3/ws/maven-resources-plugin/pom.xml>
to <https://builds.apache.org/job/maven-plugins-ITs-m3/ws/maven-shade-plugin/target/local-repo/org/apache/maven/plugins/maven-resources-plugin/2.7-SNAPSHOT/maven-resources-plugin-2.7-SNAPSHOT.pom>
[INFO] Installing <https://builds.apache.org/job/maven-plugins-ITs-m3/ws/maven-resources-plugin/target/maven-resources-plugin-2.7-SNAPSHOT-tests.jar>
to <https://builds.apache.org/job/maven-plugins-ITs-m3/ws/maven-shade-plugin/target/local-repo/org/apache/maven/plugins/maven-resources-plugin/2.7-SNAPSHOT/maven-resources-plugin-2.7-SNAPSHOT-tests.jar>
[INFO] Installing <https://builds.apache.org/job/maven-plugins-ITs-m3/ws/maven-site-plugin/dependency-reduced-pom.xml>
to <https://builds.apache.org/job/maven-plugins-ITs-m3/ws/maven-shade-plugin/target/local-repo/org/apache/maven/plugins/maven-site-plugin/3.3-SNAPSHOT/maven-site-plugin-3.3-SNAPSHOT.pom>
[INFO] Installing <https://builds.apache.org/job/maven-plugins-ITs-m3/ws/maven-site-plugin/target/maven-site-plugin-3.3-SNAPSHOT.jar>
to <https://builds.apache.org/job/maven-plugins-ITs-m3/ws/maven-shade-plugin/target/local-repo/org/apache/maven/plugins/maven-site-plugin/3.3-SNAPSHOT/maven-site-plugin-3.3-SNAPSHOT.jar>
[INFO] Installing <https://builds.apache.org/job/maven-plugins-ITs-m3/ws/maven-site-plugin/dependency-reduced-pom.xml>
to <https://builds.apache.org/job/maven-plugins-ITs-m3/ws/maven-shade-plugin/target/local-repo/org/apache/maven/plugins/maven-site-plugin/3.3-SNAPSHOT/maven-site-plugin-3.3-SNAPSHOT.pom>
[INFO] Installing <https://builds.apache.org/job/maven-plugins-ITs-m3/ws/maven-source-plugin/pom.xml>
to <https://builds.apache.org/job/maven-plugins-ITs-m3/ws/maven-shade-plugin/target/local-repo/org/apache/maven/plugins/maven-source-plugin/2.3-SNAPSHOT/maven-source-plugin-2.3-SNAPSHOT.pom>
[INFO] Installing <https://builds.apache.org/job/maven-plugins-ITs-m3/ws/maven-source-plugin/target/maven-source-plugin-2.3-SNAPSHOT.jar>
to <https://builds.apache.org/job/maven-plugins-ITs-m3/ws/maven-shade-plugin/target/local-repo/org/apache/maven/plugins/maven-source-plugin/2.3-SNAPSHOT/maven-source-plugin-2.3-SNAPSHOT.jar>
[INFO] Installing <https://builds.apache.org/job/maven-plugins-ITs-m3/ws/maven-source-plugin/pom.xml>
to <https://builds.apache.org/job/maven-plugins-ITs-m3/ws/maven-shade-plugin/target/local-repo/org/apache/maven/plugins/maven-source-plugin/2.3-SNAPSHOT/maven-source-plugin-2.3-SNAPSHOT.pom>
[INFO] Installing <https://builds.apache.org/job/maven-plugins-ITs-m3/ws/maven-stage-plugin/pom.xml>
to <https://builds.apache.org/job/maven-plugins-ITs-m3/ws/maven-shade-plugin/target/local-repo/org/apache/maven/plugins/maven-stage-plugin/1.0-SNAPSHOT/maven-stage-plugin-1.0-SNAPSHOT.pom>
[INFO] Installing <https://builds.apache.org/job/maven-plugins-ITs-m3/ws/maven-stage-plugin/target/maven-stage-plugin-1.0-SNAPSHOT.jar>
to <https://builds.apache.org/job/maven-plugins-ITs-m3/ws/maven-shade-plugin/target/local-repo/org/apache/maven/plugins/maven-stage-plugin/1.0-SNAPSHOT/maven-stage-plugin-1.0-SNAPSHOT.jar>
[INFO] Installing <https://builds.apache.org/job/maven-plugins-ITs-m3/ws/maven-stage-plugin/pom.xml>
to <https://builds.apache.org/job/maven-plugins-ITs-m3/ws/maven-shade-plugin/target/local-repo/org/apache/maven/plugins/maven-stage-plugin/1.0-SNAPSHOT/maven-stage-plugin-1.0-SNAPSHOT.pom>
[INFO] Installing <https://builds.apache.org/job/maven-plugins-ITs-m3/ws/maven-toolchains-plugin/pom.xml>
to <https://builds.apache.org/job/maven-plugins-ITs-m3/ws/maven-shade-plugin/target/local-repo/org/apache/maven/plugins/maven-toolchains-plugin/1.1-SNAPSHOT/maven-toolchains-plugin-1.1-SNAPSHOT.pom>
[INFO] Installing <https://builds.apache.org/job/maven-plugins-ITs-m3/ws/maven-toolchains-plugin/target/maven-toolchains-plugin-1.1-SNAPSHOT.jar>
to <https://builds.apache.org/job/maven-plugins-ITs-m3/ws/maven-shade-plugin/target/local-repo/org/apache/maven/plugins/maven-toolchains-plugin/1.1-SNAPSHOT/maven-toolchains-plugin-1.1-SNAPSHOT.jar>
[INFO] Installing <https://builds.apache.org/job/maven-plugins-ITs-m3/ws/maven-toolchains-plugin/pom.xml>
to <https://builds.apache.org/job/maven-plugins-ITs-m3/ws/maven-shade-plugin/target/local-repo/org/apache/maven/plugins/maven-toolchains-plugin/1.1-SNAPSHOT/maven-toolchains-plugin-1.1-SNAPSHOT.pom>
[INFO] Installing <https://builds.apache.org/job/maven-plugins-ITs-m3/ws/maven-verifier-plugin/pom.xml>
to <https://builds.apache.org/job/maven-plugins-ITs-m3/ws/maven-shade-plugin/target/local-repo/org/apache/maven/plugins/maven-verifier-plugin/1.1-SNAPSHOT/maven-verifier-plugin-1.1-SNAPSHOT.pom>
[INFO] Installing <https://builds.apache.org/job/maven-plugins-ITs-m3/ws/maven-verifier-plugin/target/maven-verifier-plugin-1.1-SNAPSHOT.jar>
to <https://builds.apache.org/job/maven-plugins-ITs-m3/ws/maven-shade-plugin/target/local-repo/org/apache/maven/plugins/maven-verifier-plugin/1.1-SNAPSHOT/maven-verifier-plugin-1.1-SNAPSHOT.jar>
[INFO] Installing <https://builds.apache.org/job/maven-plugins-ITs-m3/ws/maven-verifier-plugin/pom.xml>
to <https://builds.apache.org/job/maven-plugins-ITs-m3/ws/maven-shade-plugin/target/local-repo/org/apache/maven/plugins/maven-verifier-plugin/1.1-SNAPSHOT/maven-verifier-plugin-1.1-SNAPSHOT.pom>
[INFO] Installing <https://builds.apache.org/job/maven-plugins-ITs-m3/ws/maven-war-plugin/pom.xml>
to <https://builds.apache.org/job/maven-plugins-ITs-m3/ws/maven-shade-plugin/target/local-repo/org/apache/maven/plugins/maven-war-plugin/2.4-SNAPSHOT/maven-war-plugin-2.4-SNAPSHOT.pom>
[INFO] Installing <https://builds.apache.org/job/maven-plugins-ITs-m3/ws/maven-war-plugin/target/maven-war-plugin-2.4-SNAPSHOT.jar>
to <https://builds.apache.org/job/maven-plugins-ITs-m3/ws/maven-shade-plugin/target/local-repo/org/apache/maven/plugins/maven-war-plugin/2.4-SNAPSHOT/maven-war-plugin-2.4-SNAPSHOT.jar>
[INFO] Installing <https://builds.apache.org/job/maven-plugins-ITs-m3/ws/maven-war-plugin/pom.xml>
to <https://builds.apache.org/job/maven-plugins-ITs-m3/ws/maven-shade-plugin/target/local-repo/org/apache/maven/plugins/maven-war-plugin/2.4-SNAPSHOT/maven-war-plugin-2.4-SNAPSHOT.pom>
[INFO] Installing <https://builds.apache.org/job/maven-plugins-ITs-m3/ws/maven-scm-publish-plugin/pom.xml>
to <https://builds.apache.org/job/maven-plugins-ITs-m3/ws/maven-shade-plugin/target/local-repo/org/apache/maven/plugins/maven-scm-publish-plugin/1.0-SNAPSHOT/maven-scm-publish-plugin-1.0-SNAPSHOT.pom>
[INFO] Installing <https://builds.apache.org/job/maven-plugins-ITs-m3/ws/maven-scm-publish-plugin/target/maven-scm-publish-plugin-1.0-SNAPSHOT.jar>
to <https://builds.apache.org/job/maven-plugins-ITs-m3/ws/maven-shade-plugin/target/local-repo/org/apache/maven/plugins/maven-scm-publish-plugin/1.0-SNAPSHOT/maven-scm-publish-plugin-1.0-SNAPSHOT.jar>
[INFO] Installing <https://builds.apache.org/job/maven-plugins-ITs-m3/ws/maven-scm-publish-plugin/pom.xml>
to <https://builds.apache.org/job/maven-plugins-ITs-m3/ws/maven-shade-plugin/target/local-repo/org/apache/maven/plugins/maven-scm-publish-plugin/1.0-SNAPSHOT/maven-scm-publish-plugin-1.0-SNAPSHOT.pom>
[INFO] Installing <https://builds.apache.org/job/maven-plugins-ITs-m3/ws/maven-invoker-plugin/pom.xml>
to <https://builds.apache.org/job/maven-plugins-ITs-m3/ws/maven-shade-plugin/target/local-repo/org/apache/maven/plugins/maven-invoker-plugin/1.9-SNAPSHOT/maven-invoker-plugin-1.9-SNAPSHOT.pom>
[INFO] Installing <https://builds.apache.org/job/maven-plugins-ITs-m3/ws/maven-invoker-plugin/target/maven-invoker-plugin-1.9-SNAPSHOT.jar>
to <https://builds.apache.org/job/maven-plugins-ITs-m3/ws/maven-shade-plugin/target/local-repo/org/apache/maven/plugins/maven-invoker-plugin/1.9-SNAPSHOT/maven-invoker-plugin-1.9-SNAPSHOT.jar>
[INFO] Installing <https://builds.apache.org/job/maven-plugins-ITs-m3/ws/maven-invoker-plugin/pom.xml>
to <https://builds.apache.org/job/maven-plugins-ITs-m3/ws/maven-shade-plugin/target/local-repo/org/apache/maven/plugins/maven-invoker-plugin/1.9-SNAPSHOT/maven-invoker-plugin-1.9-SNAPSHOT.pom>
[INFO] Installing <https://builds.apache.org/job/maven-plugins-ITs-m3/ws/maven-project-info-reports-plugin/pom.xml>
to <https://builds.apache.org/job/maven-plugins-ITs-m3/ws/maven-shade-plugin/target/local-repo/org/apache/maven/plugins/maven-project-info-reports-plugin/2.7-SNAPSHOT/maven-project-info-reports-plugin-2.7-SNAPSHOT.pom>
[INFO] Installing <https://builds.apache.org/job/maven-plugins-ITs-m3/ws/maven-project-info-reports-plugin/target/maven-project-info-reports-plugin-2.7-SNAPSHOT.jar>
to <https://builds.apache.org/job/maven-plugins-ITs-m3/ws/maven-shade-plugin/target/local-repo/org/apache/maven/plugins/maven-project-info-reports-plugin/2.7-SNAPSHOT/maven-project-info-reports-plugin-2.7-SNAPSHOT.jar>
[INFO] Installing <https://builds.apache.org/job/maven-plugins-ITs-m3/ws/maven-remote-resources-plugin/pom.xml>
to <https://builds.apache.org/job/maven-plugins-ITs-m3/ws/maven-shade-plugin/target/local-repo/org/apache/maven/plugins/maven-remote-resources-plugin/1.5-SNAPSHOT/maven-remote-resources-plugin-1.5-SNAPSHOT.pom>
[INFO] Installing <https://builds.apache.org/job/maven-plugins-ITs-m3/ws/maven-remote-resources-plugin/target/maven-remote-resources-plugin-1.5-SNAPSHOT.jar>
to <https://builds.apache.org/job/maven-plugins-ITs-m3/ws/maven-shade-plugin/target/local-repo/org/apache/maven/plugins/maven-remote-resources-plugin/1.5-SNAPSHOT/maven-remote-resources-plugin-1.5-SNAPSHOT.jar>
[INFO] Installing <https://builds.apache.org/job/maven-plugins-ITs-m3/ws/maven-remote-resources-plugin/pom.xml>
to <https://builds.apache.org/job/maven-plugins-ITs-m3/ws/maven-shade-plugin/target/local-repo/org/apache/maven/plugins/maven-remote-resources-plugin/1.5-SNAPSHOT/maven-remote-resources-plugin-1.5-SNAPSHOT.pom>
[INFO] Installing <https://builds.apache.org/job/maven-plugins-ITs-m3/ws/maven-shade-plugin/pom.xml>
to <https://builds.apache.org/job/maven-plugins-ITs-m3/ws/maven-shade-plugin/target/local-repo/org/apache/maven/plugins/maven-shade-plugin/3.0-SNAPSHOT/maven-shade-plugin-3.0-SNAPSHOT.pom>
[INFO] Installing <https://builds.apache.org/job/maven-plugins-ITs-m3/ws/maven-shade-plugin/target/maven-shade-plugin-3.0-SNAPSHOT.jar>
to <https://builds.apache.org/job/maven-plugins-ITs-m3/ws/maven-shade-plugin/target/local-repo/org/apache/maven/plugins/maven-shade-plugin/3.0-SNAPSHOT/maven-shade-plugin-3.0-SNAPSHOT.jar>
[INFO] Installing <https://builds.apache.org/job/maven-plugins-ITs-m3/ws/maven-shade-plugin/target/maven-shade-plugin-3.0-SNAPSHOT-tests.jar>
to <https://builds.apache.org/job/maven-plugins-ITs-m3/ws/maven-shade-plugin/target/local-repo/org/apache/maven/plugins/maven-shade-plugin/3.0-SNAPSHOT/maven-shade-plugin-3.0-SNAPSHOT-tests.jar>
[INFO] 
[INFO] --- maven-invoker-plugin:1.8:integration-test (integration-test) @ maven-shade-plugin
---
[INFO] Building: reloc-anno/pom.xml
[INFO] ..SUCCESS (4.7 s)
[INFO] Building: dep-reduced-pom-with-local-parent/pom.xml
[INFO] ..SUCCESS (2.8 s)
[INFO] Building: rerun-with-reloc/pom.xml
[INFO] ..SUCCESS (7.2 s)
[INFO] Building: services-resource-transformer/pom.xml
[INFO] run script verify.bsh
[INFO] ..SUCCESS (4.0 s)
[INFO] Building: attach-after-lifecycle-fork/pom.xml
[INFO] run script setup.bsh
[INFO] run script verify.bsh
[INFO] ..SUCCESS (3.3 s)
[INFO] Building: implicit-inclusion-of-project-artifact/pom.xml
[INFO] run script verify.bsh
[INFO] ..SUCCESS (3.8 s)
[INFO] Building: mshade-123/pom.xml
[INFO] ..SUCCESS (7.2 s)
[INFO] Building: empty-apache-notice-transform/pom.xml
[INFO] ..SUCCESS (4.1 s)
[INFO] Building: dep-reduced-pom-unique/pom.xml
[INFO] run script verify.groovy
[INFO] ..SUCCESS (4.3 s)
[INFO] Building: non-runtime-scope-excluded/pom.xml
[INFO] run script verify.bsh
[INFO] ..SUCCESS (3.7 s)
[INFO] Building: dep-reduced-pom-relocated-result/pom.xml
[INFO] ..SUCCESS (2.8 s)
[INFO] Building: artifact-includes-excludes/pom.xml
[INFO] run script verify.bsh
[INFO] ..SUCCESS (6.3 s)
[INFO] Building: finalNameBuild/pom.xml
[INFO] run script setup.bsh
[INFO] run script verify.bsh
[INFO] ..SUCCESS (3.6 s)
[INFO] Building: finalNameBuild-attached/pom.xml
[INFO] run script setup.bsh
[INFO] run script verify.bsh
[INFO] ..SUCCESS (3.9 s)
[INFO] Building: mini-jar-package-info/pom.xml
[INFO] run script verify.bsh
[INFO] ..SUCCESS (4.8 s)
[INFO] Building: empty-relocation-shaded-pattern/pom.xml
[INFO] ..SUCCESS (3.5 s)
[INFO] Building: reloc-includes-excludes/pom.xml
[INFO] run script verify.bsh
[INFO] ..SUCCESS (3.9 s)
[INFO] Building: reloc-enum-ref-from-anno/pom.xml
[INFO] ..SUCCESS (3.4 s)
[INFO] Building: component-descriptor-relocation/pom.xml
[INFO] ..SUCCESS (4.7 s)
[INFO] Building: shadePomDependency/pom.xml
[INFO] ..SUCCESS (5.0 s)
[INFO] Building: pom-packaging/pom.xml
[INFO] run script verify.bsh
[INFO] ..SUCCESS (2.7 s)
[INFO] Building: mini-jar-respect-includes/pom.xml
[INFO] run script verify.bsh
[INFO] ..SUCCESS (4.5 s)
[INFO] Building: empty-relocation-pattern/pom.xml
[INFO] ..SUCCESS (3.5 s)
[INFO] Building: users-shader-impl/pom.xml
[INFO] run script verify.groovy
[INFO] ..SUCCESS (4.8 s)
[INFO] Building: duplicate-classes-with-reloc/pom.xml
[INFO] ..SUCCESS (3.1 s)
[INFO] Building: mini-jar/pom.xml
[INFO] run script verify.bsh
[INFO] ..SUCCESS (4.1 s)
[INFO] Building: plugin-descriptor-relocation/pom.xml
[INFO] run script verify.groovy
[INFO] ..SUCCESS (8.8 s)
[INFO] Building: MSHADE-105/pom.xml
[INFO] run script verify.bsh
[INFO] ..SUCCESS (9.8 s)
[INFO] Building: manifest-retained/pom.xml
[INFO] run script verify.bsh
[INFO] ..SUCCESS (4.4 s)
[INFO] Building: reloc-class-from-string-pool/pom.xml
[INFO] ..SUCCESS (3.4 s)
[INFO] Building: manifest-transformed/pom.xml
[INFO] run script verify.bsh
[INFO] ..SUCCESS (4.3 s)
[INFO] Building: dep-reduced-pom/pom.xml
[INFO] run script verify.groovy
[INFO] ..SUCCESS (3.5 s)
[INFO] Building: duplicate-classes-without-reloc/pom.xml
[INFO] ..SUCCESS (2.9 s)
[INFO] Building: reloc-abs-resource-path/pom.xml
[INFO] ..SUCCESS (7.0 s)
[INFO] Building: rerun-without-reloc/pom.xml
[INFO] ..SUCCESS (3.8 s)
[INFO] Building: finalNameShade-attached/pom.xml
[INFO] run script setup.bsh
[INFO] run script verify.bsh
[INFO] ..SUCCESS (3.7 s)
[INFO] Building: dep-reduced-pom-use-base-version/pom.xml
[INFO] run script verify.groovy
[INFO] ..SUCCESS (3.8 s)
[INFO] Building: mini-jar-malformed-dependencies/pom.xml
[INFO] ..SUCCESS (6.4 s)
[INFO] Building: filter-artifact-contents/pom.xml
[INFO] run script verify.bsh
[INFO] ..SUCCESS (3.8 s)
[INFO] Building: xml-transformer-ignores-dtd/pom.xml
[INFO] run script verify.bsh
[INFO] ..SUCCESS (3.8 s)
[INFO] Building: attached-artifact-type/pom.xml
[INFO] ..SUCCESS (3.4 s)
[INFO] Building: project-with-reactors-included/pom.xml
[INFO] run script verify.bsh
[INFO] ..SUCCESS (5.3 s)
[INFO] Building: finalNameShade/pom.xml
[INFO] run script setup.bsh
[INFO] run script verify.bsh
[INFO] ..SUCCESS (3.6 s)
[INFO] 
[INFO] --- maven-invoker-plugin:1.8:verify (integration-test) @ maven-shade-plugin ---
[INFO] -------------------------------------------------
[INFO] Build Summary:
[INFO]   Passed: 43, Failed: 0, Errors: 0, Skipped: 0
[INFO] -------------------------------------------------
[INFO] 
[INFO] --- maven-install-plugin:2.3.1:install (default-install) @ maven-shade-plugin ---
[INFO] Installing <https://builds.apache.org/job/maven-plugins-ITs-m3/ws/maven-shade-plugin/target/maven-shade-plugin-3.0-SNAPSHOT.jar>
to /home/jenkins/.m2/repository/org/apache/maven/plugins/maven-shade-plugin/3.0-SNAPSHOT/maven-shade-plugin-3.0-SNAPSHOT.jar
[INFO] Installing <https://builds.apache.org/job/maven-plugins-ITs-m3/ws/maven-shade-plugin/pom.xml>
to /home/jenkins/.m2/repository/org/apache/maven/plugins/maven-shade-plugin/3.0-SNAPSHOT/maven-shade-plugin-3.0-SNAPSHOT.pom
[INFO] Installing <https://builds.apache.org/job/maven-plugins-ITs-m3/ws/maven-shade-plugin/target/maven-shade-plugin-3.0-SNAPSHOT-tests.jar>
to /home/jenkins/.m2/repository/org/apache/maven/plugins/maven-shade-plugin/3.0-SNAPSHOT/maven-shade-plugin-3.0-SNAPSHOT-tests.jar
[INFO]                                                                         
[INFO] ------------------------------------------------------------------------
[INFO] Building Maven Plugins Aggregator 1-SNAPSHOT
[INFO] ------------------------------------------------------------------------
[INFO] 
[INFO] --- maven-clean-plugin:2.4.1:clean (default-clean) @ maven-plugins-aggregator ---
[INFO] Deleting <https://builds.apache.org/job/maven-plugins-ITs-m3/ws/target>
[INFO] 
[INFO] --- maven-remote-resources-plugin:1.1:process (default) @ maven-plugins-aggregator
---
[INFO] Setting property: classpath.resource.loader.class => 'org.codehaus.plexus.velocity.ContextClassLoaderResourceLoader'.
[INFO] Setting property: velocimacro.messages.on => 'false'.
[INFO] Setting property: resource.loader => 'classpath'.
[INFO] Setting property: resource.manager.logwhenfound => 'false'.
[INFO] 
[INFO] --- maven-install-plugin:2.3.1:install (default-install) @ maven-plugins-aggregator
---
[INFO] Installing <https://builds.apache.org/job/maven-plugins-ITs-m3/ws/pom.xml> to
/home/jenkins/.m2/repository/org/apache/maven/plugins/maven-plugins-aggregator/1-SNAPSHOT/maven-plugins-aggregator-1-SNAPSHOT.pom
[INFO] ------------------------------------------------------------------------
[INFO] Reactor Summary:
[INFO] 
[INFO] Maven Plugins ..................................... SUCCESS [7.040s]
[INFO] Maven ACR Plugin .................................. SUCCESS [56.042s]
[INFO] Maven Ant Plugin .................................. SUCCESS [1:22.599s]
[INFO] Maven AntRun Plugin ............................... SUCCESS [1:07.048s]
[INFO] Maven Eclipse Plugin .............................. SUCCESS [6:53.545s]
[INFO] Maven Assembly Plugin ............................. SUCCESS [11:37.143s]
[INFO] Maven Changelog Plugin ............................ SUCCESS [1:26.826s]
[INFO] Maven Changes Report Plugin ....................... SUCCESS [1:20.625s]
[INFO] Maven Checkstyle Plugin ........................... SUCCESS [1:55.472s]
[INFO] Maven Clean Plugin ................................ SUCCESS [43.303s]
[INFO] Maven Compiler Plugin ............................. SUCCESS [1:47.522s]
[INFO] Maven Dependency Plugin ........................... SUCCESS [3:14.571s]
[INFO] Maven Deploy Plugin ............................... SUCCESS [1:38.258s]
[INFO] Maven DOAP Plugin ................................. SUCCESS [21.227s]
[INFO] Maven Documentation Checker Plugin ................ SUCCESS [6.783s]
[INFO] Maven EAR Plugin .................................. SUCCESS [4:55.657s]
[INFO] Maven EJB Plugin .................................. SUCCESS [28.552s]
[INFO] Maven GPG Plugin .................................. SUCCESS [10.978s]
[INFO] Maven Help Plugin ................................. SUCCESS [49.065s]
[INFO] Maven IDEA Plugin ................................. SUCCESS [12.315s]
[INFO] Maven Install Plugin .............................. SUCCESS [1:00.692s]
[INFO] Maven JAR Plugin .................................. SUCCESS [1:15.751s]
[INFO] Maven Jarsigner Plugin ............................ SUCCESS [28.043s]
[INFO] Maven Javadoc Plugin .............................. SUCCESS [3:15.764s]
[INFO] Maven Linkcheck Plugin ............................ SUCCESS [5.972s]
[INFO] Maven One Plugin .................................. SUCCESS [5.584s]
[INFO] Maven Patch Plugin ................................ SUCCESS [13.969s]
[INFO] Maven PDF Plugin .................................. SUCCESS [54.402s]
[INFO] Maven PMD Plugin .................................. SUCCESS [1:27.826s]
[INFO] Maven RAR Plugin .................................. SUCCESS [11.775s]
[INFO] Maven Reactor Plugin .............................. SUCCESS [2.805s]
[INFO] Maven Repository Plugin ........................... SUCCESS [1:20.949s]
[INFO] Maven Resources Plugin ............................ SUCCESS [1:16.723s]
[INFO] Maven Site Plugin 3 ............................... SUCCESS [7:30.689s]
[INFO] Maven Source Plugin ............................... SUCCESS [1:02.226s]
[INFO] Maven Stage Plugin ................................ SUCCESS [8.828s]
[INFO] Maven Toolchains Plugin ........................... SUCCESS [8.522s]
[INFO] Maven Verifier Plugin ............................. SUCCESS [27.328s]
[INFO] Maven WAR Plugin .................................. SUCCESS [2:30.149s]
[INFO] Maven SCM Publish Plugin .......................... SUCCESS [1:32.719s]
[INFO] Maven Invoker Plugin .............................. SUCCESS [5:39.267s]
[INFO] Maven Project Info Reports Plugin ................. FAILURE [47.873s]
[INFO] Maven Remote Resources Plugin ..................... SUCCESS [58.868s]
[INFO] Maven Shade Plugin ................................ SUCCESS [3:38.250s]
[INFO] Maven Plugins Aggregator .......................... SUCCESS [1.130s]
[INFO] ------------------------------------------------------------------------
[INFO] BUILD FAILURE
[INFO] ------------------------------------------------------------------------
[INFO] Total time: 1:17:23.248s
[INFO] Finished at: Wed May 08 18:06:03 UTC 2013
[INFO] Final Memory: 103M/436M
[INFO] ------------------------------------------------------------------------
[WARNING] The requested profile "apache.snapshots" could not be activated because it does
not exist.
[ERROR] Failed to execute goal org.apache.maven.plugins:maven-invoker-plugin:1.7:verify (integration-test)
on project maven-project-info-reports-plugin: 2 builds failed. See console output above for
details. -> [Help 1]
[ERROR] 
[ERROR] To see the full stack trace of the errors, re-run Maven with the -e switch.
[ERROR] Re-run Maven using the -X switch to enable full debug logging.
[ERROR] 
[ERROR] For more information about the errors and possible solutions, please read the following
articles:
[ERROR] [Help 1] http://cwiki.apache.org/confluence/display/MAVEN/MojoFailureException
[ERROR] 
[ERROR] After correcting the problems, you can resume the build with the command
[ERROR]   mvn <goals> -rf :maven-project-info-reports-plugin
Build step 'Invoke top-level Maven targets' marked build as failure
Recording test results

Mime
View raw message