maven-notifications mailing list archives

Site index · List index
Message view « Date » · « Thread »
Top « Date » · « Thread »
From Apache Jenkins Server <jenk...@builds.apache.org>
Subject Build failed in Jenkins: maven-plugins-ITs-m3-windows #259
Date Sun, 12 May 2013 22:47:12 GMT
See <https://builds.apache.org/job/maven-plugins-ITs-m3-windows/259/changes>

Changes:

[Robert Scholte] [MSHADE-114] Specifying DontIncludeResourceTransformer before ManifestResourceTransformer
causes PluginConfigurationException: Unable to parse configuration of mojo shade for parameter
transformer: Cannot find setter...
IT, can't reproduce issue

------------------------------------------
[...truncated 10741 lines...]
[INFO] Applying mojo extractor for language: java
[INFO] Mojo extractor for language: java found 0 mojo descriptors.
[INFO] Applying mojo extractor for language: bsh
[INFO] Mojo extractor for language: bsh found 0 mojo descriptors.
[INFO] Applying mojo extractor for language: java-annotations
[INFO] Mojo extractor for language: java-annotations found 0 mojo descriptors.
[INFO] 
[INFO] --- maven-remote-resources-plugin:1.4:process (default) @ maven-shade-plugin ---
[INFO] 
[INFO] --- maven-resources-plugin:2.6:resources (default-resources) @ maven-shade-plugin ---
[INFO] Using 'UTF-8' encoding to copy filtered resources.
[INFO] skip non existing resourceDirectory F:\hudson\hudson-slave\workspace\maven-plugins-ITs-m3-windows\maven-shade-plugin\src\main\resources
[INFO] Copying 3 resources
[INFO] 
[INFO] --- maven-compiler-plugin:3.0:compile (default-compile) @ maven-shade-plugin ---
[INFO] Changes detected - recompiling the module!
[INFO] Compiling 31 source files to F:\hudson\hudson-slave\workspace\maven-plugins-ITs-m3-windows\maven-shade-plugin\target\classes
[INFO] 
[INFO] --- maven-plugin-plugin:3.2:descriptor (mojo-descriptor) @ maven-shade-plugin ---
[INFO] Using 'UTF-8' encoding to read mojo metadata.
[INFO] Applying mojo extractor for language: java
[INFO] Mojo extractor for language: java found 0 mojo descriptors.
[INFO] Applying mojo extractor for language: bsh
[INFO] Mojo extractor for language: bsh found 0 mojo descriptors.
[INFO] Applying mojo extractor for language: java-annotations
[INFO] Mojo extractor for language: java-annotations found 2 mojo descriptors.
[INFO] 
[INFO] --- plexus-component-metadata:1.5.5:generate-metadata (default) @ maven-shade-plugin
---
[INFO] Discovered 1 component descriptors(s)
[INFO] 
[INFO] --- maven-resources-plugin:2.6:testResources (default-testResources) @ maven-shade-plugin
---
[INFO] Using 'UTF-8' encoding to copy filtered resources.
[INFO] Copying 3 resources
[INFO] Copying 3 resources
[INFO] 
[INFO] --- maven-compiler-plugin:3.0:testCompile (default-testCompile) @ maven-shade-plugin
---
[INFO] Changes detected - recompiling the module!
[INFO] Compiling 15 source files to F:\hudson\hudson-slave\workspace\maven-plugins-ITs-m3-windows\maven-shade-plugin\target\test-classes
[INFO] 
[INFO] --- plexus-component-metadata:1.5.5:generate-test-metadata (default) @ maven-shade-plugin
---
[INFO] Discovered 1 component descriptors(s)
[INFO] 
[INFO] --- maven-surefire-plugin:2.12.4:test (default-test) @ maven-shade-plugin ---
[INFO] Surefire report directory: F:\hudson\hudson-slave\workspace\maven-plugins-ITs-m3-windows\maven-shade-plugin\target\surefire-reports

-------------------------------------------------------
 T E S T S
-------------------------------------------------------
Running org.apache.maven.plugins.shade.DefaultShaderTest
Tests run: 4, Failures: 0, Errors: 0, Skipped: 0, Time elapsed: 1.603 sec
Running org.apache.maven.plugins.shade.filter.SimpleFilterTest
Tests run: 1, Failures: 0, Errors: 0, Skipped: 0, Time elapsed: 0.001 sec
Running org.apache.maven.plugins.shade.mojo.ArtifactIdTest
Tests run: 2, Failures: 0, Errors: 0, Skipped: 0, Time elapsed: 0 sec
Running org.apache.maven.plugins.shade.mojo.ArtifactSelectorTest
Tests run: 1, Failures: 0, Errors: 0, Skipped: 0, Time elapsed: 0.005 sec
Running org.apache.maven.plugins.shade.mojo.RelativizePathTest
Tests run: 1, Failures: 0, Errors: 0, Skipped: 0, Time elapsed: 0.06 sec
Running org.apache.maven.plugins.shade.mojo.ShadeMojoTest
Tests run: 4, Failures: 0, Errors: 0, Skipped: 0, Time elapsed: 1.472 sec
Running org.apache.maven.plugins.shade.relocation.SimpleRelocatorParameterTest
Tests run: 2, Failures: 0, Errors: 0, Skipped: 0, Time elapsed: 0.001 sec
Running org.apache.maven.plugins.shade.relocation.SimpleRelocatorTest
Tests run: 7, Failures: 0, Errors: 0, Skipped: 0, Time elapsed: 0.006 sec
Running org.apache.maven.plugins.shade.resource.ApacheLicenseResourceTransformerTest
Tests run: 1, Failures: 0, Errors: 0, Skipped: 0, Time elapsed: 0 sec
Running org.apache.maven.plugins.shade.resource.ApacheNoticeResourceTransformerTest
Tests run: 1, Failures: 0, Errors: 0, Skipped: 0, Time elapsed: 0 sec
Running org.apache.maven.plugins.shade.resource.AppendingTransformerTest
Tests run: 1, Failures: 0, Errors: 0, Skipped: 0, Time elapsed: 0 sec
Running org.apache.maven.plugins.shade.resource.ComponentsXmlResourceTransformerTest
Tests run: 1, Failures: 0, Errors: 0, Skipped: 0, Time elapsed: 0.068 sec
Running org.apache.maven.plugins.shade.resource.XmlAppendingTransformerTest
Tests run: 1, Failures: 0, Errors: 0, Skipped: 0, Time elapsed: 0 sec

Results :

Tests run: 27, Failures: 0, Errors: 0, Skipped: 0

[INFO] 
[INFO] --- maven-jar-plugin:2.4:jar (default-jar) @ maven-shade-plugin ---
[INFO] Building jar: F:\hudson\hudson-slave\workspace\maven-plugins-ITs-m3-windows\maven-shade-plugin\target\maven-shade-plugin-3.0-SNAPSHOT.jar
[INFO] 
[INFO] --- maven-plugin-plugin:3.2:addPluginArtifactMetadata (default-addPluginArtifactMetadata)
@ maven-shade-plugin ---
[INFO] 
[INFO] --- maven-jar-plugin:2.4:test-jar (default) @ maven-shade-plugin ---
[INFO] Building jar: F:\hudson\hudson-slave\workspace\maven-plugins-ITs-m3-windows\maven-shade-plugin\target\maven-shade-plugin-3.0-SNAPSHOT-tests.jar
[INFO] 
[INFO] --- maven-invoker-plugin:1.8:install (integration-test) @ maven-shade-plugin ---
[INFO] Installing F:\hudson\hudson-slave\workspace\maven-plugins-ITs-m3-windows\maven-plugins\pom.xml
to F:\hudson\hudson-slave\workspace\maven-plugins-ITs-m3-windows\maven-shade-plugin\target\local-repo\org\apache\maven\plugins\maven-plugins\25-SNAPSHOT\maven-plugins-25-SNAPSHOT.pom
[INFO] Installing F:\hudson\hudson-slave\workspace\maven-plugins-ITs-m3-windows\maven-plugins\target\maven-plugins-25-SNAPSHOT-site.xml
to F:\hudson\hudson-slave\workspace\maven-plugins-ITs-m3-windows\maven-shade-plugin\target\local-repo\org\apache\maven\plugins\maven-plugins\25-SNAPSHOT\maven-plugins-25-SNAPSHOT-site.xml
[INFO] Installing F:\hudson\hudson-slave\workspace\maven-plugins-ITs-m3-windows\maven-acr-plugin\pom.xml
to F:\hudson\hudson-slave\workspace\maven-plugins-ITs-m3-windows\maven-shade-plugin\target\local-repo\org\apache\maven\plugins\maven-acr-plugin\1.0.1-SNAPSHOT\maven-acr-plugin-1.0.1-SNAPSHOT.pom
[INFO] Installing F:\hudson\hudson-slave\workspace\maven-plugins-ITs-m3-windows\maven-acr-plugin\target\maven-acr-plugin-1.0.1-SNAPSHOT.jar
to F:\hudson\hudson-slave\workspace\maven-plugins-ITs-m3-windows\maven-shade-plugin\target\local-repo\org\apache\maven\plugins\maven-acr-plugin\1.0.1-SNAPSHOT\maven-acr-plugin-1.0.1-SNAPSHOT.jar
[INFO] Installing F:\hudson\hudson-slave\workspace\maven-plugins-ITs-m3-windows\maven-acr-plugin\pom.xml
to F:\hudson\hudson-slave\workspace\maven-plugins-ITs-m3-windows\maven-shade-plugin\target\local-repo\org\apache\maven\plugins\maven-acr-plugin\1.0.1-SNAPSHOT\maven-acr-plugin-1.0.1-SNAPSHOT.pom
[INFO] Installing F:\hudson\hudson-slave\workspace\maven-plugins-ITs-m3-windows\maven-ant-plugin\pom.xml
to F:\hudson\hudson-slave\workspace\maven-plugins-ITs-m3-windows\maven-shade-plugin\target\local-repo\org\apache\maven\plugins\maven-ant-plugin\2.4-SNAPSHOT\maven-ant-plugin-2.4-SNAPSHOT.pom
[INFO] Installing F:\hudson\hudson-slave\workspace\maven-plugins-ITs-m3-windows\maven-ant-plugin\target\maven-ant-plugin-2.4-SNAPSHOT.jar
to F:\hudson\hudson-slave\workspace\maven-plugins-ITs-m3-windows\maven-shade-plugin\target\local-repo\org\apache\maven\plugins\maven-ant-plugin\2.4-SNAPSHOT\maven-ant-plugin-2.4-SNAPSHOT.jar
[INFO] Installing F:\hudson\hudson-slave\workspace\maven-plugins-ITs-m3-windows\maven-ant-plugin\pom.xml
to F:\hudson\hudson-slave\workspace\maven-plugins-ITs-m3-windows\maven-shade-plugin\target\local-repo\org\apache\maven\plugins\maven-ant-plugin\2.4-SNAPSHOT\maven-ant-plugin-2.4-SNAPSHOT.pom
[INFO] Installing F:\hudson\hudson-slave\workspace\maven-plugins-ITs-m3-windows\maven-antrun-plugin\pom.xml
to F:\hudson\hudson-slave\workspace\maven-plugins-ITs-m3-windows\maven-shade-plugin\target\local-repo\org\apache\maven\plugins\maven-antrun-plugin\1.8-SNAPSHOT\maven-antrun-plugin-1.8-SNAPSHOT.pom
[INFO] Installing F:\hudson\hudson-slave\workspace\maven-plugins-ITs-m3-windows\maven-antrun-plugin\target\maven-antrun-plugin-1.8-SNAPSHOT.jar
to F:\hudson\hudson-slave\workspace\maven-plugins-ITs-m3-windows\maven-shade-plugin\target\local-repo\org\apache\maven\plugins\maven-antrun-plugin\1.8-SNAPSHOT\maven-antrun-plugin-1.8-SNAPSHOT.jar
[INFO] Installing F:\hudson\hudson-slave\workspace\maven-plugins-ITs-m3-windows\maven-antrun-plugin\pom.xml
to F:\hudson\hudson-slave\workspace\maven-plugins-ITs-m3-windows\maven-shade-plugin\target\local-repo\org\apache\maven\plugins\maven-antrun-plugin\1.8-SNAPSHOT\maven-antrun-plugin-1.8-SNAPSHOT.pom
[INFO] Installing F:\hudson\hudson-slave\workspace\maven-plugins-ITs-m3-windows\maven-eclipse-plugin\pom.xml
to F:\hudson\hudson-slave\workspace\maven-plugins-ITs-m3-windows\maven-shade-plugin\target\local-repo\org\apache\maven\plugins\maven-eclipse-plugin\2.10-SNAPSHOT\maven-eclipse-plugin-2.10-SNAPSHOT.pom
[INFO] Installing F:\hudson\hudson-slave\workspace\maven-plugins-ITs-m3-windows\maven-eclipse-plugin\target\maven-eclipse-plugin-2.10-SNAPSHOT.jar
to F:\hudson\hudson-slave\workspace\maven-plugins-ITs-m3-windows\maven-shade-plugin\target\local-repo\org\apache\maven\plugins\maven-eclipse-plugin\2.10-SNAPSHOT\maven-eclipse-plugin-2.10-SNAPSHOT.jar
[INFO] Installing F:\hudson\hudson-slave\workspace\maven-plugins-ITs-m3-windows\maven-eclipse-plugin\pom.xml
to F:\hudson\hudson-slave\workspace\maven-plugins-ITs-m3-windows\maven-shade-plugin\target\local-repo\org\apache\maven\plugins\maven-eclipse-plugin\2.10-SNAPSHOT\maven-eclipse-plugin-2.10-SNAPSHOT.pom
[INFO] Installing F:\hudson\hudson-slave\workspace\maven-plugins-ITs-m3-windows\maven-assembly-plugin\pom.xml
to F:\hudson\hudson-slave\workspace\maven-plugins-ITs-m3-windows\maven-shade-plugin\target\local-repo\org\apache\maven\plugins\maven-assembly-plugin\2.5-SNAPSHOT\maven-assembly-plugin-2.5-SNAPSHOT.pom
[INFO] Installing F:\hudson\hudson-slave\workspace\maven-plugins-ITs-m3-windows\maven-assembly-plugin\target\maven-assembly-plugin-2.5-SNAPSHOT.jar
to F:\hudson\hudson-slave\workspace\maven-plugins-ITs-m3-windows\maven-shade-plugin\target\local-repo\org\apache\maven\plugins\maven-assembly-plugin\2.5-SNAPSHOT\maven-assembly-plugin-2.5-SNAPSHOT.jar
[INFO] Installing F:\hudson\hudson-slave\workspace\maven-plugins-ITs-m3-windows\maven-assembly-plugin\pom.xml
to F:\hudson\hudson-slave\workspace\maven-plugins-ITs-m3-windows\maven-shade-plugin\target\local-repo\org\apache\maven\plugins\maven-assembly-plugin\2.5-SNAPSHOT\maven-assembly-plugin-2.5-SNAPSHOT.pom
[INFO] Installing F:\hudson\hudson-slave\workspace\maven-plugins-ITs-m3-windows\maven-changelog-plugin\pom.xml
to F:\hudson\hudson-slave\workspace\maven-plugins-ITs-m3-windows\maven-shade-plugin\target\local-repo\org\apache\maven\plugins\maven-changelog-plugin\2.3-SNAPSHOT\maven-changelog-plugin-2.3-SNAPSHOT.pom
[INFO] Installing F:\hudson\hudson-slave\workspace\maven-plugins-ITs-m3-windows\maven-changelog-plugin\target\maven-changelog-plugin-2.3-SNAPSHOT.jar
to F:\hudson\hudson-slave\workspace\maven-plugins-ITs-m3-windows\maven-shade-plugin\target\local-repo\org\apache\maven\plugins\maven-changelog-plugin\2.3-SNAPSHOT\maven-changelog-plugin-2.3-SNAPSHOT.jar
[INFO] Installing F:\hudson\hudson-slave\workspace\maven-plugins-ITs-m3-windows\maven-changelog-plugin\pom.xml
to F:\hudson\hudson-slave\workspace\maven-plugins-ITs-m3-windows\maven-shade-plugin\target\local-repo\org\apache\maven\plugins\maven-changelog-plugin\2.3-SNAPSHOT\maven-changelog-plugin-2.3-SNAPSHOT.pom
[INFO] Installing F:\hudson\hudson-slave\workspace\maven-plugins-ITs-m3-windows\maven-changes-plugin\pom.xml
to F:\hudson\hudson-slave\workspace\maven-plugins-ITs-m3-windows\maven-shade-plugin\target\local-repo\org\apache\maven\plugins\maven-changes-plugin\2.10-SNAPSHOT\maven-changes-plugin-2.10-SNAPSHOT.pom
[INFO] Installing F:\hudson\hudson-slave\workspace\maven-plugins-ITs-m3-windows\maven-changes-plugin\target\maven-changes-plugin-2.10-SNAPSHOT.jar
to F:\hudson\hudson-slave\workspace\maven-plugins-ITs-m3-windows\maven-shade-plugin\target\local-repo\org\apache\maven\plugins\maven-changes-plugin\2.10-SNAPSHOT\maven-changes-plugin-2.10-SNAPSHOT.jar
[INFO] Installing F:\hudson\hudson-slave\workspace\maven-plugins-ITs-m3-windows\maven-changes-plugin\pom.xml
to F:\hudson\hudson-slave\workspace\maven-plugins-ITs-m3-windows\maven-shade-plugin\target\local-repo\org\apache\maven\plugins\maven-changes-plugin\2.10-SNAPSHOT\maven-changes-plugin-2.10-SNAPSHOT.pom
[INFO] Installing F:\hudson\hudson-slave\workspace\maven-plugins-ITs-m3-windows\maven-checkstyle-plugin\pom.xml
to F:\hudson\hudson-slave\workspace\maven-plugins-ITs-m3-windows\maven-shade-plugin\target\local-repo\org\apache\maven\plugins\maven-checkstyle-plugin\2.11-SNAPSHOT\maven-checkstyle-plugin-2.11-SNAPSHOT.pom
[INFO] Installing F:\hudson\hudson-slave\workspace\maven-plugins-ITs-m3-windows\maven-checkstyle-plugin\target\maven-checkstyle-plugin-2.11-SNAPSHOT.jar
to F:\hudson\hudson-slave\workspace\maven-plugins-ITs-m3-windows\maven-shade-plugin\target\local-repo\org\apache\maven\plugins\maven-checkstyle-plugin\2.11-SNAPSHOT\maven-checkstyle-plugin-2.11-SNAPSHOT.jar
[INFO] Installing F:\hudson\hudson-slave\workspace\maven-plugins-ITs-m3-windows\maven-checkstyle-plugin\pom.xml
to F:\hudson\hudson-slave\workspace\maven-plugins-ITs-m3-windows\maven-shade-plugin\target\local-repo\org\apache\maven\plugins\maven-checkstyle-plugin\2.11-SNAPSHOT\maven-checkstyle-plugin-2.11-SNAPSHOT.pom
[INFO] Installing F:\hudson\hudson-slave\workspace\maven-plugins-ITs-m3-windows\maven-clean-plugin\pom.xml
to F:\hudson\hudson-slave\workspace\maven-plugins-ITs-m3-windows\maven-shade-plugin\target\local-repo\org\apache\maven\plugins\maven-clean-plugin\2.6-SNAPSHOT\maven-clean-plugin-2.6-SNAPSHOT.pom
[INFO] Installing F:\hudson\hudson-slave\workspace\maven-plugins-ITs-m3-windows\maven-clean-plugin\target\maven-clean-plugin-2.6-SNAPSHOT.jar
to F:\hudson\hudson-slave\workspace\maven-plugins-ITs-m3-windows\maven-shade-plugin\target\local-repo\org\apache\maven\plugins\maven-clean-plugin\2.6-SNAPSHOT\maven-clean-plugin-2.6-SNAPSHOT.jar
[INFO] Installing F:\hudson\hudson-slave\workspace\maven-plugins-ITs-m3-windows\maven-clean-plugin\pom.xml
to F:\hudson\hudson-slave\workspace\maven-plugins-ITs-m3-windows\maven-shade-plugin\target\local-repo\org\apache\maven\plugins\maven-clean-plugin\2.6-SNAPSHOT\maven-clean-plugin-2.6-SNAPSHOT.pom
[INFO] Installing F:\hudson\hudson-slave\workspace\maven-plugins-ITs-m3-windows\maven-compiler-plugin\pom.xml
to F:\hudson\hudson-slave\workspace\maven-plugins-ITs-m3-windows\maven-shade-plugin\target\local-repo\org\apache\maven\plugins\maven-compiler-plugin\3.2-SNAPSHOT\maven-compiler-plugin-3.2-SNAPSHOT.pom
[INFO] Installing F:\hudson\hudson-slave\workspace\maven-plugins-ITs-m3-windows\maven-compiler-plugin\target\maven-compiler-plugin-3.2-SNAPSHOT.jar
to F:\hudson\hudson-slave\workspace\maven-plugins-ITs-m3-windows\maven-shade-plugin\target\local-repo\org\apache\maven\plugins\maven-compiler-plugin\3.2-SNAPSHOT\maven-compiler-plugin-3.2-SNAPSHOT.jar
[INFO] Installing F:\hudson\hudson-slave\workspace\maven-plugins-ITs-m3-windows\maven-compiler-plugin\pom.xml
to F:\hudson\hudson-slave\workspace\maven-plugins-ITs-m3-windows\maven-shade-plugin\target\local-repo\org\apache\maven\plugins\maven-compiler-plugin\3.2-SNAPSHOT\maven-compiler-plugin-3.2-SNAPSHOT.pom
[INFO] Installing F:\hudson\hudson-slave\workspace\maven-plugins-ITs-m3-windows\maven-dependency-plugin\pom.xml
to F:\hudson\hudson-slave\workspace\maven-plugins-ITs-m3-windows\maven-shade-plugin\target\local-repo\org\apache\maven\plugins\maven-dependency-plugin\2.9-SNAPSHOT\maven-dependency-plugin-2.9-SNAPSHOT.pom
[INFO] Installing F:\hudson\hudson-slave\workspace\maven-plugins-ITs-m3-windows\maven-dependency-plugin\target\maven-dependency-plugin-2.9-SNAPSHOT.jar
to F:\hudson\hudson-slave\workspace\maven-plugins-ITs-m3-windows\maven-shade-plugin\target\local-repo\org\apache\maven\plugins\maven-dependency-plugin\2.9-SNAPSHOT\maven-dependency-plugin-2.9-SNAPSHOT.jar
[INFO] Installing F:\hudson\hudson-slave\workspace\maven-plugins-ITs-m3-windows\maven-dependency-plugin\pom.xml
to F:\hudson\hudson-slave\workspace\maven-plugins-ITs-m3-windows\maven-shade-plugin\target\local-repo\org\apache\maven\plugins\maven-dependency-plugin\2.9-SNAPSHOT\maven-dependency-plugin-2.9-SNAPSHOT.pom
[INFO] Installing F:\hudson\hudson-slave\workspace\maven-plugins-ITs-m3-windows\maven-deploy-plugin\pom.xml
to F:\hudson\hudson-slave\workspace\maven-plugins-ITs-m3-windows\maven-shade-plugin\target\local-repo\org\apache\maven\plugins\maven-deploy-plugin\2.8-SNAPSHOT\maven-deploy-plugin-2.8-SNAPSHOT.pom
[INFO] Installing F:\hudson\hudson-slave\workspace\maven-plugins-ITs-m3-windows\maven-deploy-plugin\target\maven-deploy-plugin-2.8-SNAPSHOT.jar
to F:\hudson\hudson-slave\workspace\maven-plugins-ITs-m3-windows\maven-shade-plugin\target\local-repo\org\apache\maven\plugins\maven-deploy-plugin\2.8-SNAPSHOT\maven-deploy-plugin-2.8-SNAPSHOT.jar
[INFO] Installing F:\hudson\hudson-slave\workspace\maven-plugins-ITs-m3-windows\maven-deploy-plugin\pom.xml
to F:\hudson\hudson-slave\workspace\maven-plugins-ITs-m3-windows\maven-shade-plugin\target\local-repo\org\apache\maven\plugins\maven-deploy-plugin\2.8-SNAPSHOT\maven-deploy-plugin-2.8-SNAPSHOT.pom
[INFO] Installing F:\hudson\hudson-slave\workspace\maven-plugins-ITs-m3-windows\maven-doap-plugin\pom.xml
to F:\hudson\hudson-slave\workspace\maven-plugins-ITs-m3-windows\maven-shade-plugin\target\local-repo\org\apache\maven\plugins\maven-doap-plugin\1.2-SNAPSHOT\maven-doap-plugin-1.2-SNAPSHOT.pom
[INFO] Installing F:\hudson\hudson-slave\workspace\maven-plugins-ITs-m3-windows\maven-doap-plugin\target\maven-doap-plugin-1.2-SNAPSHOT.jar
to F:\hudson\hudson-slave\workspace\maven-plugins-ITs-m3-windows\maven-shade-plugin\target\local-repo\org\apache\maven\plugins\maven-doap-plugin\1.2-SNAPSHOT\maven-doap-plugin-1.2-SNAPSHOT.jar
[INFO] Installing F:\hudson\hudson-slave\workspace\maven-plugins-ITs-m3-windows\maven-doap-plugin\pom.xml
to F:\hudson\hudson-slave\workspace\maven-plugins-ITs-m3-windows\maven-shade-plugin\target\local-repo\org\apache\maven\plugins\maven-doap-plugin\1.2-SNAPSHOT\maven-doap-plugin-1.2-SNAPSHOT.pom
[INFO] Installing F:\hudson\hudson-slave\workspace\maven-plugins-ITs-m3-windows\maven-docck-plugin\pom.xml
to F:\hudson\hudson-slave\workspace\maven-plugins-ITs-m3-windows\maven-shade-plugin\target\local-repo\org\apache\maven\plugins\maven-docck-plugin\1.1-SNAPSHOT\maven-docck-plugin-1.1-SNAPSHOT.pom
[INFO] Installing F:\hudson\hudson-slave\workspace\maven-plugins-ITs-m3-windows\maven-docck-plugin\target\maven-docck-plugin-1.1-SNAPSHOT.jar
to F:\hudson\hudson-slave\workspace\maven-plugins-ITs-m3-windows\maven-shade-plugin\target\local-repo\org\apache\maven\plugins\maven-docck-plugin\1.1-SNAPSHOT\maven-docck-plugin-1.1-SNAPSHOT.jar
[INFO] Installing F:\hudson\hudson-slave\workspace\maven-plugins-ITs-m3-windows\maven-docck-plugin\pom.xml
to F:\hudson\hudson-slave\workspace\maven-plugins-ITs-m3-windows\maven-shade-plugin\target\local-repo\org\apache\maven\plugins\maven-docck-plugin\1.1-SNAPSHOT\maven-docck-plugin-1.1-SNAPSHOT.pom
[INFO] Installing F:\hudson\hudson-slave\workspace\maven-plugins-ITs-m3-windows\maven-ear-plugin\pom.xml
to F:\hudson\hudson-slave\workspace\maven-plugins-ITs-m3-windows\maven-shade-plugin\target\local-repo\org\apache\maven\plugins\maven-ear-plugin\2.9-SNAPSHOT\maven-ear-plugin-2.9-SNAPSHOT.pom
[INFO] Installing F:\hudson\hudson-slave\workspace\maven-plugins-ITs-m3-windows\maven-ear-plugin\target\maven-ear-plugin-2.9-SNAPSHOT.jar
to F:\hudson\hudson-slave\workspace\maven-plugins-ITs-m3-windows\maven-shade-plugin\target\local-repo\org\apache\maven\plugins\maven-ear-plugin\2.9-SNAPSHOT\maven-ear-plugin-2.9-SNAPSHOT.jar
[INFO] Installing F:\hudson\hudson-slave\workspace\maven-plugins-ITs-m3-windows\maven-ear-plugin\pom.xml
to F:\hudson\hudson-slave\workspace\maven-plugins-ITs-m3-windows\maven-shade-plugin\target\local-repo\org\apache\maven\plugins\maven-ear-plugin\2.9-SNAPSHOT\maven-ear-plugin-2.9-SNAPSHOT.pom
[INFO] Installing F:\hudson\hudson-slave\workspace\maven-plugins-ITs-m3-windows\maven-ejb-plugin\pom.xml
to F:\hudson\hudson-slave\workspace\maven-plugins-ITs-m3-windows\maven-shade-plugin\target\local-repo\org\apache\maven\plugins\maven-ejb-plugin\2.4-SNAPSHOT\maven-ejb-plugin-2.4-SNAPSHOT.pom
[INFO] Installing F:\hudson\hudson-slave\workspace\maven-plugins-ITs-m3-windows\maven-ejb-plugin\target\maven-ejb-plugin-2.4-SNAPSHOT.jar
to F:\hudson\hudson-slave\workspace\maven-plugins-ITs-m3-windows\maven-shade-plugin\target\local-repo\org\apache\maven\plugins\maven-ejb-plugin\2.4-SNAPSHOT\maven-ejb-plugin-2.4-SNAPSHOT.jar
[INFO] Installing F:\hudson\hudson-slave\workspace\maven-plugins-ITs-m3-windows\maven-ejb-plugin\pom.xml
to F:\hudson\hudson-slave\workspace\maven-plugins-ITs-m3-windows\maven-shade-plugin\target\local-repo\org\apache\maven\plugins\maven-ejb-plugin\2.4-SNAPSHOT\maven-ejb-plugin-2.4-SNAPSHOT.pom
[INFO] Installing F:\hudson\hudson-slave\workspace\maven-plugins-ITs-m3-windows\maven-gpg-plugin\pom.xml
to F:\hudson\hudson-slave\workspace\maven-plugins-ITs-m3-windows\maven-shade-plugin\target\local-repo\org\apache\maven\plugins\maven-gpg-plugin\1.5-SNAPSHOT\maven-gpg-plugin-1.5-SNAPSHOT.pom
[INFO] Installing F:\hudson\hudson-slave\workspace\maven-plugins-ITs-m3-windows\maven-gpg-plugin\target\maven-gpg-plugin-1.5-SNAPSHOT.jar
to F:\hudson\hudson-slave\workspace\maven-plugins-ITs-m3-windows\maven-shade-plugin\target\local-repo\org\apache\maven\plugins\maven-gpg-plugin\1.5-SNAPSHOT\maven-gpg-plugin-1.5-SNAPSHOT.jar
[INFO] Installing F:\hudson\hudson-slave\workspace\maven-plugins-ITs-m3-windows\maven-gpg-plugin\pom.xml
to F:\hudson\hudson-slave\workspace\maven-plugins-ITs-m3-windows\maven-shade-plugin\target\local-repo\org\apache\maven\plugins\maven-gpg-plugin\1.5-SNAPSHOT\maven-gpg-plugin-1.5-SNAPSHOT.pom
[INFO] Installing F:\hudson\hudson-slave\workspace\maven-plugins-ITs-m3-windows\maven-help-plugin\pom.xml
to F:\hudson\hudson-slave\workspace\maven-plugins-ITs-m3-windows\maven-shade-plugin\target\local-repo\org\apache\maven\plugins\maven-help-plugin\2.2.1-SNAPSHOT\maven-help-plugin-2.2.1-SNAPSHOT.pom
[INFO] Installing F:\hudson\hudson-slave\workspace\maven-plugins-ITs-m3-windows\maven-help-plugin\target\maven-help-plugin-2.2.1-SNAPSHOT.jar
to F:\hudson\hudson-slave\workspace\maven-plugins-ITs-m3-windows\maven-shade-plugin\target\local-repo\org\apache\maven\plugins\maven-help-plugin\2.2.1-SNAPSHOT\maven-help-plugin-2.2.1-SNAPSHOT.jar
[INFO] Installing F:\hudson\hudson-slave\workspace\maven-plugins-ITs-m3-windows\maven-help-plugin\pom.xml
to F:\hudson\hudson-slave\workspace\maven-plugins-ITs-m3-windows\maven-shade-plugin\target\local-repo\org\apache\maven\plugins\maven-help-plugin\2.2.1-SNAPSHOT\maven-help-plugin-2.2.1-SNAPSHOT.pom
[INFO] Installing F:\hudson\hudson-slave\workspace\maven-plugins-ITs-m3-windows\maven-idea-plugin\pom.xml
to F:\hudson\hudson-slave\workspace\maven-plugins-ITs-m3-windows\maven-shade-plugin\target\local-repo\org\apache\maven\plugins\maven-idea-plugin\2.3-SNAPSHOT\maven-idea-plugin-2.3-SNAPSHOT.pom
[INFO] Installing F:\hudson\hudson-slave\workspace\maven-plugins-ITs-m3-windows\maven-idea-plugin\target\maven-idea-plugin-2.3-SNAPSHOT.jar
to F:\hudson\hudson-slave\workspace\maven-plugins-ITs-m3-windows\maven-shade-plugin\target\local-repo\org\apache\maven\plugins\maven-idea-plugin\2.3-SNAPSHOT\maven-idea-plugin-2.3-SNAPSHOT.jar
[INFO] Installing F:\hudson\hudson-slave\workspace\maven-plugins-ITs-m3-windows\maven-idea-plugin\pom.xml
to F:\hudson\hudson-slave\workspace\maven-plugins-ITs-m3-windows\maven-shade-plugin\target\local-repo\org\apache\maven\plugins\maven-idea-plugin\2.3-SNAPSHOT\maven-idea-plugin-2.3-SNAPSHOT.pom
[INFO] Installing F:\hudson\hudson-slave\workspace\maven-plugins-ITs-m3-windows\maven-install-plugin\pom.xml
to F:\hudson\hudson-slave\workspace\maven-plugins-ITs-m3-windows\maven-shade-plugin\target\local-repo\org\apache\maven\plugins\maven-install-plugin\2.5-SNAPSHOT\maven-install-plugin-2.5-SNAPSHOT.pom
[INFO] Installing F:\hudson\hudson-slave\workspace\maven-plugins-ITs-m3-windows\maven-install-plugin\target\maven-install-plugin-2.5-SNAPSHOT.jar
to F:\hudson\hudson-slave\workspace\maven-plugins-ITs-m3-windows\maven-shade-plugin\target\local-repo\org\apache\maven\plugins\maven-install-plugin\2.5-SNAPSHOT\maven-install-plugin-2.5-SNAPSHOT.jar
[INFO] Installing F:\hudson\hudson-slave\workspace\maven-plugins-ITs-m3-windows\maven-install-plugin\pom.xml
to F:\hudson\hudson-slave\workspace\maven-plugins-ITs-m3-windows\maven-shade-plugin\target\local-repo\org\apache\maven\plugins\maven-install-plugin\2.5-SNAPSHOT\maven-install-plugin-2.5-SNAPSHOT.pom
[INFO] Installing F:\hudson\hudson-slave\workspace\maven-plugins-ITs-m3-windows\maven-jar-plugin\pom.xml
to F:\hudson\hudson-slave\workspace\maven-plugins-ITs-m3-windows\maven-shade-plugin\target\local-repo\org\apache\maven\plugins\maven-jar-plugin\2.5-SNAPSHOT\maven-jar-plugin-2.5-SNAPSHOT.pom
[INFO] Installing F:\hudson\hudson-slave\workspace\maven-plugins-ITs-m3-windows\maven-jar-plugin\target\maven-jar-plugin-2.5-SNAPSHOT.jar
to F:\hudson\hudson-slave\workspace\maven-plugins-ITs-m3-windows\maven-shade-plugin\target\local-repo\org\apache\maven\plugins\maven-jar-plugin\2.5-SNAPSHOT\maven-jar-plugin-2.5-SNAPSHOT.jar
[INFO] Installing F:\hudson\hudson-slave\workspace\maven-plugins-ITs-m3-windows\maven-jar-plugin\pom.xml
to F:\hudson\hudson-slave\workspace\maven-plugins-ITs-m3-windows\maven-shade-plugin\target\local-repo\org\apache\maven\plugins\maven-jar-plugin\2.5-SNAPSHOT\maven-jar-plugin-2.5-SNAPSHOT.pom
[INFO] Installing F:\hudson\hudson-slave\workspace\maven-plugins-ITs-m3-windows\maven-jarsigner-plugin\pom.xml
to F:\hudson\hudson-slave\workspace\maven-plugins-ITs-m3-windows\maven-shade-plugin\target\local-repo\org\apache\maven\plugins\maven-jarsigner-plugin\1.3-SNAPSHOT\maven-jarsigner-plugin-1.3-SNAPSHOT.pom
[INFO] Installing F:\hudson\hudson-slave\workspace\maven-plugins-ITs-m3-windows\maven-jarsigner-plugin\target\maven-jarsigner-plugin-1.3-SNAPSHOT.jar
to F:\hudson\hudson-slave\workspace\maven-plugins-ITs-m3-windows\maven-shade-plugin\target\local-repo\org\apache\maven\plugins\maven-jarsigner-plugin\1.3-SNAPSHOT\maven-jarsigner-plugin-1.3-SNAPSHOT.jar
[INFO] Installing F:\hudson\hudson-slave\workspace\maven-plugins-ITs-m3-windows\maven-jarsigner-plugin\pom.xml
to F:\hudson\hudson-slave\workspace\maven-plugins-ITs-m3-windows\maven-shade-plugin\target\local-repo\org\apache\maven\plugins\maven-jarsigner-plugin\1.3-SNAPSHOT\maven-jarsigner-plugin-1.3-SNAPSHOT.pom
[INFO] Installing F:\hudson\hudson-slave\workspace\maven-plugins-ITs-m3-windows\maven-javadoc-plugin\pom.xml
to F:\hudson\hudson-slave\workspace\maven-plugins-ITs-m3-windows\maven-shade-plugin\target\local-repo\org\apache\maven\plugins\maven-javadoc-plugin\2.10-SNAPSHOT\maven-javadoc-plugin-2.10-SNAPSHOT.pom
[INFO]                                                                         
[INFO] ------------------------------------------------------------------------
[INFO] Building Maven Plugins Aggregator 1-SNAPSHOT
[INFO] ------------------------------------------------------------------------
[INFO] 
[INFO] --- maven-clean-plugin:2.4.1:clean (default-clean) @ maven-plugins-aggregator ---
[INFO] Deleting <https://builds.apache.org/job/maven-plugins-ITs-m3-windows/ws/target>
[INFO] 
[INFO] --- maven-remote-resources-plugin:1.1:process (default) @ maven-plugins-aggregator
---
[INFO] Setting property: classpath.resource.loader.class => 'org.codehaus.plexus.velocity.ContextClassLoaderResourceLoader'.
[INFO] Setting property: velocimacro.messages.on => 'false'.
[INFO] Setting property: resource.loader => 'classpath'.
[INFO] Setting property: resource.manager.logwhenfound => 'false'.
[INFO] 
[INFO] --- maven-install-plugin:2.3.1:install (default-install) @ maven-plugins-aggregator
---
[INFO] Installing <https://builds.apache.org/job/maven-plugins-ITs-m3-windows/ws/pom.xml>
to C:\Users\hudson\.m2\repository\org\apache\maven\plugins\maven-plugins-aggregator\1-SNAPSHOT\maven-plugins-aggregator-1-SNAPSHOT.pom
[INFO] ------------------------------------------------------------------------
[INFO] Reactor Summary:
[INFO] 
[INFO] Maven Plugins ..................................... SUCCESS [14.655s]
[INFO] Maven ACR Plugin .................................. SUCCESS [1:18.554s]
[INFO] Maven Ant Plugin .................................. SUCCESS [4:39.470s]
[INFO] Maven AntRun Plugin ............................... SUCCESS [1:36.495s]
[INFO] Maven Eclipse Plugin .............................. SUCCESS [10:08.722s]
[INFO] Maven Assembly Plugin ............................. SUCCESS [14:14.302s]
[INFO] Maven Changelog Plugin ............................ SUCCESS [1:12.331s]
[INFO] Maven Changes Report Plugin ....................... SUCCESS [1:31.220s]
[INFO] Maven Checkstyle Plugin ........................... SUCCESS [2:35.346s]
[INFO] Maven Clean Plugin ................................ SUCCESS [24.231s]
[INFO] Maven Compiler Plugin ............................. SUCCESS [2:02.524s]
[INFO] Maven Dependency Plugin ........................... SUCCESS [5:05.236s]
[INFO] Maven Deploy Plugin ............................... SUCCESS [5:27.408s]
[INFO] Maven DOAP Plugin ................................. SUCCESS [1:31.706s]
[INFO] Maven Documentation Checker Plugin ................ SUCCESS [25.812s]
[INFO] Maven EAR Plugin .................................. SUCCESS [9:02.258s]
[INFO] Maven EJB Plugin .................................. SUCCESS [57.243s]
[INFO] Maven GPG Plugin .................................. SUCCESS [2.580s]
[INFO] Maven Help Plugin ................................. SUCCESS [1:10.367s]
[INFO] Maven IDEA Plugin ................................. SUCCESS [11.076s]
[INFO] Maven Install Plugin .............................. SUCCESS [1:17.267s]
[INFO] Maven JAR Plugin .................................. SUCCESS [1:35.296s]
[INFO] Maven Jarsigner Plugin ............................ SUCCESS [36.991s]
[INFO] Maven Javadoc Plugin .............................. FAILURE [1:09.015s]
[INFO] Maven Linkcheck Plugin ............................ SUCCESS [3.357s]
[INFO] Maven One Plugin .................................. SUCCESS [2.570s]
[INFO] Maven Patch Plugin ................................ SUCCESS [6.263s]
[INFO] Maven PDF Plugin .................................. SUCCESS [49.657s]
[INFO] Maven PMD Plugin .................................. SUCCESS [2:05.234s]
[INFO] Maven RAR Plugin .................................. SUCCESS [16.849s]
[INFO] Maven Reactor Plugin .............................. SUCCESS [3.722s]
[INFO] Maven Repository Plugin ........................... SUCCESS [1:06.756s]
[INFO] Maven Resources Plugin ............................ SUCCESS [1:13.113s]
[INFO] Maven Site Plugin 3 ............................... FAILURE [15.488s]
[INFO] Maven Source Plugin ............................... SUCCESS [1:09.226s]
[INFO] Maven Stage Plugin ................................ SUCCESS [2.851s]
[INFO] Maven Toolchains Plugin ........................... SUCCESS [2.900s]
[INFO] Maven Verifier Plugin ............................. SUCCESS [32.008s]
[INFO] Maven WAR Plugin .................................. SUCCESS [1:44.447s]
[INFO] Maven SCM Publish Plugin .......................... SUCCESS [1:34.223s]
[INFO] Maven Invoker Plugin .............................. FAILURE [15.063s]
[INFO] Maven Project Info Reports Plugin ................. SUCCESS [3:06.719s]
[INFO] Maven Remote Resources Plugin ..................... SUCCESS [1:20.185s]
[INFO] Maven Shade Plugin ................................ FAILURE [9.735s]
[INFO] Maven Plugins Aggregator .......................... SUCCESS [0.644s]
[INFO] ------------------------------------------------------------------------
[INFO] BUILD FAILURE
[INFO] ------------------------------------------------------------------------
[INFO] Total time: 1:24:35.270s
[INFO] Finished at: Sun May 12 23:44:35 BST 2013
[INFO] Final Memory: 132M/380M
[INFO] ------------------------------------------------------------------------
[WARNING] The requested profile "apache.snapshots" could not be activated because it does
not exist.
[ERROR] Failed to execute goal org.apache.maven.plugins:maven-surefire-plugin:2.12.4:test
(default-test) on project maven-javadoc-plugin: There are test failures.
[ERROR] 
[ERROR] Please refer to F:\hudson\hudson-slave\workspace\maven-plugins-ITs-m3-windows\maven-javadoc-plugin\target\surefire-reports
for the individual test results.
[ERROR] -> [Help 1]
[ERROR] Failed to execute goal org.apache.maven.plugins:maven-invoker-plugin:1.8:install (integration-test)
on project maven-site-plugin: Failed to install project dependencies: MavenProject: org.apache.maven.plugins:maven-site-plugin:3.4-SNAPSHOT
@ F:\hudson\hudson-slave\workspace\maven-plugins-ITs-m3-windows\maven-site-plugin\dependency-reduced-pom.xml:
Failed to install project artifacts: MavenProject: org.apache.maven.plugins:maven-javadoc-plugin:2.10-SNAPSHOT
@ F:\hudson\hudson-slave\workspace\maven-plugins-ITs-m3-windows\maven-javadoc-plugin\pom.xml:
Failed to install artifact: org.apache.maven.plugins:maven-javadoc-plugin:maven-plugin:2.10-SNAPSHOT:
Artifact is not fully assembled: F:\hudson\hudson-slave\workspace\maven-plugins-ITs-m3-windows\maven-javadoc-plugin\target\classes
-> [Help 2]
[ERROR] Failed to execute goal org.apache.maven.plugins:maven-invoker-plugin:1.8:install (integration-test)
on project maven-invoker-plugin: Failed to install project dependencies: MavenProject: org.apache.maven.plugins:maven-invoker-plugin:1.9-SNAPSHOT
@ F:\hudson\hudson-slave\workspace\maven-plugins-ITs-m3-windows\maven-invoker-plugin\pom.xml:
Failed to install project artifacts: MavenProject: org.apache.maven.plugins:maven-javadoc-plugin:2.10-SNAPSHOT
@ F:\hudson\hudson-slave\workspace\maven-plugins-ITs-m3-windows\maven-javadoc-plugin\pom.xml:
Failed to install artifact: org.apache.maven.plugins:maven-javadoc-plugin:maven-plugin:2.10-SNAPSHOT:
Artifact is not fully assembled: F:\hudson\hudson-slave\workspace\maven-plugins-ITs-m3-windows\maven-javadoc-plugin\target\classes
-> [Help 2]
[ERROR] Failed to execute goal org.apache.maven.plugins:maven-invoker-plugin:1.8:install (integration-test)
on project maven-shade-plugin: Failed to install project dependencies: MavenProject: org.apache.maven.plugins:maven-shade-plugin:3.0-SNAPSHOT
@ F:\hudson\hudson-slave\workspace\maven-plugins-ITs-m3-windows\maven-shade-plugin\pom.xml:
Failed to install project artifacts: MavenProject: org.apache.maven.plugins:maven-javadoc-plugin:2.10-SNAPSHOT
@ F:\hudson\hudson-slave\workspace\maven-plugins-ITs-m3-windows\maven-javadoc-plugin\pom.xml:
Failed to install artifact: org.apache.maven.plugins:maven-javadoc-plugin:maven-plugin:2.10-SNAPSHOT:
Artifact is not fully assembled: F:\hudson\hudson-slave\workspace\maven-plugins-ITs-m3-windows\maven-javadoc-plugin\target\classes
-> [Help 2]
[ERROR] 
[ERROR] To see the full stack trace of the errors, re-run Maven with the -e switch.
[ERROR] Re-run Maven using the -X switch to enable full debug logging.
[ERROR] 
[ERROR] For more information about the errors and possible solutions, please read the following
articles:
[ERROR] [Help 1] http://cwiki.apache.org/confluence/display/MAVEN/MojoFailureException
[ERROR] [Help 2] http://cwiki.apache.org/confluence/display/MAVEN/MojoExecutionException
[ERROR] 
[ERROR] After correcting the problems, you can resume the build with the command
[ERROR]   mvn <goals> -rf :maven-javadoc-plugin
Build step 'Invoke top-level Maven targets' marked build as failure
Recording test results

Mime
View raw message