maven-notifications mailing list archives

Site index · List index
Message view « Date » · « Thread »
Top « Date » · « Thread »
From Apache Jenkins Server <jenk...@builds.apache.org>
Subject Build failed in Jenkins: maven-plugins-windows #121
Date Thu, 09 May 2013 00:28:01 GMT
See <https://builds.apache.org/job/maven-plugins-windows/121/changes>

Changes:

[hboutemy] renamed methods to make SiteStageMojo and SiteStageDeployMojo as similar as possible

------------------------------------------
[...truncated 7418 lines...]
[INFO] Excluding org.apache.maven.wagon:wagon-http:jar:1.0-beta-6 from the shaded jar.
[INFO] Excluding org.apache.maven.wagon:wagon-webdav-jackrabbit:jar:1.0-beta-6 from the shaded
jar.
[INFO] Excluding org.apache.jackrabbit:jackrabbit-webdav:jar:1.5.0 from the shaded jar.
[INFO] Excluding org.apache.jackrabbit:jackrabbit-jcr-commons:jar:1.5.0 from the shaded jar.
[INFO] Excluding commons-httpclient:commons-httpclient:jar:3.0 from the shaded jar.
[INFO] Excluding org.slf4j:slf4j-nop:jar:1.5.3 from the shaded jar.
[INFO] Excluding org.slf4j:slf4j-jdk14:jar:1.5.6 from the shaded jar.
[INFO] Excluding org.slf4j:slf4j-api:jar:1.5.6 from the shaded jar.
[INFO] Excluding org.slf4j:jcl-over-slf4j:jar:1.5.6 from the shaded jar.
[INFO] Excluding org.apache.maven:maven-profile:jar:2.2.1 from the shaded jar.
[INFO] Excluding org.apache.maven:maven-repository-metadata:jar:2.2.1 from the shaded jar.
[INFO] Excluding org.apache.maven:maven-error-diagnostics:jar:2.2.1 from the shaded jar.
[INFO] Excluding commons-cli:commons-cli:jar:1.2 from the shaded jar.
[INFO] Excluding org.apache.maven.wagon:wagon-ssh-external:jar:1.0-beta-6 from the shaded
jar.
[INFO] Excluding org.apache.maven.wagon:wagon-ssh-common:jar:1.0-beta-6 from the shaded jar.
[INFO] Excluding org.apache.maven:maven-plugin-descriptor:jar:2.2.1 from the shaded jar.
[INFO] Excluding org.codehaus.plexus:plexus-interactivity-api:jar:1.0-alpha-4 from the shaded
jar.
[INFO] Excluding org.apache.maven:maven-monitor:jar:2.2.1 from the shaded jar.
[INFO] Excluding org.apache.maven.wagon:wagon-ssh:jar:1.0-beta-6 from the shaded jar.
[INFO] Excluding com.jcraft:jsch:jar:0.1.38 from the shaded jar.
[INFO] Excluding classworlds:classworlds:jar:1.1 from the shaded jar.
[INFO] Excluding org.sonatype.plexus:plexus-sec-dispatcher:jar:1.3 from the shaded jar.
[INFO] Excluding org.sonatype.plexus:plexus-cipher:jar:1.4 from the shaded jar.
[INFO] Excluding org.apache.maven:maven-project:jar:2.2.1 from the shaded jar.
[INFO] Excluding org.apache.maven:maven-plugin-registry:jar:2.2.1 from the shaded jar.
[INFO] Excluding org.codehaus.plexus:plexus-interpolation:jar:1.11 from the shaded jar.
[INFO] Excluding org.apache.maven:maven-model:jar:2.2.1 from the shaded jar.
[INFO] Excluding org.apache.maven:maven-settings:jar:2.2.1 from the shaded jar.
[INFO] Excluding org.apache.maven:maven-plugin-api:jar:2.2.1 from the shaded jar.
[INFO] Excluding org.apache.maven:maven-artifact:jar:2.2.1 from the shaded jar.
[INFO] Excluding org.apache.maven:maven-artifact-manager:jar:2.2.1 from the shaded jar.
[INFO] Excluding backport-util-concurrent:backport-util-concurrent:jar:3.1 from the shaded
jar.
[INFO] Excluding org.apache.maven:maven-toolchain:jar:2.2.1 from the shaded jar.
[INFO] Excluding org.apache.maven.reporting:maven-reporting-api:jar:3.0 from the shaded jar.
[INFO] Excluding org.apache.maven:maven-archiver:jar:2.5 from the shaded jar.
[INFO] Excluding org.apache.maven.shared:maven-invoker:jar:2.0.9 from the shaded jar.
[INFO] Excluding org.apache.maven.shared:maven-common-artifact-filters:jar:1.3 from the shaded
jar.
[INFO] Excluding org.apache.maven.doxia:doxia-sink-api:jar:1.0 from the shaded jar.
[INFO] Excluding org.apache.maven.doxia:doxia-site-renderer:jar:1.0 from the shaded jar.
[INFO] Excluding org.apache.maven.doxia:doxia-core:jar:1.0 from the shaded jar.
[INFO] Excluding org.codehaus.plexus:plexus-i18n:jar:1.0-beta-7 from the shaded jar.
[INFO] Excluding org.codehaus.plexus:plexus-velocity:jar:1.1.7 from the shaded jar.
[INFO] Excluding org.apache.velocity:velocity:jar:1.5 from the shaded jar.
[INFO] Excluding oro:oro:jar:2.0.8 from the shaded jar.
[INFO] Excluding org.apache.maven.doxia:doxia-decoration-model:jar:1.0 from the shaded jar.
[INFO] Excluding commons-collections:commons-collections:jar:3.2 from the shaded jar.
[INFO] Excluding org.apache.maven.doxia:doxia-module-apt:jar:1.0 from the shaded jar.
[INFO] Excluding org.apache.maven.doxia:doxia-module-fml:jar:1.0 from the shaded jar.
[INFO] Excluding org.apache.maven.doxia:doxia-module-xdoc:jar:1.0 from the shaded jar.
[INFO] Excluding org.apache.maven.doxia:doxia-module-xhtml:jar:1.0 from the shaded jar.
[INFO] Including org.apache.maven.wagon:wagon-provider-api:jar:1.0-beta-6 in the shaded jar.
[INFO] Excluding commons-lang:commons-lang:jar:2.4 from the shaded jar.
[INFO] Excluding commons-io:commons-io:jar:2.2 from the shaded jar.
[INFO] Excluding org.apache.httpcomponents:httpclient:jar:4.2.3 from the shaded jar.
[INFO] Excluding org.apache.httpcomponents:httpcore:jar:4.2.2 from the shaded jar.
[INFO] Excluding commons-codec:commons-codec:jar:1.6 from the shaded jar.
[INFO] Excluding commons-logging:commons-logging:jar:1.1.1 from the shaded jar.
[INFO] Excluding log4j:log4j:jar:1.2.14 from the shaded jar.
[INFO] Excluding com.thoughtworks.qdox:qdox:jar:1.12.1 from the shaded jar.
[INFO] Excluding org.codehaus.plexus:plexus-container-default:jar:1.0-alpha-9 from the shaded
jar.
[INFO] Excluding org.codehaus.plexus:plexus-archiver:jar:2.1.2 from the shaded jar.
[INFO] Excluding org.codehaus.plexus:plexus-io:jar:2.0.4 from the shaded jar.
[INFO] Excluding org.codehaus.plexus:plexus-utils:jar:3.0.5 from the shaded jar.
[INFO] Replacing original artifact with shaded artifact.
[INFO] Replacing F:\hudson\hudson-slave\workspace\maven-plugins-windows\maven-javadoc-plugin\target\maven-javadoc-plugin-2.10-SNAPSHOT.jar
with F:\hudson\hudson-slave\workspace\maven-plugins-windows\maven-javadoc-plugin\target\maven-javadoc-plugin-2.10-SNAPSHOT-shaded.jar
[INFO] Installing F:\hudson\hudson-slave\workspace\maven-plugins-windows\maven-javadoc-plugin\target\maven-javadoc-plugin-2.10-SNAPSHOT.jar
to f:\hudson\hudson-slave\maven-repositories\1\org\apache\maven\plugins\maven-javadoc-plugin\2.10-SNAPSHOT\maven-javadoc-plugin-2.10-SNAPSHOT.jar
[INFO] 
[INFO] --- maven-install-plugin:2.3.1:install (default-install) @ maven-javadoc-plugin ---
[INFO] Installing F:\hudson\hudson-slave\workspace\maven-plugins-windows\maven-javadoc-plugin\pom.xml
to f:\hudson\hudson-slave\maven-repositories\1\org\apache\maven\plugins\maven-javadoc-plugin\2.10-SNAPSHOT\maven-javadoc-plugin-2.10-SNAPSHOT.pom
[INFO] ------------------------------------------------------------------------
[INFO] Reactor Summary:
[INFO] 
[INFO] Maven Plugins ..................................... SUCCESS [15.224s]
[INFO] Maven ACR Plugin .................................. SUCCESS [24.731s]
[INFO] Maven Ant Plugin .................................. SUCCESS [34.987s]
[INFO] Maven AntRun Plugin ............................... SUCCESS [9.465s]
[INFO] Maven Eclipse Plugin .............................. SUCCESS [1:47.919s]
[INFO] Maven Assembly Plugin ............................. SUCCESS [1:03.963s]
[INFO] Maven Changelog Plugin ............................ SUCCESS [38.780s]
[INFO] Maven Changes Report Plugin ....................... SUCCESS [42.635s]
[INFO] Maven Checkstyle Plugin ........................... SUCCESS [30.322s]
[INFO] Maven Clean Plugin ................................ SUCCESS [7.699s]
[INFO] Maven Compiler Plugin ............................. SUCCESS [23.582s]
[INFO] Maven Dependency Plugin ........................... FAILURE [59.082s]
[INFO] Maven Deploy Plugin ............................... SUCCESS [10.236s]
[INFO] Maven DOAP Plugin ................................. SUCCESS [19.795s]
[INFO] Maven Documentation Checker Plugin ................ SUCCESS [4.422s]
[INFO] Maven EAR Plugin .................................. SUCCESS [28.889s]
[INFO] Maven EJB Plugin .................................. SUCCESS [9.546s]
[INFO] Maven GPG Plugin .................................. SUCCESS [2.957s]
[INFO] Maven Help Plugin ................................. SUCCESS [13.397s]
[INFO] Maven IDEA Plugin ................................. SUCCESS [16.259s]
[INFO] Maven Install Plugin .............................. SUCCESS [10.334s]
[INFO] Maven JAR Plugin .................................. SUCCESS [6.079s]
[INFO] Maven Jarsigner Plugin ............................ SUCCESS [1.799s]
[INFO] Maven Javadoc Plugin .............................. SUCCESS [3:13.476s]
[INFO] Maven Linkcheck Plugin ............................ SUCCESS [3.852s]
[INFO] Maven One Plugin .................................. SUCCESS [2.694s]
[INFO] Maven Patch Plugin ................................ SUCCESS [1.171s]
[INFO] Maven PDF Plugin .................................. SUCCESS [35.171s]
[INFO] Maven PMD Plugin .................................. SUCCESS [56.874s]
[INFO] Maven RAR Plugin .................................. SUCCESS [9.129s]
[INFO] Maven Reactor Plugin .............................. SUCCESS [13.589s]
[INFO] Maven Repository Plugin ........................... SUCCESS [8.824s]
[INFO] Maven Resources Plugin ............................ SUCCESS [10.299s]
[INFO] Maven Site Plugin 3 ............................... SUCCESS [25.020s]
[INFO] Maven Source Plugin ............................... SUCCESS [7.128s]
[INFO] Maven Stage Plugin ................................ SUCCESS [5.722s]
[INFO] Maven Toolchains Plugin ........................... SUCCESS [4.300s]
[INFO] Maven Verifier Plugin ............................. SUCCESS [3.713s]
[INFO] Maven WAR Plugin .................................. SUCCESS [42.804s]
[INFO] Maven SCM Publish Plugin .......................... SUCCESS [12.472s]
[INFO] Maven Invoker Plugin .............................. SUCCESS [33.546s]
[INFO] Maven Project Info Reports Plugin ................. SUCCESS [50.078s]
[INFO] Maven Remote Resources Plugin ..................... SUCCESS [16.635s]
[INFO] Maven Shade Plugin ................................ SUCCESS [23.664s]
[INFO] Maven Plugins Aggregator .......................... SUCCESS [1.169s]
[INFO] ------------------------------------------------------------------------
[INFO] BUILD FAILURE
[INFO] ------------------------------------------------------------------------
[INFO] Total time: 6:32.306s (Wall Clock)
[INFO] Finished at: Thu May 09 01:27:10 BST 2013
[INFO] Final Memory: 95M/326M
[INFO] ------------------------------------------------------------------------
[JENKINS] Archiving F:\hudson\hudson-slave\workspace\maven-plugins-windows\maven-war-plugin\pom.xml
to /home/hudson/hudson/jobs/maven-plugins-windows/modules/org.apache.maven.plugins$maven-war-plugin/builds/2013-05-09_00-20-35/archive/org.apache.maven.plugins/maven-war-plugin/2.4-SNAPSHOT/maven-war-plugin-2.4-SNAPSHOT.pom
[JENKINS] Archiving F:\hudson\hudson-slave\workspace\maven-plugins-windows\maven-war-plugin\target\maven-war-plugin-2.4-SNAPSHOT.jar
to /home/hudson/hudson/jobs/maven-plugins-windows/modules/org.apache.maven.plugins$maven-war-plugin/builds/2013-05-09_00-20-35/archive/org.apache.maven.plugins/maven-war-plugin/2.4-SNAPSHOT/maven-war-plugin-2.4-SNAPSHOT.jar
[JENKINS] Archiving F:\hudson\hudson-slave\workspace\maven-plugins-windows\maven-docck-plugin\pom.xml
to /home/hudson/hudson/jobs/maven-plugins-windows/modules/org.apache.maven.plugins$maven-docck-plugin/builds/2013-05-09_00-20-35/archive/org.apache.maven.plugins/maven-docck-plugin/1.1-SNAPSHOT/maven-docck-plugin-1.1-SNAPSHOT.pom
[JENKINS] Archiving F:\hudson\hudson-slave\workspace\maven-plugins-windows\maven-docck-plugin\target\maven-docck-plugin-1.1-SNAPSHOT.jar
to /home/hudson/hudson/jobs/maven-plugins-windows/modules/org.apache.maven.plugins$maven-docck-plugin/builds/2013-05-09_00-20-35/archive/org.apache.maven.plugins/maven-docck-plugin/1.1-SNAPSHOT/maven-docck-plugin-1.1-SNAPSHOT.jar
[JENKINS] Archiving <https://builds.apache.org/job/maven-plugins-windows/ws/pom.xml>
to /home/hudson/hudson/jobs/maven-plugins-windows/modules/org.apache.maven.plugins$maven-plugins-aggregator/builds/2013-05-09_00-20-35/archive/org.apache.maven.plugins/maven-plugins-aggregator/1-SNAPSHOT/maven-plugins-aggregator-1-SNAPSHOT.pom
[JENKINS] Archiving F:\hudson\hudson-slave\workspace\maven-plugins-windows\maven-idea-plugin\pom.xml
to /home/hudson/hudson/jobs/maven-plugins-windows/modules/org.apache.maven.plugins$maven-idea-plugin/builds/2013-05-09_00-20-35/archive/org.apache.maven.plugins/maven-idea-plugin/2.3-SNAPSHOT/maven-idea-plugin-2.3-SNAPSHOT.pom
[JENKINS] Archiving F:\hudson\hudson-slave\workspace\maven-plugins-windows\maven-idea-plugin\target\maven-idea-plugin-2.3-SNAPSHOT.jar
to /home/hudson/hudson/jobs/maven-plugins-windows/modules/org.apache.maven.plugins$maven-idea-plugin/builds/2013-05-09_00-20-35/archive/org.apache.maven.plugins/maven-idea-plugin/2.3-SNAPSHOT/maven-idea-plugin-2.3-SNAPSHOT.jar
[JENKINS] Archiving F:\hudson\hudson-slave\workspace\maven-plugins-windows\maven-toolchains-plugin\pom.xml
to /home/hudson/hudson/jobs/maven-plugins-windows/modules/org.apache.maven.plugins$maven-toolchains-plugin/builds/2013-05-09_00-20-35/archive/org.apache.maven.plugins/maven-toolchains-plugin/1.1-SNAPSHOT/maven-toolchains-plugin-1.1-SNAPSHOT.pom
[JENKINS] Archiving F:\hudson\hudson-slave\workspace\maven-plugins-windows\maven-toolchains-plugin\target\maven-toolchains-plugin-1.1-SNAPSHOT.jar
to /home/hudson/hudson/jobs/maven-plugins-windows/modules/org.apache.maven.plugins$maven-toolchains-plugin/builds/2013-05-09_00-20-35/archive/org.apache.maven.plugins/maven-toolchains-plugin/1.1-SNAPSHOT/maven-toolchains-plugin-1.1-SNAPSHOT.jar
[JENKINS] Archiving F:\hudson\hudson-slave\workspace\maven-plugins-windows\maven-pmd-plugin\pom.xml
to /home/hudson/hudson/jobs/maven-plugins-windows/modules/org.apache.maven.plugins$maven-pmd-plugin/builds/2013-05-09_00-20-35/archive/org.apache.maven.plugins/maven-pmd-plugin/3.0.2-SNAPSHOT/maven-pmd-plugin-3.0.2-SNAPSHOT.pom
[JENKINS] Archiving F:\hudson\hudson-slave\workspace\maven-plugins-windows\maven-pmd-plugin\target\maven-pmd-plugin-3.0.2-SNAPSHOT.jar
to /home/hudson/hudson/jobs/maven-plugins-windows/modules/org.apache.maven.plugins$maven-pmd-plugin/builds/2013-05-09_00-20-35/archive/org.apache.maven.plugins/maven-pmd-plugin/3.0.2-SNAPSHOT/maven-pmd-plugin-3.0.2-SNAPSHOT.jar
[JENKINS] Archiving F:\hudson\hudson-slave\workspace\maven-plugins-windows\maven-eclipse-plugin\pom.xml
to /home/hudson/hudson/jobs/maven-plugins-windows/modules/org.apache.maven.plugins$maven-eclipse-plugin/builds/2013-05-09_00-20-35/archive/org.apache.maven.plugins/maven-eclipse-plugin/2.10-SNAPSHOT/maven-eclipse-plugin-2.10-SNAPSHOT.pom
[JENKINS] Archiving F:\hudson\hudson-slave\workspace\maven-plugins-windows\maven-eclipse-plugin\target\maven-eclipse-plugin-2.10-SNAPSHOT.jar
to /home/hudson/hudson/jobs/maven-plugins-windows/modules/org.apache.maven.plugins$maven-eclipse-plugin/builds/2013-05-09_00-20-35/archive/org.apache.maven.plugins/maven-eclipse-plugin/2.10-SNAPSHOT/maven-eclipse-plugin-2.10-SNAPSHOT.jar
[JENKINS] Archiving F:\hudson\hudson-slave\workspace\maven-plugins-windows\maven-gpg-plugin\pom.xml
to /home/hudson/hudson/jobs/maven-plugins-windows/modules/org.apache.maven.plugins$maven-gpg-plugin/builds/2013-05-09_00-20-35/archive/org.apache.maven.plugins/maven-gpg-plugin/1.5-SNAPSHOT/maven-gpg-plugin-1.5-SNAPSHOT.pom
[JENKINS] Archiving F:\hudson\hudson-slave\workspace\maven-plugins-windows\maven-gpg-plugin\target\maven-gpg-plugin-1.5-SNAPSHOT.jar
to /home/hudson/hudson/jobs/maven-plugins-windows/modules/org.apache.maven.plugins$maven-gpg-plugin/builds/2013-05-09_00-20-35/archive/org.apache.maven.plugins/maven-gpg-plugin/1.5-SNAPSHOT/maven-gpg-plugin-1.5-SNAPSHOT.jar
[JENKINS] Archiving F:\hudson\hudson-slave\workspace\maven-plugins-windows\maven-clean-plugin\pom.xml
to /home/hudson/hudson/jobs/maven-plugins-windows/modules/org.apache.maven.plugins$maven-clean-plugin/builds/2013-05-09_00-20-35/archive/org.apache.maven.plugins/maven-clean-plugin/2.6-SNAPSHOT/maven-clean-plugin-2.6-SNAPSHOT.pom
[JENKINS] Archiving F:\hudson\hudson-slave\workspace\maven-plugins-windows\maven-clean-plugin\target\maven-clean-plugin-2.6-SNAPSHOT.jar
to /home/hudson/hudson/jobs/maven-plugins-windows/modules/org.apache.maven.plugins$maven-clean-plugin/builds/2013-05-09_00-20-35/archive/org.apache.maven.plugins/maven-clean-plugin/2.6-SNAPSHOT/maven-clean-plugin-2.6-SNAPSHOT.jar
[JENKINS] Archiving F:\hudson\hudson-slave\workspace\maven-plugins-windows\maven-jar-plugin\pom.xml
to /home/hudson/hudson/jobs/maven-plugins-windows/modules/org.apache.maven.plugins$maven-jar-plugin/builds/2013-05-09_00-20-35/archive/org.apache.maven.plugins/maven-jar-plugin/2.5-SNAPSHOT/maven-jar-plugin-2.5-SNAPSHOT.pom
[JENKINS] Archiving F:\hudson\hudson-slave\workspace\maven-plugins-windows\maven-jar-plugin\target\maven-jar-plugin-2.5-SNAPSHOT.jar
to /home/hudson/hudson/jobs/maven-plugins-windows/modules/org.apache.maven.plugins$maven-jar-plugin/builds/2013-05-09_00-20-35/archive/org.apache.maven.plugins/maven-jar-plugin/2.5-SNAPSHOT/maven-jar-plugin-2.5-SNAPSHOT.jar
[JENKINS] Archiving F:\hudson\hudson-slave\workspace\maven-plugins-windows\maven-site-plugin\dependency-reduced-pom.xml
to /home/hudson/hudson/jobs/maven-plugins-windows/modules/org.apache.maven.plugins$maven-site-plugin/builds/2013-05-09_00-20-35/archive/org.apache.maven.plugins/maven-site-plugin/3.3-SNAPSHOT/maven-site-plugin-3.3-SNAPSHOT.pom
[JENKINS] Archiving F:\hudson\hudson-slave\workspace\maven-plugins-windows\maven-site-plugin\target\maven-site-plugin-3.3-SNAPSHOT.jar
to /home/hudson/hudson/jobs/maven-plugins-windows/modules/org.apache.maven.plugins$maven-site-plugin/builds/2013-05-09_00-20-35/archive/org.apache.maven.plugins/maven-site-plugin/3.3-SNAPSHOT/maven-site-plugin-3.3-SNAPSHOT.jar
[JENKINS] Archiving F:\hudson\hudson-slave\workspace\maven-plugins-windows\maven-patch-plugin\pom.xml
to /home/hudson/hudson/jobs/maven-plugins-windows/modules/org.apache.maven.plugins$maven-patch-plugin/builds/2013-05-09_00-20-35/archive/org.apache.maven.plugins/maven-patch-plugin/1.2-SNAPSHOT/maven-patch-plugin-1.2-SNAPSHOT.pom
[JENKINS] Archiving F:\hudson\hudson-slave\workspace\maven-plugins-windows\maven-patch-plugin\target\maven-patch-plugin-1.2-SNAPSHOT.jar
to /home/hudson/hudson/jobs/maven-plugins-windows/modules/org.apache.maven.plugins$maven-patch-plugin/builds/2013-05-09_00-20-35/archive/org.apache.maven.plugins/maven-patch-plugin/1.2-SNAPSHOT/maven-patch-plugin-1.2-SNAPSHOT.jar
[JENKINS] Archiving F:\hudson\hudson-slave\workspace\maven-plugins-windows\maven-install-plugin\pom.xml
to /home/hudson/hudson/jobs/maven-plugins-windows/modules/org.apache.maven.plugins$maven-install-plugin/builds/2013-05-09_00-20-35/archive/org.apache.maven.plugins/maven-install-plugin/2.5-SNAPSHOT/maven-install-plugin-2.5-SNAPSHOT.pom
[JENKINS] Archiving F:\hudson\hudson-slave\workspace\maven-plugins-windows\maven-install-plugin\target\maven-install-plugin-2.5-SNAPSHOT.jar
to /home/hudson/hudson/jobs/maven-plugins-windows/modules/org.apache.maven.plugins$maven-install-plugin/builds/2013-05-09_00-20-35/archive/org.apache.maven.plugins/maven-install-plugin/2.5-SNAPSHOT/maven-install-plugin-2.5-SNAPSHOT.jar
[JENKINS] Archiving F:\hudson\hudson-slave\workspace\maven-plugins-windows\maven-antrun-plugin\pom.xml
to /home/hudson/hudson/jobs/maven-plugins-windows/modules/org.apache.maven.plugins$maven-antrun-plugin/builds/2013-05-09_00-20-35/archive/org.apache.maven.plugins/maven-antrun-plugin/1.8-SNAPSHOT/maven-antrun-plugin-1.8-SNAPSHOT.pom
[JENKINS] Archiving F:\hudson\hudson-slave\workspace\maven-plugins-windows\maven-antrun-plugin\target\maven-antrun-plugin-1.8-SNAPSHOT.jar
to /home/hudson/hudson/jobs/maven-plugins-windows/modules/org.apache.maven.plugins$maven-antrun-plugin/builds/2013-05-09_00-20-35/archive/org.apache.maven.plugins/maven-antrun-plugin/1.8-SNAPSHOT/maven-antrun-plugin-1.8-SNAPSHOT.jar
[JENKINS] Archiving F:\hudson\hudson-slave\workspace\maven-plugins-windows\maven-changes-plugin\pom.xml
to /home/hudson/hudson/jobs/maven-plugins-windows/modules/org.apache.maven.plugins$maven-changes-plugin/builds/2013-05-09_00-20-35/archive/org.apache.maven.plugins/maven-changes-plugin/2.10-SNAPSHOT/maven-changes-plugin-2.10-SNAPSHOT.pom
[JENKINS] Archiving F:\hudson\hudson-slave\workspace\maven-plugins-windows\maven-changes-plugin\target\maven-changes-plugin-2.10-SNAPSHOT.jar
to /home/hudson/hudson/jobs/maven-plugins-windows/modules/org.apache.maven.plugins$maven-changes-plugin/builds/2013-05-09_00-20-35/archive/org.apache.maven.plugins/maven-changes-plugin/2.10-SNAPSHOT/maven-changes-plugin-2.10-SNAPSHOT.jar
[JENKINS] Archiving F:\hudson\hudson-slave\workspace\maven-plugins-windows\maven-rar-plugin\pom.xml
to /home/hudson/hudson/jobs/maven-plugins-windows/modules/org.apache.maven.plugins$maven-rar-plugin/builds/2013-05-09_00-20-35/archive/org.apache.maven.plugins/maven-rar-plugin/2.4-SNAPSHOT/maven-rar-plugin-2.4-SNAPSHOT.pom
[JENKINS] Archiving F:\hudson\hudson-slave\workspace\maven-plugins-windows\maven-rar-plugin\target\maven-rar-plugin-2.4-SNAPSHOT.jar
to /home/hudson/hudson/jobs/maven-plugins-windows/modules/org.apache.maven.plugins$maven-rar-plugin/builds/2013-05-09_00-20-35/archive/org.apache.maven.plugins/maven-rar-plugin/2.4-SNAPSHOT/maven-rar-plugin-2.4-SNAPSHOT.jar
[JENKINS] Archiving F:\hudson\hudson-slave\workspace\maven-plugins-windows\maven-jarsigner-plugin\pom.xml
to /home/hudson/hudson/jobs/maven-plugins-windows/modules/org.apache.maven.plugins$maven-jarsigner-plugin/builds/2013-05-09_00-20-35/archive/org.apache.maven.plugins/maven-jarsigner-plugin/1.3-SNAPSHOT/maven-jarsigner-plugin-1.3-SNAPSHOT.pom
[JENKINS] Archiving F:\hudson\hudson-slave\workspace\maven-plugins-windows\maven-jarsigner-plugin\target\maven-jarsigner-plugin-1.3-SNAPSHOT.jar
to /home/hudson/hudson/jobs/maven-plugins-windows/modules/org.apache.maven.plugins$maven-jarsigner-plugin/builds/2013-05-09_00-20-35/archive/org.apache.maven.plugins/maven-jarsigner-plugin/1.3-SNAPSHOT/maven-jarsigner-plugin-1.3-SNAPSHOT.jar
[JENKINS] Archiving F:\hudson\hudson-slave\workspace\maven-plugins-windows\maven-ear-plugin\pom.xml
to /home/hudson/hudson/jobs/maven-plugins-windows/modules/org.apache.maven.plugins$maven-ear-plugin/builds/2013-05-09_00-20-35/archive/org.apache.maven.plugins/maven-ear-plugin/2.9-SNAPSHOT/maven-ear-plugin-2.9-SNAPSHOT.pom
[JENKINS] Archiving F:\hudson\hudson-slave\workspace\maven-plugins-windows\maven-ear-plugin\target\maven-ear-plugin-2.9-SNAPSHOT.jar
to /home/hudson/hudson/jobs/maven-plugins-windows/modules/org.apache.maven.plugins$maven-ear-plugin/builds/2013-05-09_00-20-35/archive/org.apache.maven.plugins/maven-ear-plugin/2.9-SNAPSHOT/maven-ear-plugin-2.9-SNAPSHOT.jar
[JENKINS] Archiving F:\hudson\hudson-slave\workspace\maven-plugins-windows\maven-changelog-plugin\pom.xml
to /home/hudson/hudson/jobs/maven-plugins-windows/modules/org.apache.maven.plugins$maven-changelog-plugin/builds/2013-05-09_00-20-35/archive/org.apache.maven.plugins/maven-changelog-plugin/2.3-SNAPSHOT/maven-changelog-plugin-2.3-SNAPSHOT.pom
[JENKINS] Archiving F:\hudson\hudson-slave\workspace\maven-plugins-windows\maven-changelog-plugin\target\maven-changelog-plugin-2.3-SNAPSHOT.jar
to /home/hudson/hudson/jobs/maven-plugins-windows/modules/org.apache.maven.plugins$maven-changelog-plugin/builds/2013-05-09_00-20-35/archive/org.apache.maven.plugins/maven-changelog-plugin/2.3-SNAPSHOT/maven-changelog-plugin-2.3-SNAPSHOT.jar
[JENKINS] Archiving F:\hudson\hudson-slave\workspace\maven-plugins-windows\maven-verifier-plugin\pom.xml
to /home/hudson/hudson/jobs/maven-plugins-windows/modules/org.apache.maven.plugins$maven-verifier-plugin/builds/2013-05-09_00-20-35/archive/org.apache.maven.plugins/maven-verifier-plugin/1.1-SNAPSHOT/maven-verifier-plugin-1.1-SNAPSHOT.pom
[JENKINS] Archiving F:\hudson\hudson-slave\workspace\maven-plugins-windows\maven-verifier-plugin\target\maven-verifier-plugin-1.1-SNAPSHOT.jar
to /home/hudson/hudson/jobs/maven-plugins-windows/modules/org.apache.maven.plugins$maven-verifier-plugin/builds/2013-05-09_00-20-35/archive/org.apache.maven.plugins/maven-verifier-plugin/1.1-SNAPSHOT/maven-verifier-plugin-1.1-SNAPSHOT.jar
[JENKINS] Archiving F:\hudson\hudson-slave\workspace\maven-plugins-windows\maven-ant-plugin\pom.xml
to /home/hudson/hudson/jobs/maven-plugins-windows/modules/org.apache.maven.plugins$maven-ant-plugin/builds/2013-05-09_00-20-35/archive/org.apache.maven.plugins/maven-ant-plugin/2.4-SNAPSHOT/maven-ant-plugin-2.4-SNAPSHOT.pom
[JENKINS] Archiving F:\hudson\hudson-slave\workspace\maven-plugins-windows\maven-ant-plugin\target\maven-ant-plugin-2.4-SNAPSHOT.jar
to /home/hudson/hudson/jobs/maven-plugins-windows/modules/org.apache.maven.plugins$maven-ant-plugin/builds/2013-05-09_00-20-35/archive/org.apache.maven.plugins/maven-ant-plugin/2.4-SNAPSHOT/maven-ant-plugin-2.4-SNAPSHOT.jar
[JENKINS] Archiving F:\hudson\hudson-slave\workspace\maven-plugins-windows\maven-ejb-plugin\pom.xml
to /home/hudson/hudson/jobs/maven-plugins-windows/modules/org.apache.maven.plugins$maven-ejb-plugin/builds/2013-05-09_00-20-35/archive/org.apache.maven.plugins/maven-ejb-plugin/2.4-SNAPSHOT/maven-ejb-plugin-2.4-SNAPSHOT.pom
[JENKINS] Archiving F:\hudson\hudson-slave\workspace\maven-plugins-windows\maven-ejb-plugin\target\maven-ejb-plugin-2.4-SNAPSHOT.jar
to /home/hudson/hudson/jobs/maven-plugins-windows/modules/org.apache.maven.plugins$maven-ejb-plugin/builds/2013-05-09_00-20-35/archive/org.apache.maven.plugins/maven-ejb-plugin/2.4-SNAPSHOT/maven-ejb-plugin-2.4-SNAPSHOT.jar
[JENKINS] Archiving F:\hudson\hudson-slave\workspace\maven-plugins-windows\maven-stage-plugin\pom.xml
to /home/hudson/hudson/jobs/maven-plugins-windows/modules/org.apache.maven.plugins$maven-stage-plugin/builds/2013-05-09_00-20-35/archive/org.apache.maven.plugins/maven-stage-plugin/1.0-SNAPSHOT/maven-stage-plugin-1.0-SNAPSHOT.pom
[JENKINS] Archiving F:\hudson\hudson-slave\workspace\maven-plugins-windows\maven-stage-plugin\target\maven-stage-plugin-1.0-SNAPSHOT.jar
to /home/hudson/hudson/jobs/maven-plugins-windows/modules/org.apache.maven.plugins$maven-stage-plugin/builds/2013-05-09_00-20-35/archive/org.apache.maven.plugins/maven-stage-plugin/1.0-SNAPSHOT/maven-stage-plugin-1.0-SNAPSHOT.jar
[JENKINS] Archiving F:\hudson\hudson-slave\workspace\maven-plugins-windows\maven-scm-publish-plugin\pom.xml
to /home/hudson/hudson/jobs/maven-plugins-windows/modules/org.apache.maven.plugins$maven-scm-publish-plugin/builds/2013-05-09_00-20-35/archive/org.apache.maven.plugins/maven-scm-publish-plugin/1.0-SNAPSHOT/maven-scm-publish-plugin-1.0-SNAPSHOT.pom
[JENKINS] Archiving F:\hudson\hudson-slave\workspace\maven-plugins-windows\maven-scm-publish-plugin\target\maven-scm-publish-plugin-1.0-SNAPSHOT.jar
to /home/hudson/hudson/jobs/maven-plugins-windows/modules/org.apache.maven.plugins$maven-scm-publish-plugin/builds/2013-05-09_00-20-35/archive/org.apache.maven.plugins/maven-scm-publish-plugin/1.0-SNAPSHOT/maven-scm-publish-plugin-1.0-SNAPSHOT.jar
[JENKINS] Archiving F:\hudson\hudson-slave\workspace\maven-plugins-windows\maven-compiler-plugin\pom.xml
to /home/hudson/hudson/jobs/maven-plugins-windows/modules/org.apache.maven.plugins$maven-compiler-plugin/builds/2013-05-09_00-20-35/archive/org.apache.maven.plugins/maven-compiler-plugin/3.2-SNAPSHOT/maven-compiler-plugin-3.2-SNAPSHOT.pom
[JENKINS] Archiving F:\hudson\hudson-slave\workspace\maven-plugins-windows\maven-compiler-plugin\target\maven-compiler-plugin-3.2-SNAPSHOT.jar
to /home/hudson/hudson/jobs/maven-plugins-windows/modules/org.apache.maven.plugins$maven-compiler-plugin/builds/2013-05-09_00-20-35/archive/org.apache.maven.plugins/maven-compiler-plugin/3.2-SNAPSHOT/maven-compiler-plugin-3.2-SNAPSHOT.jar
[JENKINS] Archiving F:\hudson\hudson-slave\workspace\maven-plugins-windows\maven-reactor-plugin\pom.xml
to /home/hudson/hudson/jobs/maven-plugins-windows/modules/org.apache.maven.plugins$maven-reactor-plugin/builds/2013-05-09_00-20-35/archive/org.apache.maven.plugins/maven-reactor-plugin/1.1-SNAPSHOT/maven-reactor-plugin-1.1-SNAPSHOT.pom
[JENKINS] Archiving F:\hudson\hudson-slave\workspace\maven-plugins-windows\maven-reactor-plugin\target\maven-reactor-plugin-1.1-SNAPSHOT.jar
to /home/hudson/hudson/jobs/maven-plugins-windows/modules/org.apache.maven.plugins$maven-reactor-plugin/builds/2013-05-09_00-20-35/archive/org.apache.maven.plugins/maven-reactor-plugin/1.1-SNAPSHOT/maven-reactor-plugin-1.1-SNAPSHOT.jar
[JENKINS] Archiving F:\hudson\hudson-slave\workspace\maven-plugins-windows\maven-doap-plugin\pom.xml
to /home/hudson/hudson/jobs/maven-plugins-windows/modules/org.apache.maven.plugins$maven-doap-plugin/builds/2013-05-09_00-20-35/archive/org.apache.maven.plugins/maven-doap-plugin/1.2-SNAPSHOT/maven-doap-plugin-1.2-SNAPSHOT.pom
[JENKINS] Archiving F:\hudson\hudson-slave\workspace\maven-plugins-windows\maven-doap-plugin\target\maven-doap-plugin-1.2-SNAPSHOT.jar
to /home/hudson/hudson/jobs/maven-plugins-windows/modules/org.apache.maven.plugins$maven-doap-plugin/builds/2013-05-09_00-20-35/archive/org.apache.maven.plugins/maven-doap-plugin/1.2-SNAPSHOT/maven-doap-plugin-1.2-SNAPSHOT.jar
[JENKINS] Archiving F:\hudson\hudson-slave\workspace\maven-plugins-windows\maven-checkstyle-plugin\pom.xml
to /home/hudson/hudson/jobs/maven-plugins-windows/modules/org.apache.maven.plugins$maven-checkstyle-plugin/builds/2013-05-09_00-20-35/archive/org.apache.maven.plugins/maven-checkstyle-plugin/2.11-SNAPSHOT/maven-checkstyle-plugin-2.11-SNAPSHOT.pom
[JENKINS] Archiving F:\hudson\hudson-slave\workspace\maven-plugins-windows\maven-checkstyle-plugin\target\maven-checkstyle-plugin-2.11-SNAPSHOT.jar
to /home/hudson/hudson/jobs/maven-plugins-windows/modules/org.apache.maven.plugins$maven-checkstyle-plugin/builds/2013-05-09_00-20-35/archive/org.apache.maven.plugins/maven-checkstyle-plugin/2.11-SNAPSHOT/maven-checkstyle-plugin-2.11-SNAPSHOT.jar
[JENKINS] Archiving F:\hudson\hudson-slave\workspace\maven-plugins-windows\maven-source-plugin\pom.xml
to /home/hudson/hudson/jobs/maven-plugins-windows/modules/org.apache.maven.plugins$maven-source-plugin/builds/2013-05-09_00-20-35/archive/org.apache.maven.plugins/maven-source-plugin/2.3-SNAPSHOT/maven-source-plugin-2.3-SNAPSHOT.pom
[JENKINS] Archiving F:\hudson\hudson-slave\workspace\maven-plugins-windows\maven-source-plugin\target\maven-source-plugin-2.3-SNAPSHOT.jar
to /home/hudson/hudson/jobs/maven-plugins-windows/modules/org.apache.maven.plugins$maven-source-plugin/builds/2013-05-09_00-20-35/archive/org.apache.maven.plugins/maven-source-plugin/2.3-SNAPSHOT/maven-source-plugin-2.3-SNAPSHOT.jar
[JENKINS] Archiving F:\hudson\hudson-slave\workspace\maven-plugins-windows\maven-dependency-plugin\pom.xml
to /home/hudson/hudson/jobs/maven-plugins-windows/modules/org.apache.maven.plugins$maven-dependency-plugin/builds/2013-05-09_00-20-35/archive/org.apache.maven.plugins/maven-dependency-plugin/2.8-SNAPSHOT/maven-dependency-plugin-2.8-SNAPSHOT.pom
[JENKINS] Archiving F:\hudson\hudson-slave\workspace\maven-plugins-windows\maven-javadoc-plugin\pom.xml
to /home/hudson/hudson/jobs/maven-plugins-windows/modules/org.apache.maven.plugins$maven-javadoc-plugin/builds/2013-05-09_00-20-35/archive/org.apache.maven.plugins/maven-javadoc-plugin/2.10-SNAPSHOT/maven-javadoc-plugin-2.10-SNAPSHOT.pom
[JENKINS] Archiving F:\hudson\hudson-slave\workspace\maven-plugins-windows\maven-javadoc-plugin\target\maven-javadoc-plugin-2.10-SNAPSHOT.jar
to /home/hudson/hudson/jobs/maven-plugins-windows/modules/org.apache.maven.plugins$maven-javadoc-plugin/builds/2013-05-09_00-20-35/archive/org.apache.maven.plugins/maven-javadoc-plugin/2.10-SNAPSHOT/maven-javadoc-plugin-2.10-SNAPSHOT.jar
[JENKINS] Archiving F:\hudson\hudson-slave\workspace\maven-plugins-windows\maven-deploy-plugin\pom.xml
to /home/hudson/hudson/jobs/maven-plugins-windows/modules/org.apache.maven.plugins$maven-deploy-plugin/builds/2013-05-09_00-20-35/archive/org.apache.maven.plugins/maven-deploy-plugin/2.8-SNAPSHOT/maven-deploy-plugin-2.8-SNAPSHOT.pom
[JENKINS] Archiving F:\hudson\hudson-slave\workspace\maven-plugins-windows\maven-deploy-plugin\target\maven-deploy-plugin-2.8-SNAPSHOT.jar
to /home/hudson/hudson/jobs/maven-plugins-windows/modules/org.apache.maven.plugins$maven-deploy-plugin/builds/2013-05-09_00-20-35/archive/org.apache.maven.plugins/maven-deploy-plugin/2.8-SNAPSHOT/maven-deploy-plugin-2.8-SNAPSHOT.jar
[JENKINS] Archiving F:\hudson\hudson-slave\workspace\maven-plugins-windows\maven-acr-plugin\pom.xml
to /home/hudson/hudson/jobs/maven-plugins-windows/modules/org.apache.maven.plugins$maven-acr-plugin/builds/2013-05-09_00-20-35/archive/org.apache.maven.plugins/maven-acr-plugin/1.0.1-SNAPSHOT/maven-acr-plugin-1.0.1-SNAPSHOT.pom
[JENKINS] Archiving F:\hudson\hudson-slave\workspace\maven-plugins-windows\maven-acr-plugin\target\maven-acr-plugin-1.0.1-SNAPSHOT.jar
to /home/hudson/hudson/jobs/maven-plugins-windows/modules/org.apache.maven.plugins$maven-acr-plugin/builds/2013-05-09_00-20-35/archive/org.apache.maven.plugins/maven-acr-plugin/1.0.1-SNAPSHOT/maven-acr-plugin-1.0.1-SNAPSHOT.jar
[JENKINS] Archiving F:\hudson\hudson-slave\workspace\maven-plugins-windows\maven-repository-plugin\pom.xml
to /home/hudson/hudson/jobs/maven-plugins-windows/modules/org.apache.maven.plugins$maven-repository-plugin/builds/2013-05-09_00-20-35/archive/org.apache.maven.plugins/maven-repository-plugin/2.3.2-SNAPSHOT/maven-repository-plugin-2.3.2-SNAPSHOT.pom
[JENKINS] Archiving F:\hudson\hudson-slave\workspace\maven-plugins-windows\maven-repository-plugin\target\maven-repository-plugin-2.3.2-SNAPSHOT.jar
to /home/hudson/hudson/jobs/maven-plugins-windows/modules/org.apache.maven.plugins$maven-repository-plugin/builds/2013-05-09_00-20-35/archive/org.apache.maven.plugins/maven-repository-plugin/2.3.2-SNAPSHOT/maven-repository-plugin-2.3.2-SNAPSHOT.jar
[JENKINS] Archiving F:\hudson\hudson-slave\workspace\maven-plugins-windows\maven-assembly-plugin\pom.xml
to /home/hudson/hudson/jobs/maven-plugins-windows/modules/org.apache.maven.plugins$maven-assembly-plugin/builds/2013-05-09_00-20-35/archive/org.apache.maven.plugins/maven-assembly-plugin/2.5-SNAPSHOT/maven-assembly-plugin-2.5-SNAPSHOT.pom
[JENKINS] Archiving F:\hudson\hudson-slave\workspace\maven-plugins-windows\maven-assembly-plugin\target\maven-assembly-plugin-2.5-SNAPSHOT.jar
to /home/hudson/hudson/jobs/maven-plugins-windows/modules/org.apache.maven.plugins$maven-assembly-plugin/builds/2013-05-09_00-20-35/archive/org.apache.maven.plugins/maven-assembly-plugin/2.5-SNAPSHOT/maven-assembly-plugin-2.5-SNAPSHOT.jar
[JENKINS] Archiving F:\hudson\hudson-slave\workspace\maven-plugins-windows\maven-project-info-reports-plugin\pom.xml
to /home/hudson/hudson/jobs/maven-plugins-windows/modules/org.apache.maven.plugins$maven-project-info-reports-plugin/builds/2013-05-09_00-20-35/archive/org.apache.maven.plugins/maven-project-info-reports-plugin/2.7-SNAPSHOT/maven-project-info-reports-plugin-2.7-SNAPSHOT.pom
[JENKINS] Archiving F:\hudson\hudson-slave\workspace\maven-plugins-windows\maven-project-info-reports-plugin\target\maven-project-info-reports-plugin-2.7-SNAPSHOT.jar
to /home/hudson/hudson/jobs/maven-plugins-windows/modules/org.apache.maven.plugins$maven-project-info-reports-plugin/builds/2013-05-09_00-20-35/archive/org.apache.maven.plugins/maven-project-info-reports-plugin/2.7-SNAPSHOT/maven-project-info-reports-plugin-2.7-SNAPSHOT.jar
[JENKINS] Archiving F:\hudson\hudson-slave\workspace\maven-plugins-windows\maven-one-plugin\pom.xml
to /home/hudson/hudson/jobs/maven-plugins-windows/modules/org.apache.maven.plugins$maven-one-plugin/builds/2013-05-09_00-20-35/archive/org.apache.maven.plugins/maven-one-plugin/1.3-SNAPSHOT/maven-one-plugin-1.3-SNAPSHOT.pom
[JENKINS] Archiving F:\hudson\hudson-slave\workspace\maven-plugins-windows\maven-one-plugin\target\maven-one-plugin-1.3-SNAPSHOT.jar
to /home/hudson/hudson/jobs/maven-plugins-windows/modules/org.apache.maven.plugins$maven-one-plugin/builds/2013-05-09_00-20-35/archive/org.apache.maven.plugins/maven-one-plugin/1.3-SNAPSHOT/maven-one-plugin-1.3-SNAPSHOT.jar
[JENKINS] Archiving F:\hudson\hudson-slave\workspace\maven-plugins-windows\maven-help-plugin\pom.xml
to /home/hudson/hudson/jobs/maven-plugins-windows/modules/org.apache.maven.plugins$maven-help-plugin/builds/2013-05-09_00-20-35/archive/org.apache.maven.plugins/maven-help-plugin/2.2.1-SNAPSHOT/maven-help-plugin-2.2.1-SNAPSHOT.pom
[JENKINS] Archiving F:\hudson\hudson-slave\workspace\maven-plugins-windows\maven-help-plugin\target\maven-help-plugin-2.2.1-SNAPSHOT.jar
to /home/hudson/hudson/jobs/maven-plugins-windows/modules/org.apache.maven.plugins$maven-help-plugin/builds/2013-05-09_00-20-35/archive/org.apache.maven.plugins/maven-help-plugin/2.2.1-SNAPSHOT/maven-help-plugin-2.2.1-SNAPSHOT.jar
[JENKINS] Archiving F:\hudson\hudson-slave\workspace\maven-plugins-windows\maven-invoker-plugin\pom.xml
to /home/hudson/hudson/jobs/maven-plugins-windows/modules/org.apache.maven.plugins$maven-invoker-plugin/builds/2013-05-09_00-20-35/archive/org.apache.maven.plugins/maven-invoker-plugin/1.9-SNAPSHOT/maven-invoker-plugin-1.9-SNAPSHOT.pom
[JENKINS] Archiving F:\hudson\hudson-slave\workspace\maven-plugins-windows\maven-invoker-plugin\target\maven-invoker-plugin-1.9-SNAPSHOT.jar
to /home/hudson/hudson/jobs/maven-plugins-windows/modules/org.apache.maven.plugins$maven-invoker-plugin/builds/2013-05-09_00-20-35/archive/org.apache.maven.plugins/maven-invoker-plugin/1.9-SNAPSHOT/maven-invoker-plugin-1.9-SNAPSHOT.jar
[JENKINS] Archiving F:\hudson\hudson-slave\workspace\maven-plugins-windows\maven-remote-resources-plugin\pom.xml
to /home/hudson/hudson/jobs/maven-plugins-windows/modules/org.apache.maven.plugins$maven-remote-resources-plugin/builds/2013-05-09_00-20-35/archive/org.apache.maven.plugins/maven-remote-resources-plugin/1.5-SNAPSHOT/maven-remote-resources-plugin-1.5-SNAPSHOT.pom
[JENKINS] Archiving F:\hudson\hudson-slave\workspace\maven-plugins-windows\maven-remote-resources-plugin\target\maven-remote-resources-plugin-1.5-SNAPSHOT.jar
to /home/hudson/hudson/jobs/maven-plugins-windows/modules/org.apache.maven.plugins$maven-remote-resources-plugin/builds/2013-05-09_00-20-35/archive/org.apache.maven.plugins/maven-remote-resources-plugin/1.5-SNAPSHOT/maven-remote-resources-plugin-1.5-SNAPSHOT.jar
[JENKINS] Archiving F:\hudson\hudson-slave\workspace\maven-plugins-windows\maven-pdf-plugin\pom.xml
to /home/hudson/hudson/jobs/maven-plugins-windows/modules/org.apache.maven.plugins$maven-pdf-plugin/builds/2013-05-09_00-20-35/archive/org.apache.maven.plugins/maven-pdf-plugin/1.3-SNAPSHOT/maven-pdf-plugin-1.3-SNAPSHOT.pom
[JENKINS] Archiving F:\hudson\hudson-slave\workspace\maven-plugins-windows\maven-pdf-plugin\target\maven-pdf-plugin-1.3-SNAPSHOT.jar
to /home/hudson/hudson/jobs/maven-plugins-windows/modules/org.apache.maven.plugins$maven-pdf-plugin/builds/2013-05-09_00-20-35/archive/org.apache.maven.plugins/maven-pdf-plugin/1.3-SNAPSHOT/maven-pdf-plugin-1.3-SNAPSHOT.jar
[JENKINS] Archiving F:\hudson\hudson-slave\workspace\maven-plugins-windows\maven-shade-plugin\pom.xml
to /home/hudson/hudson/jobs/maven-plugins-windows/modules/org.apache.maven.plugins$maven-shade-plugin/builds/2013-05-09_00-20-35/archive/org.apache.maven.plugins/maven-shade-plugin/3.0-SNAPSHOT/maven-shade-plugin-3.0-SNAPSHOT.pom
[JENKINS] Archiving F:\hudson\hudson-slave\workspace\maven-plugins-windows\maven-shade-plugin\target\maven-shade-plugin-3.0-SNAPSHOT.jar
to /home/hudson/hudson/jobs/maven-plugins-windows/modules/org.apache.maven.plugins$maven-shade-plugin/builds/2013-05-09_00-20-35/archive/org.apache.maven.plugins/maven-shade-plugin/3.0-SNAPSHOT/maven-shade-plugin-3.0-SNAPSHOT.jar
[JENKINS] Archiving F:\hudson\hudson-slave\workspace\maven-plugins-windows\maven-plugins\pom.xml
to /home/hudson/hudson/jobs/maven-plugins-windows/modules/org.apache.maven.plugins$maven-plugins/builds/2013-05-09_00-20-35/archive/org.apache.maven.plugins/maven-plugins/25-SNAPSHOT/maven-plugins-25-SNAPSHOT.pom
[JENKINS] Archiving F:\hudson\hudson-slave\workspace\maven-plugins-windows\maven-plugins\target\maven-plugins-25-SNAPSHOT-site.xml
to /home/hudson/hudson/jobs/maven-plugins-windows/modules/org.apache.maven.plugins$maven-plugins/builds/2013-05-09_00-20-35/archive/org.apache.maven.plugins/maven-plugins/25-SNAPSHOT/maven-plugins-25-SNAPSHOT-site.xml
Downloading: http://repository.apache.org/snapshots/org/apache/maven/maven-parent/24-SNAPSHOT/maven-metadata.xml
Downloaded: http://repository.apache.org/snapshots/org/apache/maven/maven-parent/24-SNAPSHOT/maven-metadata.xml
(807 B at 7.1 KB/sec)
[JENKINS] Archiving F:\hudson\hudson-slave\workspace\maven-plugins-windows\maven-linkcheck-plugin\pom.xml
to /home/hudson/hudson/jobs/maven-plugins-windows/modules/org.apache.maven.plugins$maven-linkcheck-plugin/builds/2013-05-09_00-20-35/archive/org.apache.maven.plugins/maven-linkcheck-plugin/1.2-SNAPSHOT/maven-linkcheck-plugin-1.2-SNAPSHOT.pom
[JENKINS] Archiving F:\hudson\hudson-slave\workspace\maven-plugins-windows\maven-linkcheck-plugin\target\maven-linkcheck-plugin-1.2-SNAPSHOT.jar
to /home/hudson/hudson/jobs/maven-plugins-windows/modules/org.apache.maven.plugins$maven-linkcheck-plugin/builds/2013-05-09_00-20-35/archive/org.apache.maven.plugins/maven-linkcheck-plugin/1.2-SNAPSHOT/maven-linkcheck-plugin-1.2-SNAPSHOT.jar
[JENKINS] Archiving F:\hudson\hudson-slave\workspace\maven-plugins-windows\maven-resources-plugin\pom.xml
to /home/hudson/hudson/jobs/maven-plugins-windows/modules/org.apache.maven.plugins$maven-resources-plugin/builds/2013-05-09_00-20-35/archive/org.apache.maven.plugins/maven-resources-plugin/2.7-SNAPSHOT/maven-resources-plugin-2.7-SNAPSHOT.pom
[JENKINS] Archiving F:\hudson\hudson-slave\workspace\maven-plugins-windows\maven-resources-plugin\target\maven-resources-plugin-2.7-SNAPSHOT.jar
to /home/hudson/hudson/jobs/maven-plugins-windows/modules/org.apache.maven.plugins$maven-resources-plugin/builds/2013-05-09_00-20-35/archive/org.apache.maven.plugins/maven-resources-plugin/2.7-SNAPSHOT/maven-resources-plugin-2.7-SNAPSHOT.jar
Waiting for Jenkins to finish collecting data
mavenExecutionResult exceptions not empty
message : Failed to execute goal org.apache.maven.plugins:maven-surefire-plugin:2.12.2:test
(default-test) on project maven-dependency-plugin: Execution default-test of goal org.apache.maven.plugins:maven-surefire-plugin:2.12.2:test
failed: The forked VM terminated without saying properly goodbye. VM crash or System.exit
called ?
cause : Execution default-test of goal org.apache.maven.plugins:maven-surefire-plugin:2.12.2:test
failed: The forked VM terminated without saying properly goodbye. VM crash or System.exit
called ?
Stack trace : 
org.apache.maven.lifecycle.LifecycleExecutionException: Failed to execute goal org.apache.maven.plugins:maven-surefire-plugin:2.12.2:test
(default-test) on project maven-dependency-plugin: Execution default-test of goal org.apache.maven.plugins:maven-surefire-plugin:2.12.2:test
failed: The forked VM terminated without saying properly goodbye. VM crash or System.exit
called ?
	at org.apache.maven.lifecycle.internal.MojoExecutor.execute(MojoExecutor.java:225)
	at org.apache.maven.lifecycle.internal.MojoExecutor.execute(MojoExecutor.java:153)
	at org.apache.maven.lifecycle.internal.MojoExecutor.execute(MojoExecutor.java:145)
	at org.apache.maven.lifecycle.internal.LifecycleModuleBuilder.buildProject(LifecycleModuleBuilder.java:84)
	at org.apache.maven.lifecycle.internal.LifecycleThreadedBuilder$1.call(LifecycleThreadedBuilder.java:167)
	at org.apache.maven.lifecycle.internal.LifecycleThreadedBuilder$1.call(LifecycleThreadedBuilder.java:164)
	at java.util.concurrent.FutureTask$Sync.innerRun(FutureTask.java:269)
	at java.util.concurrent.FutureTask.run(FutureTask.java:123)
	at java.util.concurrent.ThreadPoolExecutor$Worker.runTask(ThreadPoolExecutor.java:651)
	at java.util.concurrent.ThreadPoolExecutor$Worker.run(ThreadPoolExecutor.java:676)
	at java.lang.Thread.run(Thread.java:595)
Caused by: org.apache.maven.plugin.PluginExecutionException: Execution default-test of goal
org.apache.maven.plugins:maven-surefire-plugin:2.12.2:test failed: The forked VM terminated
without saying properly goodbye. VM crash or System.exit called ?
	at org.apache.maven.plugin.DefaultBuildPluginManager.executeMojo(DefaultBuildPluginManager.java:116)
	at org.apache.maven.lifecycle.internal.MojoExecutor.execute(MojoExecutor.java:209)
	... 10 more
Caused by: java.lang.RuntimeException: The forked VM terminated without saying properly goodbye.
VM crash or System.exit called ?
	at org.apache.maven.plugin.surefire.booterclient.output.ForkClient.close(ForkClient.java:245)
	at org.apache.maven.plugin.surefire.booterclient.ForkStarter.fork(ForkStarter.java:282)
	at org.apache.maven.plugin.surefire.booterclient.ForkStarter.run(ForkStarter.java:116)
	at org.apache.maven.plugin.surefire.AbstractSurefireMojo.executeProvider(AbstractSurefireMojo.java:695)
	at org.apache.maven.plugin.surefire.AbstractSurefireMojo.executeAllProviders(AbstractSurefireMojo.java:666)
	at org.apache.maven.plugin.surefire.AbstractSurefireMojo.executeAfterPreconditionsChecked(AbstractSurefireMojo.java:624)
	at org.apache.maven.plugin.surefire.AbstractSurefireMojo.execute(AbstractSurefireMojo.java:587)
	at org.apache.maven.plugin.DefaultBuildPluginManager.executeMojo(DefaultBuildPluginManager.java:107)
	... 11 more
Maven failed with error.
Sending e-mails to: notifications@maven.apache.org
channel stopped
[WARNINGS] Skipping publisher since build result is FAILURE

Mime
View raw message