maven-notifications mailing list archives

Site index · List index
Message view « Date » · « Thread »
Top « Date » · « Thread »
From Apache Jenkins Server <jenk...@builds.apache.org>
Subject Build failed in Jenkins: core-it-maven-3-win #360
Date Sat, 30 Mar 2013 15:06:19 GMT
See <https://builds.apache.org/job/core-it-maven-3-win/360/changes>

Changes:

[jason] [maven-release-plugin] prepare release maven-3.1.0

[jason] [maven-release-plugin] prepare for next development iteration

[jason] o revert release plugin commits

[jason] [maven-release-plugin] prepare release maven-3.1.0-alpha-1

[jason] [maven-release-plugin] prepare for next development iteration

------------------------------------------
[...truncated 5867 lines...]
[INFO] --- maven-compiler-plugin:2.5.1:testCompile (default-testCompile) @ core-it-wagon ---
[INFO] No sources to compile
[INFO] 
[INFO] --- maven-surefire-plugin:2.13:test (default-test) @ core-it-wagon ---
[INFO] 
[INFO] --- maven-jar-plugin:2.4:jar (default-jar) @ core-it-wagon ---
[INFO] Building jar: F:\ws\m3-its\core-integration-testing-trunk\core-it-support\core-it-wagon\target\core-it-wagon-2.1-SNAPSHOT.jar
[INFO] 
[INFO] --- maven-site-plugin:3.1:attach-descriptor (attach-descriptor) @ core-it-wagon ---
[INFO] 
[INFO] --- maven-install-plugin:2.3.1:install (default-install) @ core-it-wagon ---
[INFO] Installing F:\ws\m3-its\core-integration-testing-trunk\core-it-support\core-it-wagon\target\core-it-wagon-2.1-SNAPSHOT.jar
to <https://builds.apache.org/job/core-it-maven-3-win/ws/wsm3-its\m3-its\it-local-repo\org\apache\maven\its\core-it-wagon\2.1-SNAPSHOT\core-it-wagon-2.1-SNAPSHOT.jar>
[INFO] Installing F:\ws\m3-its\core-integration-testing-trunk\core-it-support\core-it-wagon\pom.xml
to <https://builds.apache.org/job/core-it-maven-3-win/ws/wsm3-its\m3-its\it-local-repo\org\apache\maven\its\core-it-wagon\2.1-SNAPSHOT\core-it-wagon-2.1-SNAPSHOT.pom>
[INFO]                                                                         
[INFO] ------------------------------------------------------------------------
[INFO] Building Maven IT Support Artifacts 2.1-SNAPSHOT
[INFO] ------------------------------------------------------------------------
[INFO] 
[INFO] --- maven-clean-plugin:2.5:clean (default-clean) @ core-it-support-artifacts ---
[INFO] Deleting F:\ws\m3-its\core-integration-testing-trunk\core-it-support\core-it-support-artifacts\target
[INFO] 
[INFO] --- maven-remote-resources-plugin:1.3:process (default) @ core-it-support-artifacts
---
[INFO] 
[INFO] --- maven-site-plugin:3.1:attach-descriptor (attach-descriptor) @ core-it-support-artifacts
---
[INFO] 
[INFO] --- maven-assembly-plugin:2.1:single (default) @ core-it-support-artifacts ---
[INFO] Building zip: F:\ws\m3-its\core-integration-testing-trunk\core-it-support\core-it-support-artifacts\target\core-it-support-artifacts-2.1-SNAPSHOT-repo.zip
[INFO] 
[INFO] --- maven-install-plugin:2.3.1:install (default-install) @ core-it-support-artifacts
---
[INFO] Installing F:\ws\m3-its\core-integration-testing-trunk\core-it-support\core-it-support-artifacts\pom.xml
to <https://builds.apache.org/job/core-it-maven-3-win/ws/wsm3-its\m3-its\it-local-repo\org\apache\maven\its\core-it-support-artifacts\2.1-SNAPSHOT\core-it-support-artifacts-2.1-SNAPSHOT.pom>
[INFO] Installing F:\ws\m3-its\core-integration-testing-trunk\core-it-support\core-it-support-artifacts\target\core-it-support-artifacts-2.1-SNAPSHOT-repo.zip
to <https://builds.apache.org/job/core-it-maven-3-win/ws/wsm3-its\m3-its\it-local-repo\org\apache\maven\its\core-it-support-artifacts\2.1-SNAPSHOT\core-it-support-artifacts-2.1-SNAPSHOT-repo.zip>
[INFO]                                                                         
[INFO] ------------------------------------------------------------------------
[INFO] Building Maven IT Extension 2.1-SNAPSHOT
[INFO] ------------------------------------------------------------------------
[INFO] 
[INFO] --- maven-clean-plugin:2.5:clean (default-clean) @ core-it-extension ---
[INFO] Deleting F:\ws\m3-its\core-integration-testing-trunk\core-it-support\core-it-extension\target
[INFO] 
[INFO] --- maven-remote-resources-plugin:1.3:process (default) @ core-it-extension ---
[INFO] 
[INFO] --- maven-resources-plugin:2.5:resources (default-resources) @ core-it-extension ---
[debug] execute contextualize
[INFO] Using 'UTF-8' encoding to copy filtered resources.
[INFO] Copying 1 resource
[INFO] Copying 3 resources
[INFO] 
[INFO] --- maven-compiler-plugin:2.5.1:compile (default-compile) @ core-it-extension ---
[INFO] No sources to compile
[INFO] 
[INFO] --- maven-resources-plugin:2.5:testResources (default-testResources) @ core-it-extension
---
[debug] execute contextualize
[INFO] Using 'UTF-8' encoding to copy filtered resources.
[INFO] skip non existing resourceDirectory F:\ws\m3-its\core-integration-testing-trunk\core-it-support\core-it-extension\src\test\resources
[INFO] Copying 3 resources
[INFO] 
[INFO] --- maven-compiler-plugin:2.5.1:testCompile (default-testCompile) @ core-it-extension
---
[INFO] No sources to compile
[INFO] 
[INFO] --- maven-surefire-plugin:2.13:test (default-test) @ core-it-extension ---
[INFO] 
[INFO] --- maven-jar-plugin:2.4:jar (default-jar) @ core-it-extension ---
[INFO] Building jar: F:\ws\m3-its\core-integration-testing-trunk\core-it-support\core-it-extension\target\core-it-extension-2.1-SNAPSHOT.jar
[INFO] 
[INFO] --- maven-site-plugin:3.1:attach-descriptor (attach-descriptor) @ core-it-extension
---
[INFO] 
[INFO] --- maven-install-plugin:2.3.1:install (default-install) @ core-it-extension ---
[INFO] Installing F:\ws\m3-its\core-integration-testing-trunk\core-it-support\core-it-extension\target\core-it-extension-2.1-SNAPSHOT.jar
to <https://builds.apache.org/job/core-it-maven-3-win/ws/wsm3-its\m3-its\it-local-repo\org\apache\maven\its\core-it-extension\2.1-SNAPSHOT\core-it-extension-2.1-SNAPSHOT.jar>
[INFO] Installing F:\ws\m3-its\core-integration-testing-trunk\core-it-support\core-it-extension\pom.xml
to <https://builds.apache.org/job/core-it-maven-3-win/ws/wsm3-its\m3-its\it-local-repo\org\apache\maven\its\core-it-extension\2.1-SNAPSHOT\core-it-extension-2.1-SNAPSHOT.pom>
[INFO]                                                                         
[INFO] ------------------------------------------------------------------------
[INFO] Building Maven ITs 2.1-SNAPSHOT
[INFO] ------------------------------------------------------------------------
[INFO] 
[INFO] --- maven-clean-plugin:2.5:clean (default-clean) @ core-it-suite ---
[INFO] Deleting F:\ws\m3-its\core-integration-testing-trunk\core-it-suite\target
[INFO] 
[INFO] --- maven-remote-resources-plugin:1.3:process (default) @ core-it-suite ---
[INFO] 
[INFO] --- maven-resources-plugin:2.5:resources (default-resources) @ core-it-suite ---
[debug] execute contextualize
[INFO] Using 'UTF-8' encoding to copy filtered resources.
[INFO] skip non existing resourceDirectory F:\ws\m3-its\core-integration-testing-trunk\core-it-suite\src\main\resources
[INFO] Copying 3 resources
[INFO] 
[INFO] --- maven-compiler-plugin:2.5.1:compile (default-compile) @ core-it-suite ---
[INFO] No sources to compile
[INFO] 
[INFO] --- maven-resources-plugin:2.5:testResources (default-testResources) @ core-it-suite
---
[debug] execute contextualize
[INFO] Using 'UTF-8' encoding to copy filtered resources.
[INFO] Copying 2737 resources
[INFO] Copying 2 resources
[INFO] Copying 3 resources
[INFO] 
[INFO] --- maven-compiler-plugin:2.5.1:testCompile (default-testCompile) @ core-it-suite ---
[INFO] Compiling 572 source files to F:\ws\m3-its\core-integration-testing-trunk\core-it-suite\target\test-classes
[INFO] 
[INFO] --- maven-surefire-plugin:2.13:test (default-test) @ core-it-suite ---
[WARNING] useSystemClassloader setting has no effect when not forking
[INFO] Surefire report directory: F:\ws\m3-its\core-integration-testing-trunk\core-it-suite\target\surefire-reports

-------------------------------------------------------
 T E S T S
-------------------------------------------------------
Running org.apache.maven.it.IntegrationTestSuite
Tests run: 1, Failures: 0, Errors: 1, Skipped: 0, Time elapsed: 0.095 sec <<< FAILURE!
initializationError(org.apache.maven.it.IntegrationTestSuite)  Time elapsed: 0.003 sec  <<<
ERROR!
org.apache.maven.it.VerificationException: Illegal maven output: String 'Maven version: '
not found in the following output:
The system cannot find the path specified.
	at org.apache.maven.it.Verifier.getMavenVersion(Verifier.java:1445)
	at org.apache.maven.it.IntegrationTestSuite.suite(IntegrationTestSuite.java:54)


Results :

Tests in error: 
  IntegrationTestSuite.suite:54 ยป Verification Illegal maven output: String 'Mav...

Tests run: 1, Failures: 0, Errors: 1, Skipped: 0

[INFO] ------------------------------------------------------------------------
[INFO] Reactor Summary:
[INFO] 
[INFO] Maven Core ITs .................................... SUCCESS [6.056s]
[INFO] Maven IT Support .................................. SUCCESS [0.079s]
[INFO] Maven IT :: Plugins ............................... SUCCESS [0.089s]
[INFO] Maven IT Plugin :: Active Collection .............. SUCCESS [5.762s]
[INFO] Maven IT Plugin :: Ant-Based ...................... SUCCESS [1.809s]
[INFO] Maven IT Plugin :: Artifact ....................... SUCCESS [1.046s]
[INFO] Maven IT Plugin :: Class Loader :: Dependency A ... SUCCESS [0.240s]
[INFO] Maven IT Plugin :: Class Loader :: Dependency B ... SUCCESS [0.236s]
[INFO] Maven IT Plugin :: Class Loader :: Dependency C ... SUCCESS [0.157s]
[INFO] Maven IT Plugin :: Class Loader ................... SUCCESS [1.902s]
[INFO] Maven IT Plugin :: Class Loader :: Aggregator ..... SUCCESS [0.032s]
[INFO] Maven IT Plugin :: Configuration .................. SUCCESS [0.488s]
[INFO] Maven IT Plugin :: Context Passing ................ SUCCESS [0.265s]
[INFO] Maven ITs :: Core Plugin Stubs .................... SUCCESS [0.290s]
[INFO] Maven IT Clean Plugin Stub ........................ SUCCESS [0.274s]
[INFO] Maven IT Compiler Plugin Stub ..................... SUCCESS [0.298s]
[INFO] Maven IT Deploy Plugin Stub ....................... SUCCESS [0.411s]
[INFO] Maven IT EAR Plugin Stub .......................... SUCCESS [0.305s]
[INFO] Maven IT EJB Plugin Stub .......................... SUCCESS [0.222s]
[INFO] Maven IT Install Plugin Stub ...................... SUCCESS [0.242s]
[INFO] Maven IT JAR Plugin Stub .......................... SUCCESS [0.293s]
[INFO] Maven IT Javadoc Plugin Stub ...................... SUCCESS [0.204s]
[INFO] Maven IT Plugin Plugin Stub ....................... SUCCESS [0.267s]
[INFO] Maven IT RAR Plugin Stub .......................... SUCCESS [0.216s]
[INFO] Maven IT Resources Plugin Stub .................... SUCCESS [0.333s]
[INFO] Maven IT Site Plugin Stub ......................... SUCCESS [0.255s]
[INFO] Maven IT Source Plugin Stub ....................... SUCCESS [0.220s]
[INFO] Maven IT Surefire Plugin Stub ..................... SUCCESS [0.241s]
[INFO] Maven IT WAR Plugin Stub .......................... SUCCESS [0.298s]
[INFO] Maven IT Plugin :: Dependency Collection .......... SUCCESS [1.228s]
[INFO] Maven IT Plugin :: Dependency Resolution .......... SUCCESS [1.891s]
[INFO] Maven IT Plugin :: Expression ..................... SUCCESS [0.638s]
[INFO] Maven IT Plugin :: Error Mojos .................... SUCCESS [0.899s]
[INFO] Maven IT Component ................................ SUCCESS [0.154s]
[INFO] Maven IT Plugin :: Extension Consumer ............. SUCCESS [0.171s]
[INFO] Maven IT Plugin :: Extension Provider ............. SUCCESS [0.208s]
[INFO] Maven IT Plugin :: Fork ........................... SUCCESS [0.355s]
[INFO] Maven IT Plugin :: Invalid Descriptor ............. SUCCESS [0.167s]
[INFO] Maven IT Plugin :: Log File ....................... SUCCESS [0.283s]
[INFO] Maven IT Helper Library ........................... SUCCESS [0.969s]
[INFO] Maven IT Plugin :: Model Interpolation ............ SUCCESS [0.359s]
[INFO] Maven IT Plugin :: No Default Component ........... SUCCESS [0.291s]
[INFO] Maven IT Plugin :: No Project ..................... SUCCESS [0.146s]
[INFO] Maven IT Plugin :: Online ......................... SUCCESS [0.195s]
[INFO] Maven IT Plugin :: Optional Mojos ................. SUCCESS [0.261s]
[INFO] Maven IT Plugin :: Packaging ...................... SUCCESS [0.217s]
[INFO] Maven IT Plugin :: Parameter Implementation ....... SUCCESS [0.216s]
[INFO] Maven IT Plugin :: Plugin Dependency .............. SUCCESS [0.213s]
[INFO] Maven IT Plugin :: Project ........................ SUCCESS [0.456s]
[INFO] Maven IT Plugin :: Project Interpolation .......... SUCCESS [0.300s]
[INFO] Maven IT Plugin :: Setter ......................... SUCCESS [0.182s]
[INFO] Maven IT Plugin :: Singleton Component ............ SUCCESS [0.234s]
[INFO] Maven IT Plugin :: Site ........................... SUCCESS [0.391s]
[INFO] Maven IT Plugin :: Toolchain ...................... SUCCESS [1.403s]
[INFO] Maven IT Plugin :: Touch .......................... SUCCESS [0.415s]
[INFO] Maven IT Plugin :: Uses Properties Plugin ......... SUCCESS [0.194s]
[INFO] Maven IT Plugin :: Uses Wagon Plugin .............. SUCCESS [0.683s]
[INFO] Maven IT Plugin :: This plugin should contain the mojos needed by all tests.  SUCCESS
[0.197s]
[INFO] Maven IT Plugin :: Plexus Utils 1.1 ............... SUCCESS [0.364s]
[INFO] Maven IT Plugin :: Plexus Utils New ............... SUCCESS [0.245s]
[INFO] Maven IT Plugin :: Plexus Component API ........... SUCCESS [0.523s]
[INFO] Maven IT Plugin :: Log4J Client ................... SUCCESS [0.276s]
[INFO] Maven IT Plugin :: Extension 1 .................... SUCCESS [0.175s]
[INFO] Maven IT Plugin :: Extension 2 .................... SUCCESS [0.276s]
[INFO] Maven IT Plugin :: Plexus Lifecycle ............... SUCCESS [0.977s]
[INFO] Maven IT Plugin :: Settings ....................... SUCCESS [0.250s]
[INFO] Maven IT Toolchain ................................ SUCCESS [0.359s]
[INFO] Maven IT Wagon .................................... SUCCESS [0.263s]
[INFO] Maven IT Support Artifacts ........................ SUCCESS [0.507s]
[INFO] Maven IT Extension ................................ SUCCESS [0.169s]
[INFO] Maven ITs ......................................... FAILURE [45.382s]
[INFO] ------------------------------------------------------------------------
[INFO] BUILD FAILURE
[INFO] ------------------------------------------------------------------------
[INFO] Total time: 1:27.880s
[INFO] Finished at: Sat Mar 30 15:06:15 GMT 2013
[INFO] Final Memory: 37M/729M
[INFO] ------------------------------------------------------------------------
[ERROR] Failed to execute goal org.apache.maven.plugins:maven-surefire-plugin:2.13:test (default-test)
on project core-it-suite: There are test failures.
[ERROR] 
[ERROR] Please refer to F:\ws\m3-its\core-integration-testing-trunk\core-it-suite\target\surefire-reports
for the individual test results.
[ERROR] -> [Help 1]
org.apache.maven.lifecycle.LifecycleExecutionException: Failed to execute goal org.apache.maven.plugins:maven-surefire-plugin:2.13:test
(default-test) on project core-it-suite: There are test failures.

Please refer to F:\ws\m3-its\core-integration-testing-trunk\core-it-suite\target\surefire-reports
for the individual test results.
	at org.apache.maven.lifecycle.internal.MojoExecutor.execute(MojoExecutor.java:213)
	at org.apache.maven.lifecycle.internal.MojoExecutor.execute(MojoExecutor.java:153)
	at org.apache.maven.lifecycle.internal.MojoExecutor.execute(MojoExecutor.java:145)
	at org.apache.maven.lifecycle.internal.LifecycleModuleBuilder.buildProject(LifecycleModuleBuilder.java:84)
	at org.apache.maven.lifecycle.internal.LifecycleModuleBuilder.buildProject(LifecycleModuleBuilder.java:59)
	at org.apache.maven.lifecycle.internal.LifecycleStarter.singleThreadedBuild(LifecycleStarter.java:183)
	at org.apache.maven.lifecycle.internal.LifecycleStarter.execute(LifecycleStarter.java:161)
	at org.apache.maven.DefaultMaven.doExecute(DefaultMaven.java:320)
	at org.apache.maven.DefaultMaven.execute(DefaultMaven.java:156)
	at org.apache.maven.cli.MavenCli.execute(MavenCli.java:537)
	at org.apache.maven.cli.MavenCli.doMain(MavenCli.java:196)
	at org.apache.maven.cli.MavenCli.main(MavenCli.java:141)
	at sun.reflect.NativeMethodAccessorImpl.invoke0(Native Method)
	at sun.reflect.NativeMethodAccessorImpl.invoke(NativeMethodAccessorImpl.java:39)
	at sun.reflect.DelegatingMethodAccessorImpl.invoke(DelegatingMethodAccessorImpl.java:25)
	at java.lang.reflect.Method.invoke(Method.java:597)
	at org.codehaus.plexus.classworlds.launcher.Launcher.launchEnhanced(Launcher.java:290)
	at org.codehaus.plexus.classworlds.launcher.Launcher.launch(Launcher.java:230)
	at org.codehaus.plexus.classworlds.launcher.Launcher.mainWithExitCode(Launcher.java:409)
	at org.codehaus.plexus.classworlds.launcher.Launcher.main(Launcher.java:352)
Caused by: org.apache.maven.plugin.MojoFailureException: There are test failures.

Please refer to F:\ws\m3-its\core-integration-testing-trunk\core-it-suite\target\surefire-reports
for the individual test results.
	at org.apache.maven.plugin.surefire.SurefireHelper.reportExecution(SurefireHelper.java:82)
	at org.apache.maven.plugin.surefire.SurefirePlugin.handleSummary(SurefirePlugin.java:151)
	at org.apache.maven.plugin.surefire.AbstractSurefireMojo.executeAfterPreconditionsChecked(AbstractSurefireMojo.java:721)
	at org.apache.maven.plugin.surefire.AbstractSurefireMojo.execute(AbstractSurefireMojo.java:620)
	at org.apache.maven.plugin.DefaultBuildPluginManager.executeMojo(DefaultBuildPluginManager.java:101)
	at org.apache.maven.lifecycle.internal.MojoExecutor.execute(MojoExecutor.java:209)
	... 19 more
[ERROR] 
[ERROR] Re-run Maven using the -X switch to enable full debug logging.
[ERROR] 
[ERROR] For more information about the errors and possible solutions, please read the following
articles:
[ERROR] [Help 1] http://cwiki.apache.org/confluence/display/MAVEN/MojoFailureException
[ERROR] 
[ERROR] After correcting the problems, you can resume the build with the command
[ERROR]   mvn <goals> -rf :core-it-suite
Build step 'Invoke top-level Maven targets' marked build as failure
Recording test results

Mime
View raw message