maven-notifications mailing list archives

Site index · List index
Message view « Date » · « Thread »
Top « Date » · « Thread »
From Apache Jenkins Server <jenk...@builds.apache.org>
Subject Build failed in Jenkins: maven-plugins-ITs-m3 #933
Date Mon, 04 Mar 2013 16:26:50 GMT
See <https://builds.apache.org/job/maven-plugins-ITs-m3/933/>

------------------------------------------
[...truncated 10975 lines...]
Script1.groovy: 23: unable to resolve class groovy.xml.Namespace 
 @ line 23, column 10.
   def ns = new groovy.xml.Namespace("http://maven.apache.org/POM/4.0.0") 
            ^

Script1.groovy: 24: unable to resolve class XmlParser 
 @ line 24, column 11.
   def pom = new XmlParser().parse( pomFile )
             ^

2 errors

[INFO] Building: dep-reduced-pom-with-local-parent/pom.xml
[INFO] ..SUCCESS (2.5 s)
[INFO] Building: mshade-123/pom.xml
[INFO] ..SUCCESS (4.3 s)
[INFO] Building: finalNameBuild/pom.xml
[INFO] run script setup.bsh
[INFO] run script verify.bsh
[INFO] ..SUCCESS (3.0 s)
[INFO] Building: empty-relocation-pattern/pom.xml
[INFO] ..SUCCESS (2.9 s)
[INFO] Building: non-runtime-scope-excluded/pom.xml
[INFO] run script verify.bsh
[INFO] ..SUCCESS (2.8 s)
[INFO] Building: attach-after-lifecycle-fork/pom.xml
[INFO] run script setup.bsh
[INFO] run script verify.bsh
[INFO] ..SUCCESS (2.5 s)
[INFO] Building: empty-relocation-shaded-pattern/pom.xml
[INFO] ..SUCCESS (3.1 s)
[INFO] Building: MSHADE-105/pom.xml
[INFO] run script verify.bsh
[INFO] ..SUCCESS (5.2 s)
[INFO] Building: rerun-without-reloc/pom.xml
[INFO] ..SUCCESS (3.0 s)
[INFO] Building: users-shader-impl/pom.xml
[INFO] run script verify.groovy
[INFO] ..SUCCESS (3.4 s)
[INFO] Building: finalNameBuild-attached/pom.xml
[INFO] run script setup.bsh
[INFO] run script verify.bsh
[INFO] ..SUCCESS (3.0 s)
[INFO] Building: reloc-enum-ref-from-anno/pom.xml
[INFO] ..SUCCESS (2.9 s)
[INFO] Building: xml-transformer-ignores-dtd/pom.xml
[INFO] run script verify.bsh
[INFO] ..SUCCESS (2.9 s)
[INFO] Building: empty-apache-notice-transform/pom.xml
[INFO] ..SUCCESS (3.5 s)
[INFO] Building: duplicate-classes-without-reloc/pom.xml
[INFO] ..SUCCESS (2.4 s)
[INFO] Building: component-descriptor-relocation/pom.xml
[INFO] ..SUCCESS (3.7 s)
[INFO] Building: manifest-transformed/pom.xml
[INFO] run script verify.bsh
[INFO] ..SUCCESS (3.8 s)
[INFO] Building: mini-jar-malformed-dependencies/pom.xml
[INFO] ..SUCCESS (5.6 s)
[INFO] Building: finalNameShade/pom.xml
[INFO] run script setup.bsh
[INFO] run script verify.bsh
[INFO] ..SUCCESS (2.9 s)
[INFO] Building: dep-reduced-pom-relocated-result/pom.xml
[INFO] ..SUCCESS (2.3 s)
[INFO] Building: reloc-abs-resource-path/pom.xml
[INFO] ..SUCCESS (4.4 s)
[INFO] Building: pom-packaging/pom.xml
[INFO] run script verify.bsh
[INFO] ..SUCCESS (2.2 s)
[INFO] Building: artifact-includes-excludes/pom.xml
[INFO] run script verify.bsh
[INFO] ..SUCCESS (3.1 s)
[INFO] Building: mini-jar-respect-includes/pom.xml
[INFO] run script verify.bsh
[INFO] ..SUCCESS (3.6 s)
[INFO] Building: dep-reduced-pom-unique/pom.xml
[INFO] run script verify.groovy
[INFO] ..FAILED (3.9 s)
[INFO]   The post-build script did not succeed. startup failed:
Script1.groovy: 27: unable to resolve class groovy.xml.Namespace 
 @ line 27, column 10.
   def ns = new groovy.xml.Namespace("http://maven.apache.org/POM/4.0.0") 
            ^

Script1.groovy: 28: unable to resolve class XmlParser 
 @ line 28, column 11.
   def pom = new XmlParser().parse( pomFile )
             ^

2 errors

[INFO] Building: services-resource-transformer/pom.xml
[INFO] run script verify.bsh
[INFO] ..SUCCESS (3.0 s)
[INFO] Building: shadePomDependency/pom.xml
[INFO] ..SUCCESS (3.9 s)
[INFO] Building: reloc-includes-excludes/pom.xml
[INFO] run script verify.bsh
[INFO] ..SUCCESS (3.5 s)
[INFO] Building: dep-reduced-pom-use-base-version/pom.xml
[INFO] run script verify.groovy
[INFO] ..FAILED (3.1 s)
[INFO]   The post-build script did not succeed. startup failed:
Script1.groovy: 23: unable to resolve class groovy.xml.Namespace 
 @ line 23, column 10.
   def ns = new groovy.xml.Namespace("http://maven.apache.org/POM/4.0.0") 
            ^

Script1.groovy: 24: unable to resolve class XmlParser 
 @ line 24, column 11.
   def pom = new XmlParser().parse( pomFile )
             ^

2 errors

[INFO] Building: rerun-with-reloc/pom.xml
[INFO] ..SUCCESS (3.9 s)
[INFO] Building: mini-jar-package-info/pom.xml
[INFO] run script verify.bsh
[INFO] ..SUCCESS (3.8 s)
[INFO] Building: attached-artifact-type/pom.xml
[INFO] ..SUCCESS (2.9 s)
[INFO] Building: implicit-inclusion-of-project-artifact/pom.xml
[INFO] run script verify.bsh
[INFO] ..SUCCESS (3.2 s)
[INFO] Building: finalNameShade-attached/pom.xml
[INFO] run script setup.bsh
[INFO] run script verify.bsh
[INFO] ..SUCCESS (2.9 s)
[INFO] Building: mini-jar/pom.xml
[INFO] run script verify.bsh
[INFO] ..SUCCESS (3.3 s)
[INFO] Building: reloc-anno/pom.xml
[INFO] ..SUCCESS (2.8 s)
[INFO] Building: filter-artifact-contents/pom.xml
[INFO] run script verify.bsh
[INFO] ..SUCCESS (2.9 s)
[INFO] Building: plugin-descriptor-relocation/pom.xml
[INFO] run script verify.groovy
[INFO] ..FAILED (6.0 s)
[INFO]   The post-build script did not succeed. startup failed:
Script1.groovy: 21: unable to resolve class XmlSlurper 
 @ line 21, column 14.
   def plugin = new XmlSlurper().parse( pluginXml.openStream() );
                ^

1 error

[INFO] Building: reloc-class-from-string-pool/pom.xml
[INFO] ..SUCCESS (2.7 s)
[INFO] 
[INFO] --- maven-invoker-plugin:1.7:verify (integration-test) @ maven-shade-plugin ---
[INFO] -------------------------------------------------
[INFO] Build Summary:
[INFO]   Passed: 39, Failed: 4, Errors: 0, Skipped: 0
[INFO] -------------------------------------------------
[ERROR] The following builds failed:
[ERROR] *  dep-reduced-pom-unique/pom.xml
[ERROR] *  dep-reduced-pom/pom.xml
[ERROR] *  dep-reduced-pom-use-base-version/pom.xml
[ERROR] *  plugin-descriptor-relocation/pom.xml
[INFO] -------------------------------------------------
[INFO]                                                                         
[INFO] ------------------------------------------------------------------------
[INFO] Building Maven Plugins Aggregator 1-SNAPSHOT
[INFO] ------------------------------------------------------------------------
[INFO] 
[INFO] --- maven-clean-plugin:2.4.1:clean (default-clean) @ maven-plugins-aggregator ---
[INFO] Deleting /x1/jenkins/jenkins-slave/workspace/maven-plugins-ITs-m3/target
[INFO] 
[INFO] --- maven-remote-resources-plugin:1.1:process (default) @ maven-plugins-aggregator
---
[INFO] Setting property: classpath.resource.loader.class => 'org.codehaus.plexus.velocity.ContextClassLoaderResourceLoader'.
[INFO] Setting property: velocimacro.messages.on => 'false'.
[INFO] Setting property: resource.loader => 'classpath'.
[INFO] Setting property: resource.manager.logwhenfound => 'false'.
[INFO] 
[INFO] --- maven-install-plugin:2.3.1:install (default-install) @ maven-plugins-aggregator
---
[INFO] Installing /x1/jenkins/jenkins-slave/workspace/maven-plugins-ITs-m3/pom.xml to /home/jenkins/.m2/repository/org/apache/maven/plugins/maven-plugins-aggregator/1-SNAPSHOT/maven-plugins-aggregator-1-SNAPSHOT.pom
[INFO] ------------------------------------------------------------------------
[INFO] Reactor Summary:
[INFO] 
[INFO] Maven Plugins ..................................... SUCCESS [2.098s]
[INFO] Maven ACR Plugin .................................. SUCCESS [23.795s]
[INFO] Maven Ant Plugin .................................. SUCCESS [1:02.224s]
[INFO] Maven AntRun Plugin ............................... SUCCESS [47.859s]
[INFO] Maven Eclipse Plugin .............................. SUCCESS [6:04.358s]
[INFO] Maven Assembly Plugin ............................. SUCCESS [9:15.947s]
[INFO] Maven Changelog Plugin ............................ SUCCESS [38.221s]
[INFO] Maven Changes Report Plugin ....................... SUCCESS [53.964s]
[INFO] Maven Checkstyle Plugin ........................... SUCCESS [1:30.687s]
[INFO] Maven Clean Plugin ................................ SUCCESS [18.343s]
[INFO] Maven Compiler Plugin ............................. SUCCESS [1:10.574s]
[INFO] Maven Dependency Plugin ........................... SUCCESS [2:10.028s]
[INFO] Maven Deploy Plugin ............................... SUCCESS [57.459s]
[INFO] Maven DOAP Plugin ................................. SUCCESS [17.954s]
[INFO] Maven Documentation Checker Plugin ................ SUCCESS [5.393s]
[INFO] Maven EAR Plugin .................................. FAILURE [3:17.985s]
[INFO] Maven EJB Plugin .................................. SUCCESS [21.793s]
[INFO] Maven GPG Plugin .................................. SUCCESS [7.603s]
[INFO] Maven Help Plugin ................................. SUCCESS [39.207s]
[INFO] Maven IDEA Plugin ................................. SUCCESS [6.879s]
[INFO] Maven Install Plugin .............................. SUCCESS [39.329s]
[INFO] Maven JAR Plugin .................................. SUCCESS [1:00.955s]
[INFO] Maven Jarsigner Plugin ............................ SUCCESS [21.260s]
[INFO] Maven Javadoc Plugin .............................. SUCCESS [2:43.201s]
[INFO] Maven Linkcheck Plugin ............................ SUCCESS [2.044s]
[INFO] Maven One Plugin .................................. SUCCESS [1.611s]
[INFO] Maven Patch Plugin ................................ SUCCESS [11.193s]
[INFO] Maven PDF Plugin .................................. SUCCESS [26.738s]
[INFO] Maven PMD Plugin .................................. SUCCESS [1:04.479s]
[INFO] Maven RAR Plugin .................................. SUCCESS [8.641s]
[INFO] Maven Reactor Plugin .............................. SUCCESS [2.044s]
[INFO] Maven Repository Plugin ........................... SUCCESS [42.082s]
[INFO] Maven Resources Plugin ............................ SUCCESS [45.726s]
[INFO] Maven Site Plugin 3 ............................... SUCCESS [5:43.461s]
[INFO] Maven Source Plugin ............................... SUCCESS [40.194s]
[INFO] Maven Stage Plugin ................................ SUCCESS [2.059s]
[INFO] Maven Toolchains Plugin ........................... SUCCESS [1.348s]
[INFO] Maven Verifier Plugin ............................. SUCCESS [13.232s]
[INFO] Maven WAR Plugin .................................. SUCCESS [1:05.559s]
[INFO] Maven SCM Publish Plugin .......................... SUCCESS [35.316s]
[INFO] Maven Invoker Plugin .............................. FAILURE [4:04.088s]
[INFO] Maven Project Info Reports Plugin ................. SUCCESS [2:28.575s]
[INFO] Maven Remote Resources Plugin ..................... SUCCESS [54.434s]
[INFO] Maven Shade Plugin ................................ FAILURE [2:39.228s]
[INFO] Maven Plugins Aggregator .......................... SUCCESS [0.342s]
[INFO] ------------------------------------------------------------------------
[INFO] BUILD FAILURE
[INFO] ------------------------------------------------------------------------
[INFO] Total time: 56:50.902s
[INFO] Finished at: Mon Mar 04 16:26:44 GMT 2013
[INFO] Final Memory: 113M/567M
[INFO] ------------------------------------------------------------------------
[WARNING] The requested profile "apache.snapshots" could not be activated because it does
not exist.
[ERROR] Failed to execute goal org.apache.maven.plugins:maven-invoker-plugin:1.7:verify (integration-test)
on project maven-ear-plugin: 1 build failed. See console output above for details. -> [Help
1]
[ERROR] Failed to execute goal org.apache.maven.plugins:maven-invoker-plugin:1.7:verify (integration-test)
on project maven-invoker-plugin: 1 build failed. See console output above for details. ->
[Help 1]
[ERROR] Failed to execute goal org.apache.maven.plugins:maven-invoker-plugin:1.7:verify (integration-test)
on project maven-shade-plugin: 4 builds failed. See console output above for details. ->
[Help 1]
[ERROR] 
[ERROR] To see the full stack trace of the errors, re-run Maven with the -e switch.
[ERROR] Re-run Maven using the -X switch to enable full debug logging.
[ERROR] 
[ERROR] For more information about the errors and possible solutions, please read the following
articles:
[ERROR] [Help 1] http://cwiki.apache.org/confluence/display/MAVEN/MojoFailureException
[ERROR] 
[ERROR] After correcting the problems, you can resume the build with the command
[ERROR]   mvn <goals> -rf :maven-ear-plugin
Build step 'Invoke top-level Maven targets' marked build as failure
Recording test results

Mime
View raw message