maven-notifications mailing list archives

Site index · List index
Message view « Date » · « Thread »
Top « Date » · « Thread »
From Apache Jenkins Server <jenk...@builds.apache.org>
Subject Build failed in Jenkins: core-it-maven-3-win #330
Date Sat, 16 Feb 2013 14:05:15 GMT
See <https://builds.apache.org/job/core-it-maven-3-win/330/changes>

Changes:

[Robert Scholte] MNG-3131: Error message is misleading if a missing plugin parameter is of
a type like List

------------------------------------------
[...truncated 5619 lines...]
[INFO] --- maven-compiler-plugin:2.5.1:compile (default-compile) @ core-it-extension ---
[INFO] No sources to compile
[INFO] 
[INFO] --- maven-resources-plugin:2.5:testResources (default-testResources) @ core-it-extension
---
[debug] execute contextualize
[INFO] Using 'UTF-8' encoding to copy filtered resources.
[INFO] skip non existing resourceDirectory F:\ws\m3-its\core-integration-testing-trunk\core-it-support\core-it-extension\src\test\resources
[INFO] Copying 3 resources
[INFO] 
[INFO] --- maven-compiler-plugin:2.5.1:testCompile (default-testCompile) @ core-it-extension
---
[INFO] No sources to compile
[INFO] 
[INFO] --- maven-surefire-plugin:2.12.4:test (default-test) @ core-it-extension ---
[INFO] 
[INFO] --- maven-jar-plugin:2.4:jar (default-jar) @ core-it-extension ---
[INFO] Building jar: F:\ws\m3-its\core-integration-testing-trunk\core-it-support\core-it-extension\target\core-it-extension-2.1-SNAPSHOT.jar
[INFO] 
[INFO] --- maven-site-plugin:3.1:attach-descriptor (attach-descriptor) @ core-it-extension
---
[INFO] 
[INFO] --- maven-install-plugin:2.3.1:install (default-install) @ core-it-extension ---
[INFO] Installing F:\ws\m3-its\core-integration-testing-trunk\core-it-support\core-it-extension\target\core-it-extension-2.1-SNAPSHOT.jar
to f:\hudson\hudson-slave\workspace\core-it-maven-3-win\it-local-repo\org\apache\maven\its\core-it-extension\2.1-SNAPSHOT\core-it-extension-2.1-SNAPSHOT.jar
[INFO] Installing F:\ws\m3-its\core-integration-testing-trunk\core-it-support\core-it-extension\pom.xml
to f:\hudson\hudson-slave\workspace\core-it-maven-3-win\it-local-repo\org\apache\maven\its\core-it-extension\2.1-SNAPSHOT\core-it-extension-2.1-SNAPSHOT.pom
[INFO]                                                                         
[INFO] ------------------------------------------------------------------------
[INFO] Building Maven ITs 2.1-SNAPSHOT
[INFO] ------------------------------------------------------------------------
[INFO] 
[INFO] --- maven-clean-plugin:2.5:clean (default-clean) @ core-it-suite ---
[INFO] Deleting F:\ws\m3-its\core-integration-testing-trunk\core-it-suite\target
[INFO] 
[INFO] --- maven-remote-resources-plugin:1.3:process (default) @ core-it-suite ---
[INFO] 
[INFO] --- maven-resources-plugin:2.5:resources (default-resources) @ core-it-suite ---
[debug] execute contextualize
[INFO] Using 'UTF-8' encoding to copy filtered resources.
[INFO] skip non existing resourceDirectory F:\ws\m3-its\core-integration-testing-trunk\core-it-suite\src\main\resources
[INFO] Copying 3 resources
[INFO] 
[INFO] --- maven-compiler-plugin:2.5.1:compile (default-compile) @ core-it-suite ---
[INFO] No sources to compile
[INFO] 
[INFO] --- maven-resources-plugin:2.5:testResources (default-testResources) @ core-it-suite
---
[debug] execute contextualize
[INFO] Using 'UTF-8' encoding to copy filtered resources.
[INFO] Copying 2736 resources
[INFO] Copying 2 resources
[INFO] Copying 3 resources
[INFO] 
[INFO] --- maven-compiler-plugin:2.5.1:testCompile (default-testCompile) @ core-it-suite ---
[INFO] Compiling 571 source files to F:\ws\m3-its\core-integration-testing-trunk\core-it-suite\target\test-classes
[INFO] 
[INFO] --- maven-surefire-plugin:2.12.4:test (default-test) @ core-it-suite ---
[WARNING] useSystemClassloader setting has no effect when not forking
[INFO] Surefire report directory: F:\ws\m3-its\core-integration-testing-trunk\core-it-suite\target\surefire-reports

-------------------------------------------------------
 T E S T S
-------------------------------------------------------
Running org.apache.maven.it.IntegrationTestSuite
Tests run: 1, Failures: 0, Errors: 1, Skipped: 0, Time elapsed: 0.065 sec <<< FAILURE!
initializationError(org.apache.maven.it.IntegrationTestSuite)  Time elapsed: 0.003 sec  <<<
ERROR!
org.apache.maven.it.VerificationException: Illegal maven output: String 'Maven version: '
not found in the following output:
The system cannot find the path specified.
	at org.apache.maven.it.Verifier.getMavenVersion(Verifier.java:1445)
	at org.apache.maven.it.IntegrationTestSuite.suite(IntegrationTestSuite.java:54)
	at sun.reflect.NativeMethodAccessorImpl.invoke0(Native Method)
	at sun.reflect.NativeMethodAccessorImpl.invoke(NativeMethodAccessorImpl.java:39)
	at sun.reflect.DelegatingMethodAccessorImpl.invoke(DelegatingMethodAccessorImpl.java:25)
	at java.lang.reflect.Method.invoke(Method.java:597)
	at org.junit.internal.runners.SuiteMethod.testFromSuiteMethod(SuiteMethod.java:34)
	at org.junit.internal.runners.SuiteMethod.<init>(SuiteMethod.java:23)
	at org.junit.internal.builders.SuiteMethodBuilder.runnerForClass(SuiteMethodBuilder.java:14)
	at org.junit.runners.model.RunnerBuilder.safeRunnerForClass(RunnerBuilder.java:57)
	at org.junit.internal.builders.AllDefaultPossibilitiesBuilder.runnerForClass(AllDefaultPossibilitiesBuilder.java:29)
	at org.junit.runners.model.RunnerBuilder.safeRunnerForClass(RunnerBuilder.java:57)
	at org.junit.internal.requests.ClassRequest.getRunner(ClassRequest.java:24)
	at org.apache.maven.surefire.junit4.JUnit4Provider.execute(JUnit4Provider.java:250)
	at org.apache.maven.surefire.junit4.JUnit4Provider.executeTestSet(JUnit4Provider.java:141)
	at org.apache.maven.surefire.junit4.JUnit4Provider.invoke(JUnit4Provider.java:112)
	at sun.reflect.NativeMethodAccessorImpl.invoke0(Native Method)
	at sun.reflect.NativeMethodAccessorImpl.invoke(NativeMethodAccessorImpl.java:39)
	at sun.reflect.DelegatingMethodAccessorImpl.invoke(DelegatingMethodAccessorImpl.java:25)
	at java.lang.reflect.Method.invoke(Method.java:597)
	at org.apache.maven.surefire.util.ReflectionUtils.invokeMethodWithArray(ReflectionUtils.java:189)
	at org.apache.maven.surefire.booter.ProviderFactory$ProviderProxy.invoke(ProviderFactory.java:165)
	at org.apache.maven.surefire.booter.ProviderFactory.invokeProvider(ProviderFactory.java:85)
	at org.apache.maven.plugin.surefire.InPluginVMSurefireStarter.runSuitesInProcess(InPluginVMSurefireStarter.java:80)
	at org.apache.maven.plugin.surefire.AbstractSurefireMojo.executeProvider(AbstractSurefireMojo.java:724)
	at org.apache.maven.plugin.surefire.AbstractSurefireMojo.executeAllProviders(AbstractSurefireMojo.java:682)
	at org.apache.maven.plugin.surefire.AbstractSurefireMojo.executeAfterPreconditionsChecked(AbstractSurefireMojo.java:648)
	at org.apache.maven.plugin.surefire.AbstractSurefireMojo.execute(AbstractSurefireMojo.java:586)
	at org.apache.maven.plugin.DefaultBuildPluginManager.executeMojo(DefaultBuildPluginManager.java:101)
	at org.apache.maven.lifecycle.internal.MojoExecutor.execute(MojoExecutor.java:209)
	at org.apache.maven.lifecycle.internal.MojoExecutor.execute(MojoExecutor.java:153)
	at org.apache.maven.lifecycle.internal.MojoExecutor.execute(MojoExecutor.java:145)
	at org.apache.maven.lifecycle.internal.LifecycleModuleBuilder.buildProject(LifecycleModuleBuilder.java:84)
	at org.apache.maven.lifecycle.internal.LifecycleModuleBuilder.buildProject(LifecycleModuleBuilder.java:59)
	at org.apache.maven.lifecycle.internal.LifecycleStarter.singleThreadedBuild(LifecycleStarter.java:183)
	at org.apache.maven.lifecycle.internal.LifecycleStarter.execute(LifecycleStarter.java:161)
	at org.apache.maven.DefaultMaven.doExecute(DefaultMaven.java:320)
	at org.apache.maven.DefaultMaven.execute(DefaultMaven.java:156)
	at org.apache.maven.cli.MavenCli.execute(MavenCli.java:537)
	at org.apache.maven.cli.MavenCli.doMain(MavenCli.java:196)
	at org.apache.maven.cli.MavenCli.main(MavenCli.java:141)
	at sun.reflect.NativeMethodAccessorImpl.invoke0(Native Method)
	at sun.reflect.NativeMethodAccessorImpl.invoke(NativeMethodAccessorImpl.java:39)
	at sun.reflect.DelegatingMethodAccessorImpl.invoke(DelegatingMethodAccessorImpl.java:25)
	at java.lang.reflect.Method.invoke(Method.java:597)
	at org.codehaus.plexus.classworlds.launcher.Launcher.launchEnhanced(Launcher.java:290)
	at org.codehaus.plexus.classworlds.launcher.Launcher.launch(Launcher.java:230)
	at org.codehaus.plexus.classworlds.launcher.Launcher.mainWithExitCode(Launcher.java:409)
	at org.codehaus.plexus.classworlds.launcher.Launcher.main(Launcher.java:352)


Results :

Tests in error: 
  initializationError(org.apache.maven.it.IntegrationTestSuite): Illegal maven output: String
'Maven version: ' not found in the following output:(..)

Tests run: 1, Failures: 0, Errors: 1, Skipped: 0

[INFO] ------------------------------------------------------------------------
[INFO] Reactor Summary:
[INFO] 
[INFO] Maven Core ITs .................................... SUCCESS [6.236s]
[INFO] Maven IT Support .................................. SUCCESS [0.095s]
[INFO] Maven IT :: Plugins ............................... SUCCESS [0.100s]
[INFO] Maven IT Plugin :: Active Collection .............. SUCCESS [3.569s]
[INFO] Maven IT Plugin :: Ant-Based ...................... SUCCESS [1.452s]
[INFO] Maven IT Plugin :: Artifact ....................... SUCCESS [1.221s]
[INFO] Maven IT Plugin :: Class Loader :: Dependency A ... SUCCESS [0.154s]
[INFO] Maven IT Plugin :: Class Loader :: Dependency B ... SUCCESS [0.161s]
[INFO] Maven IT Plugin :: Class Loader :: Dependency C ... SUCCESS [0.238s]
[INFO] Maven IT Plugin :: Class Loader ................... SUCCESS [1.710s]
[INFO] Maven IT Plugin :: Class Loader :: Aggregator ..... SUCCESS [0.046s]
[INFO] Maven IT Plugin :: Configuration .................. SUCCESS [0.557s]
[INFO] Maven IT Plugin :: Context Passing ................ SUCCESS [0.367s]
[INFO] Maven ITs :: Core Plugin Stubs .................... SUCCESS [0.093s]
[INFO] Maven IT Clean Plugin Stub ........................ SUCCESS [0.249s]
[INFO] Maven IT Compiler Plugin Stub ..................... SUCCESS [0.478s]
[INFO] Maven IT Deploy Plugin Stub ....................... SUCCESS [0.283s]
[INFO] Maven IT EAR Plugin Stub .......................... SUCCESS [0.286s]
[INFO] Maven IT EJB Plugin Stub .......................... SUCCESS [0.387s]
[INFO] Maven IT Install Plugin Stub ...................... SUCCESS [0.420s]
[INFO] Maven IT JAR Plugin Stub .......................... SUCCESS [0.279s]
[INFO] Maven IT Javadoc Plugin Stub ...................... SUCCESS [0.477s]
[INFO] Maven IT Plugin Plugin Stub ....................... SUCCESS [0.286s]
[INFO] Maven IT RAR Plugin Stub .......................... SUCCESS [0.310s]
[INFO] Maven IT Resources Plugin Stub .................... SUCCESS [0.285s]
[INFO] Maven IT Site Plugin Stub ......................... SUCCESS [0.335s]
[INFO] Maven IT Source Plugin Stub ....................... SUCCESS [0.298s]
[INFO] Maven IT Surefire Plugin Stub ..................... SUCCESS [0.369s]
[INFO] Maven IT WAR Plugin Stub .......................... SUCCESS [0.292s]
[INFO] Maven IT Plugin :: Dependency Collection .......... SUCCESS [1.448s]
[INFO] Maven IT Plugin :: Dependency Resolution .......... SUCCESS [2.268s]
[INFO] Maven IT Plugin :: Expression ..................... SUCCESS [0.807s]
[INFO] Maven IT Plugin :: Error Mojos .................... SUCCESS [0.754s]
[INFO] Maven IT Component ................................ SUCCESS [0.295s]
[INFO] Maven IT Plugin :: Extension Consumer ............. SUCCESS [0.211s]
[INFO] Maven IT Plugin :: Extension Provider ............. SUCCESS [0.256s]
[INFO] Maven IT Plugin :: Fork ........................... SUCCESS [0.416s]
[INFO] Maven IT Plugin :: Invalid Descriptor ............. SUCCESS [0.207s]
[INFO] Maven IT Plugin :: Log File ....................... SUCCESS [0.211s]
[INFO] Maven IT Plugin :: No Default Component ........... SUCCESS [0.204s]
[INFO] Maven IT Plugin :: No Project ..................... SUCCESS [0.139s]
[INFO] Maven IT Plugin :: Online ......................... SUCCESS [0.186s]
[INFO] Maven IT Plugin :: Optional Mojos ................. SUCCESS [0.216s]
[INFO] Maven IT Plugin :: Packaging ...................... SUCCESS [0.138s]
[INFO] Maven IT Plugin :: Parameter Implementation ....... SUCCESS [0.189s]
[INFO] Maven IT Plugin :: Plugin Dependency .............. SUCCESS [0.199s]
[INFO] Maven IT Plugin :: Project ........................ SUCCESS [0.313s]
[INFO] Maven IT Helper Library ........................... SUCCESS [0.985s]
[INFO] Maven IT Plugin :: Project Interpolation .......... SUCCESS [0.341s]
[INFO] Maven IT Plugin :: Setter ......................... SUCCESS [0.182s]
[INFO] Maven IT Plugin :: Singleton Component ............ SUCCESS [0.218s]
[INFO] Maven IT Plugin :: Site ........................... SUCCESS [0.310s]
[INFO] Maven IT Plugin :: Toolchain ...................... SUCCESS [1.414s]
[INFO] Maven IT Plugin :: Touch .......................... SUCCESS [0.238s]
[INFO] Maven IT Plugin :: Uses Properties Plugin ......... SUCCESS [0.133s]
[INFO] Maven IT Plugin :: Uses Wagon Plugin .............. SUCCESS [0.735s]
[INFO] Maven IT Plugin :: This plugin should contain the mojos needed by all tests.  SUCCESS
[0.138s]
[INFO] Maven IT Plugin :: Plexus Utils 1.1 ............... SUCCESS [0.202s]
[INFO] Maven IT Plugin :: Plexus Utils New ............... SUCCESS [0.300s]
[INFO] Maven IT Plugin :: Plexus Component API ........... SUCCESS [0.377s]
[INFO] Maven IT Plugin :: Log4J Client ................... SUCCESS [0.294s]
[INFO] Maven IT Plugin :: Extension 1 .................... SUCCESS [0.246s]
[INFO] Maven IT Plugin :: Extension 2 .................... SUCCESS [0.232s]
[INFO] Maven IT Plugin :: Plexus Lifecycle ............... SUCCESS [0.993s]
[INFO] Maven IT Plugin :: Settings ....................... SUCCESS [0.224s]
[INFO] Maven IT Toolchain ................................ SUCCESS [0.376s]
[INFO] Maven IT Wagon .................................... SUCCESS [0.394s]
[INFO] Maven IT Support Artifacts ........................ SUCCESS [0.516s]
[INFO] Maven IT Extension ................................ SUCCESS [0.213s]
[INFO] Maven ITs ......................................... FAILURE [34.583s]
[INFO] ------------------------------------------------------------------------
[INFO] BUILD FAILURE
[INFO] ------------------------------------------------------------------------
[INFO] Total time: 1:15.045s
[INFO] Finished at: Sat Feb 16 14:05:12 GMT 2013
[INFO] Final Memory: 37M/691M
[INFO] ------------------------------------------------------------------------
[ERROR] Failed to execute goal org.apache.maven.plugins:maven-surefire-plugin:2.12.4:test
(default-test) on project core-it-suite: There are test failures.
[ERROR] 
[ERROR] Please refer to F:\ws\m3-its\core-integration-testing-trunk\core-it-suite\target\surefire-reports
for the individual test results.
[ERROR] -> [Help 1]
org.apache.maven.lifecycle.LifecycleExecutionException: Failed to execute goal org.apache.maven.plugins:maven-surefire-plugin:2.12.4:test
(default-test) on project core-it-suite: There are test failures.

Please refer to F:\ws\m3-its\core-integration-testing-trunk\core-it-suite\target\surefire-reports
for the individual test results.
	at org.apache.maven.lifecycle.internal.MojoExecutor.execute(MojoExecutor.java:213)
	at org.apache.maven.lifecycle.internal.MojoExecutor.execute(MojoExecutor.java:153)
	at org.apache.maven.lifecycle.internal.MojoExecutor.execute(MojoExecutor.java:145)
	at org.apache.maven.lifecycle.internal.LifecycleModuleBuilder.buildProject(LifecycleModuleBuilder.java:84)
	at org.apache.maven.lifecycle.internal.LifecycleModuleBuilder.buildProject(LifecycleModuleBuilder.java:59)
	at org.apache.maven.lifecycle.internal.LifecycleStarter.singleThreadedBuild(LifecycleStarter.java:183)
	at org.apache.maven.lifecycle.internal.LifecycleStarter.execute(LifecycleStarter.java:161)
	at org.apache.maven.DefaultMaven.doExecute(DefaultMaven.java:320)
	at org.apache.maven.DefaultMaven.execute(DefaultMaven.java:156)
	at org.apache.maven.cli.MavenCli.execute(MavenCli.java:537)
	at org.apache.maven.cli.MavenCli.doMain(MavenCli.java:196)
	at org.apache.maven.cli.MavenCli.main(MavenCli.java:141)
	at sun.reflect.NativeMethodAccessorImpl.invoke0(Native Method)
	at sun.reflect.NativeMethodAccessorImpl.invoke(NativeMethodAccessorImpl.java:39)
	at sun.reflect.DelegatingMethodAccessorImpl.invoke(DelegatingMethodAccessorImpl.java:25)
	at java.lang.reflect.Method.invoke(Method.java:597)
	at org.codehaus.plexus.classworlds.launcher.Launcher.launchEnhanced(Launcher.java:290)
	at org.codehaus.plexus.classworlds.launcher.Launcher.launch(Launcher.java:230)
	at org.codehaus.plexus.classworlds.launcher.Launcher.mainWithExitCode(Launcher.java:409)
	at org.codehaus.plexus.classworlds.launcher.Launcher.main(Launcher.java:352)
Caused by: org.apache.maven.plugin.MojoFailureException: There are test failures.

Please refer to F:\ws\m3-its\core-integration-testing-trunk\core-it-suite\target\surefire-reports
for the individual test results.
	at org.apache.maven.plugin.surefire.SurefireHelper.reportExecution(SurefireHelper.java:83)
	at org.apache.maven.plugin.surefire.SurefirePlugin.writeSummary(SurefirePlugin.java:176)
	at org.apache.maven.plugin.surefire.SurefirePlugin.handleSummary(SurefirePlugin.java:150)
	at org.apache.maven.plugin.surefire.AbstractSurefireMojo.executeAfterPreconditionsChecked(AbstractSurefireMojo.java:650)
	at org.apache.maven.plugin.surefire.AbstractSurefireMojo.execute(AbstractSurefireMojo.java:586)
	at org.apache.maven.plugin.DefaultBuildPluginManager.executeMojo(DefaultBuildPluginManager.java:101)
	at org.apache.maven.lifecycle.internal.MojoExecutor.execute(MojoExecutor.java:209)
	... 19 more
[ERROR] 
[ERROR] Re-run Maven using the -X switch to enable full debug logging.
[ERROR] 
[ERROR] For more information about the errors and possible solutions, please read the following
articles:
[ERROR] [Help 1] http://cwiki.apache.org/confluence/display/MAVEN/MojoFailureException
[ERROR] 
[ERROR] After correcting the problems, you can resume the build with the command
[ERROR]   mvn <goals> -rf :core-it-suite
Build step 'Invoke top-level Maven targets' marked build as failure
Recording test results

Mime
View raw message