maven-notifications mailing list archives

Site index · List index
Message view « Date » · « Thread »
Top « Date » · « Thread »
From Apache Jenkins Server <jenk...@builds.apache.org>
Subject Build failed in Jenkins: maven-plugins-ITs-m3 #911
Date Sat, 16 Feb 2013 21:25:39 GMT
See <https://builds.apache.org/job/maven-plugins-ITs-m3/911/changes>

Changes:

[dennisl] [MCHECKSTYLE-184] Allow src/main/resources to be searched by Checkstyle

Add another properties file with a different key so that there is an actual error. Otherwise
the files won't show up in the report.

------------------------------------------
[...truncated 7869 lines...]
2371 [main] INFO org.apache.maven.plugins.site.SiteDeployWebDavTest - MKCOL path /site/css/.svn/text-base/
Proxy-Authorization : Basic Zm9vOnRpdGk=
Proxy-Connection : Keep-Alive
Content-Length : 0
Host : toto.com
User-Agent : Jakarta Commons-HttpClient/3.1
Expires : 0
Accept-Encoding : gzip
Cache-store : no-store
Pragma : no-cache
Cache-Control : no-cache

2371 [main] INFO org.apache.maven.plugins.site.SiteDeployWebDavTest - PUT path /site//css/.svn/text-base/maven-base.css.svn-base
Proxy-Authorization : Basic Zm9vOnRpdGk=
Proxy-Connection : Keep-Alive
Content-Length : 2310
Host : toto.com
User-Agent : Jakarta Commons-HttpClient/3.1
Expires : 0
Accept-Encoding : gzip
Cache-store : no-store
Pragma : no-cache
Cache-Control : no-cache

2371 [main] INFO org.apache.maven.plugins.site.SiteDeployWebDavTest - MKCOL path /site/css/.svn/
Proxy-Authorization : Basic Zm9vOnRpdGk=
Proxy-Connection : Keep-Alive
Content-Length : 0
Host : toto.com
User-Agent : Jakarta Commons-HttpClient/3.1
Expires : 0
Accept-Encoding : gzip
Cache-store : no-store
Pragma : no-cache
Cache-Control : no-cache

2371 [main] INFO org.apache.maven.plugins.site.SiteDeployWebDavTest - PUT path /site//css/.svn/entries
Proxy-Authorization : Basic Zm9vOnRpdGk=
Proxy-Connection : Keep-Alive
Content-Length : 469
Host : toto.com
User-Agent : Jakarta Commons-HttpClient/3.1
Expires : 0
Accept-Encoding : gzip
Cache-store : no-store
Pragma : no-cache
Cache-Control : no-cache

2371 [main] INFO org.apache.maven.plugins.site.SiteDeployWebDavTest - MKCOL path /site/.svn/prop-base/
Proxy-Authorization : Basic Zm9vOnRpdGk=
Proxy-Connection : Keep-Alive
Content-Length : 0
Host : toto.com
User-Agent : Jakarta Commons-HttpClient/3.1
Expires : 0
Accept-Encoding : gzip
Cache-store : no-store
Pragma : no-cache
Cache-Control : no-cache

2371 [main] INFO org.apache.maven.plugins.site.SiteDeployWebDavTest - PUT path /site//.svn/prop-base/index.html.svn-base
Proxy-Authorization : Basic Zm9vOnRpdGk=
Proxy-Connection : Keep-Alive
Content-Length : 81
Host : toto.com
User-Agent : Jakarta Commons-HttpClient/3.1
Expires : 0
Accept-Encoding : gzip
Cache-store : no-store
Pragma : no-cache
Cache-Control : no-cache

2371 [main] INFO org.apache.maven.plugins.site.SiteDeployWebDavTest - MKCOL path /site/.svn/
Proxy-Authorization : Basic Zm9vOnRpdGk=
Proxy-Connection : Keep-Alive
Content-Length : 0
Host : toto.com
User-Agent : Jakarta Commons-HttpClient/3.1
Expires : 0
Accept-Encoding : gzip
Cache-store : no-store
Pragma : no-cache
Cache-Control : no-cache

2372 [main] INFO org.apache.maven.plugins.site.SiteDeployWebDavTest - PUT path /site//.svn/all-wcprops
Proxy-Authorization : Basic Zm9vOnRpdGk=
Proxy-Connection : Keep-Alive
Content-Length : 330
Host : toto.com
User-Agent : Jakarta Commons-HttpClient/3.1
Expires : 0
Accept-Encoding : gzip
Cache-store : no-store
Pragma : no-cache
Cache-Control : no-cache

2372 [main] INFO org.apache.maven.plugins.site.SiteDeployWebDavTest - MKCOL path /site/.svn/text-base/
Proxy-Authorization : Basic Zm9vOnRpdGk=
Proxy-Connection : Keep-Alive
Content-Length : 0
Host : toto.com
User-Agent : Jakarta Commons-HttpClient/3.1
Expires : 0
Accept-Encoding : gzip
Cache-store : no-store
Pragma : no-cache
Cache-Control : no-cache

2372 [main] INFO org.apache.maven.plugins.site.SiteDeployWebDavTest - PUT path /site//.svn/text-base/index.html.svn-base
Proxy-Authorization : Basic Zm9vOnRpdGk=
Proxy-Connection : Keep-Alive
Content-Length : 21107
Host : toto.com
User-Agent : Jakarta Commons-HttpClient/3.1
Expires : 0
Accept-Encoding : gzip
Cache-store : no-store
Pragma : no-cache
Cache-Control : no-cache

2372 [main] INFO org.apache.maven.plugins.site.SiteDeployWebDavTest - MKCOL path /site/.svn/
Proxy-Authorization : Basic Zm9vOnRpdGk=
Proxy-Connection : Keep-Alive
Content-Length : 0
Host : toto.com
User-Agent : Jakarta Commons-HttpClient/3.1
Expires : 0
Accept-Encoding : gzip
Cache-store : no-store
Pragma : no-cache
Cache-Control : no-cache

2372 [main] INFO org.apache.maven.plugins.site.SiteDeployWebDavTest - PUT path /site//.svn/entries
Proxy-Authorization : Basic Zm9vOnRpdGk=
Proxy-Connection : Keep-Alive
Content-Length : 472
Host : toto.com
User-Agent : Jakarta Commons-HttpClient/3.1
Expires : 0
Accept-Encoding : gzip
Cache-store : no-store
Pragma : no-cache
Cache-Control : no-cache

2372 [main] INFO org.mortbay.log - Stopped SocketConnector@0.0.0.0:55527
Tests run: 3, Failures: 0, Errors: 0, Skipped: 0, Time elapsed: 2.563 sec
Running org.apache.maven.plugins.site.SiteDeployMojoTest
Tests run: 1, Failures: 0, Errors: 0, Skipped: 0, Time elapsed: 0.131 sec
Running org.apache.maven.plugins.site.SiteMojoTest
Tests run: 1, Failures: 0, Errors: 0, Skipped: 0, Time elapsed: 0.35 sec

Results :

Tests run: 5, Failures: 0, Errors: 0, Skipped: 0

[INFO] 
[INFO] --- maven-jar-plugin:2.4:jar (default-jar) @ maven-site-plugin ---
[INFO] Building jar: <https://builds.apache.org/job/maven-plugins-ITs-m3/ws/maven-site-plugin/target/maven-site-plugin-3.3-SNAPSHOT.jar>
[INFO] 
[INFO] --- maven-plugin-plugin:3.2:addPluginArtifactMetadata (default-addPluginArtifactMetadata)
@ maven-site-plugin ---
[INFO] 
[INFO] --- maven-shade-plugin:1.4:shade (default) @ maven-site-plugin ---
[INFO] Including org.apache.maven.reporting:maven-reporting-api:jar:3.0 in the shaded jar.
[INFO] Excluding org.apache.maven.reporting:maven-reporting-exec:jar:1.0.2 from the shaded
jar.
[INFO] Excluding velocity:velocity:jar:1.5 from the shaded jar.
[INFO] Including org.apache.maven:maven-artifact:jar:3.0 in the shaded jar.
[INFO] Excluding org.apache.maven:maven-model-builder:jar:3.0 from the shaded jar.
[INFO] Excluding org.codehaus.plexus:plexus-interpolation:jar:1.14 from the shaded jar.
[INFO] Excluding org.sonatype.sisu:sisu-inject-plexus:jar:1.4.2 from the shaded jar.
[INFO] Excluding org.sonatype.sisu:sisu-inject-bean:jar:1.4.2 from the shaded jar.
[INFO] Excluding org.sonatype.sisu:sisu-guice:jar:noaop:2.1.7 from the shaded jar.
[INFO] Excluding org.codehaus.plexus:plexus-component-annotations:jar:1.5.5 from the shaded
jar.
[INFO] Excluding org.apache.maven:maven-core:jar:3.0 from the shaded jar.
[INFO] Excluding org.apache.maven:maven-repository-metadata:jar:3.0 from the shaded jar.
[INFO] Excluding org.apache.maven:maven-aether-provider:jar:3.0 from the shaded jar.
[INFO] Excluding org.sonatype.aether:aether-impl:jar:1.7 from the shaded jar.
[INFO] Excluding org.sonatype.aether:aether-spi:jar:1.7 from the shaded jar.
[INFO] Excluding org.sonatype.aether:aether-api:jar:1.7 from the shaded jar.
[INFO] Excluding org.sonatype.aether:aether-util:jar:1.7 from the shaded jar.
[INFO] Excluding org.codehaus.plexus:plexus-classworlds:jar:2.2.3 from the shaded jar.
[INFO] Excluding org.sonatype.plexus:plexus-sec-dispatcher:jar:1.3 from the shaded jar.
[INFO] Excluding org.sonatype.plexus:plexus-cipher:jar:1.4 from the shaded jar.
[INFO] Excluding org.apache.maven:maven-model:jar:3.0 from the shaded jar.
[INFO] Excluding org.apache.maven:maven-plugin-api:jar:3.0 from the shaded jar.
[INFO] Excluding org.apache.maven:maven-settings:jar:3.0 from the shaded jar.
[INFO] Excluding org.apache.maven:maven-settings-builder:jar:3.0 from the shaded jar.
[INFO] Excluding org.apache.maven:maven-archiver:jar:2.4.2 from the shaded jar.
[INFO] Excluding org.apache.maven.doxia:doxia-sink-api:jar:1.4-SNAPSHOT from the shaded jar.
[INFO] Excluding org.apache.maven.doxia:doxia-logging-api:jar:1.4-SNAPSHOT from the shaded
jar.
[INFO] Excluding org.codehaus.plexus:plexus-container-default:jar:1.0-alpha-30 from the shaded
jar.
[INFO] Excluding org.apache.maven.doxia:doxia-core:jar:1.4-SNAPSHOT from the shaded jar.
[INFO] Excluding xerces:xercesImpl:jar:2.9.1 from the shaded jar.
[INFO] Excluding xml-apis:xml-apis:jar:1.3.04 from the shaded jar.
[INFO] Excluding org.apache.httpcomponents:httpclient:jar:4.0.2 from the shaded jar.
[INFO] Excluding commons-logging:commons-logging:jar:1.1.1 from the shaded jar.
[INFO] Excluding commons-codec:commons-codec:jar:1.3 from the shaded jar.
[INFO] Excluding org.apache.httpcomponents:httpcore:jar:4.0.1 from the shaded jar.
[INFO] Excluding org.apache.maven.doxia:doxia-module-xhtml:jar:1.4-SNAPSHOT from the shaded
jar.
[INFO] Excluding org.apache.maven.doxia:doxia-module-apt:jar:1.4-SNAPSHOT from the shaded
jar.
[INFO] Excluding org.apache.maven.doxia:doxia-module-xdoc:jar:1.4-SNAPSHOT from the shaded
jar.
[INFO] Excluding org.apache.maven.doxia:doxia-module-fml:jar:1.4-SNAPSHOT from the shaded
jar.
[INFO] Excluding org.apache.maven.doxia:doxia-module-markdown:jar:1.4-SNAPSHOT from the shaded
jar.
[INFO] Excluding org.pegdown:pegdown:jar:1.0.2 from the shaded jar.
[INFO] Excluding org.parboiled:parboiled-core:jar:1.0.1 from the shaded jar.
[INFO] Excluding org.parboiled:parboiled-java:jar:1.0.1 from the shaded jar.
[INFO] Excluding asm:asm-tree:jar:3.3.1 from the shaded jar.
[INFO] Excluding asm:asm-util:jar:3.3.1 from the shaded jar.
[INFO] Excluding asm:asm-analysis:jar:3.3.1 from the shaded jar.
[INFO] Excluding asm:asm:jar:3.3.1 from the shaded jar.
[INFO] Excluding javax.servlet:servlet-api:jar:2.5 from the shaded jar.
[INFO] Excluding org.apache.maven.doxia:doxia-decoration-model:jar:1.4-SNAPSHOT from the shaded
jar.
[INFO] Excluding org.apache.maven.doxia:doxia-site-renderer:jar:1.4-SNAPSHOT from the shaded
jar.
[INFO] Excluding org.apache.velocity:velocity-tools:jar:2.0 from the shaded jar.
[INFO] Excluding commons-beanutils:commons-beanutils:jar:1.7.0 from the shaded jar.
[INFO] Excluding commons-digester:commons-digester:jar:1.8 from the shaded jar.
[INFO] Excluding commons-chain:commons-chain:jar:1.1 from the shaded jar.
[INFO] Excluding commons-validator:commons-validator:jar:1.3.1 from the shaded jar.
[INFO] Excluding dom4j:dom4j:jar:1.1 from the shaded jar.
[INFO] Excluding sslext:sslext:jar:1.2-0 from the shaded jar.
[INFO] Excluding org.apache.struts:struts-core:jar:1.3.8 from the shaded jar.
[INFO] Excluding antlr:antlr:jar:2.7.2 from the shaded jar.
[INFO] Excluding org.apache.struts:struts-taglib:jar:1.3.8 from the shaded jar.
[INFO] Excluding org.apache.struts:struts-tiles:jar:1.3.8 from the shaded jar.
[INFO] Excluding commons-collections:commons-collections:jar:3.2.1 from the shaded jar.
[INFO] Excluding org.apache.maven.doxia:doxia-integration-tools:jar:1.5 from the shaded jar.
[INFO] Excluding org.apache.maven.wagon:wagon-provider-api:jar:1.0 from the shaded jar.
[INFO] Excluding org.codehaus.plexus:plexus-archiver:jar:1.0 from the shaded jar.
[INFO] Excluding org.codehaus.plexus:plexus-io:jar:1.0 from the shaded jar.
[INFO] Excluding org.codehaus.plexus:plexus-i18n:jar:1.0-beta-7 from the shaded jar.
[INFO] Excluding org.apache.velocity:velocity:jar:1.5 from the shaded jar.
[INFO] Excluding oro:oro:jar:2.0.8 from the shaded jar.
[INFO] Excluding org.codehaus.plexus:plexus-velocity:jar:1.1.8 from the shaded jar.
[INFO] Excluding org.codehaus.plexus:plexus-utils:jar:1.5.10 from the shaded jar.
[INFO] Excluding org.mortbay.jetty:jetty:jar:6.1.25 from the shaded jar.
[INFO] Excluding org.mortbay.jetty:servlet-api:jar:2.5-20081211 from the shaded jar.
[INFO] Excluding org.mortbay.jetty:jetty-util:jar:6.1.25 from the shaded jar.
[INFO] Excluding commons-lang:commons-lang:jar:2.5 from the shaded jar.
[INFO] Excluding commons-io:commons-io:jar:1.4 from the shaded jar.
[INFO] Replacing original artifact with shaded artifact.
[INFO] Replacing <https://builds.apache.org/job/maven-plugins-ITs-m3/ws/maven-site-plugin/target/maven-site-plugin-3.3-SNAPSHOT.jar>
with <https://builds.apache.org/job/maven-plugins-ITs-m3/ws/maven-site-plugin/target/maven-site-plugin-3.3-SNAPSHOT-shaded.jar>
[ERROR] PermGen space -> [Help 1]
[ERROR] 
[ERROR] To see the full stack trace of the errors, re-run Maven with the -e switch.
[ERROR] Re-run Maven using the -X switch to enable full debug logging.
[ERROR] 
[ERROR] For more information about the errors and possible solutions, please read the following
articles:
[ERROR] [Help 1] http://cwiki.apache.org/confluence/display/MAVEN/OutOfMemoryError
Build step 'Invoke top-level Maven targets' marked build as failure
Recording test results

Mime
View raw message