maven-notifications mailing list archives

Site index · List index
Message view « Date » · « Thread »
Top « Date » · « Thread »
From Apache Jenkins Server <jenk...@builds.apache.org>
Subject Build failed in Jenkins: maven-plugins-ITs-m3-windows #179
Date Fri, 22 Feb 2013 13:23:16 GMT
See <https://builds.apache.org/job/maven-plugins-ITs-m3-windows/179/changes>

Changes:

[andham] Made class more Java 5 (switched to enum)

------------------------------------------
[...truncated 9925 lines...]
Tests run: 7, Failures: 0, Errors: 0, Skipped: 0, Time elapsed: 0.001 sec
Running org.apache.maven.plugins.shade.resource.ApacheLicenseResourceTransformerTest
Tests run: 1, Failures: 0, Errors: 0, Skipped: 0, Time elapsed: 0.001 sec
Running org.apache.maven.plugins.shade.resource.ApacheNoticeResourceTransformerTest
Tests run: 1, Failures: 0, Errors: 0, Skipped: 0, Time elapsed: 0.001 sec
Running org.apache.maven.plugins.shade.resource.AppendingTransformerTest
Tests run: 1, Failures: 0, Errors: 0, Skipped: 0, Time elapsed: 0 sec
Running org.apache.maven.plugins.shade.resource.ComponentsXmlResourceTransformerTest
Tests run: 1, Failures: 0, Errors: 0, Skipped: 0, Time elapsed: 0.075 sec
Running org.apache.maven.plugins.shade.resource.XmlAppendingTransformerTest
Tests run: 1, Failures: 0, Errors: 0, Skipped: 0, Time elapsed: 0.011 sec

Results :

Tests run: 27, Failures: 0, Errors: 0, Skipped: 0

[INFO] 
[INFO] --- maven-jar-plugin:2.4:jar (default-jar) @ maven-shade-plugin ---
[INFO] Building jar: F:\hudson\hudson-slave\workspace\maven-plugins-ITs-m3-windows\maven-shade-plugin\target\maven-shade-plugin-3.0-SNAPSHOT.jar
[INFO] 
[INFO] --- maven-plugin-plugin:3.2:addPluginArtifactMetadata (default-addPluginArtifactMetadata)
@ maven-shade-plugin ---
[INFO] 
[INFO] --- maven-jar-plugin:2.4:test-jar (default) @ maven-shade-plugin ---
[INFO] Building jar: F:\hudson\hudson-slave\workspace\maven-plugins-ITs-m3-windows\maven-shade-plugin\target\maven-shade-plugin-3.0-SNAPSHOT-tests.jar
[INFO] 
[INFO] --- maven-invoker-plugin:1.6:install (integration-test) @ maven-shade-plugin ---
[INFO] Installing F:\hudson\hudson-slave\workspace\maven-plugins-ITs-m3-windows\maven-shade-plugin\pom.xml
to F:\hudson\hudson-slave\workspace\maven-plugins-ITs-m3-windows\maven-shade-plugin\target\local-repo\org\apache\maven\plugins\maven-shade-plugin\3.0-SNAPSHOT\maven-shade-plugin-3.0-SNAPSHOT.pom
[INFO] Installing F:\hudson\hudson-slave\workspace\maven-plugins-ITs-m3-windows\maven-shade-plugin\target\maven-shade-plugin-3.0-SNAPSHOT.jar
to F:\hudson\hudson-slave\workspace\maven-plugins-ITs-m3-windows\maven-shade-plugin\target\local-repo\org\apache\maven\plugins\maven-shade-plugin\3.0-SNAPSHOT\maven-shade-plugin-3.0-SNAPSHOT.jar
[INFO] Installing F:\hudson\hudson-slave\workspace\maven-plugins-ITs-m3-windows\maven-shade-plugin\target\maven-shade-plugin-3.0-SNAPSHOT-tests.jar
to F:\hudson\hudson-slave\workspace\maven-plugins-ITs-m3-windows\maven-shade-plugin\target\local-repo\org\apache\maven\plugins\maven-shade-plugin\3.0-SNAPSHOT\maven-shade-plugin-3.0-SNAPSHOT-tests.jar
[INFO] 
[INFO] --- maven-invoker-plugin:1.6:integration-test (integration-test) @ maven-shade-plugin
---
[INFO] Building: artifact-includes-excludes\pom.xml
[INFO] run script F:\hudson\hudson-slave\workspace\maven-plugins-ITs-m3-windows\maven-shade-plugin\target\it\artifact-includes-excludes\verify.bsh
[INFO] ..SUCCESS (8.5 s)
[INFO] Building: attach-after-lifecycle-fork\pom.xml
[INFO] run script F:\hudson\hudson-slave\workspace\maven-plugins-ITs-m3-windows\maven-shade-plugin\target\it\attach-after-lifecycle-fork\setup.bsh
[INFO] run script F:\hudson\hudson-slave\workspace\maven-plugins-ITs-m3-windows\maven-shade-plugin\target\it\attach-after-lifecycle-fork\verify.bsh
[INFO] ..SUCCESS (7.7 s)
[INFO] Building: attached-artifact-type\pom.xml
[INFO] ..SUCCESS (5.5 s)
[INFO] Building: component-descriptor-relocation\pom.xml
[INFO] ..SUCCESS (6.5 s)
[INFO] Building: dep-reduced-pom\pom.xml
[INFO] run script F:\hudson\hudson-slave\workspace\maven-plugins-ITs-m3-windows\maven-shade-plugin\target\it\dep-reduced-pom\verify.groovy
[INFO] ..SUCCESS (4.9 s)
[INFO] Building: dep-reduced-pom-relocated-result\pom.xml
[INFO] ..SUCCESS (3.5 s)
[INFO] Building: dep-reduced-pom-unique\pom.xml
[INFO] run script F:\hudson\hudson-slave\workspace\maven-plugins-ITs-m3-windows\maven-shade-plugin\target\it\dep-reduced-pom-unique\verify.groovy
[INFO] ..SUCCESS (5.8 s)
[INFO] Building: dep-reduced-pom-use-base-version\pom.xml
[INFO] run script F:\hudson\hudson-slave\workspace\maven-plugins-ITs-m3-windows\maven-shade-plugin\target\it\dep-reduced-pom-use-base-version\verify.groovy
[INFO] ..SUCCESS (4.8 s)
[INFO] Building: dep-reduced-pom-with-local-parent\pom.xml
[INFO] ..SUCCESS (3.2 s)
[INFO] Building: duplicate-classes-with-reloc\pom.xml
[INFO] ..SUCCESS (3.9 s)
[INFO] Building: duplicate-classes-without-reloc\pom.xml
[INFO] ..SUCCESS (3.9 s)
[INFO] Building: empty-apache-notice-transform\pom.xml
[INFO] ..SUCCESS (5.0 s)
[INFO] Building: empty-relocation-pattern\pom.xml
[INFO] ..SUCCESS (4.9 s)
[INFO] Building: empty-relocation-shaded-pattern\pom.xml
[INFO] ..SUCCESS (4.6 s)
[INFO] Building: filter-artifact-contents\pom.xml
[INFO] run script F:\hudson\hudson-slave\workspace\maven-plugins-ITs-m3-windows\maven-shade-plugin\target\it\filter-artifact-contents\verify.bsh
[INFO] ..SUCCESS (4.8 s)
[INFO] Building: finalNameBuild\pom.xml
[INFO] run script F:\hudson\hudson-slave\workspace\maven-plugins-ITs-m3-windows\maven-shade-plugin\target\it\finalNameBuild\setup.bsh
[INFO] run script F:\hudson\hudson-slave\workspace\maven-plugins-ITs-m3-windows\maven-shade-plugin\target\it\finalNameBuild\verify.bsh
[INFO] ..SUCCESS (5.2 s)
[INFO] Building: finalNameBuild-attached\pom.xml
[INFO] run script F:\hudson\hudson-slave\workspace\maven-plugins-ITs-m3-windows\maven-shade-plugin\target\it\finalNameBuild-attached\setup.bsh
[INFO] run script F:\hudson\hudson-slave\workspace\maven-plugins-ITs-m3-windows\maven-shade-plugin\target\it\finalNameBuild-attached\verify.bsh
[INFO] ..SUCCESS (5.3 s)
[INFO] Building: finalNameShade\pom.xml
[INFO] run script F:\hudson\hudson-slave\workspace\maven-plugins-ITs-m3-windows\maven-shade-plugin\target\it\finalNameShade\setup.bsh
[INFO] run script F:\hudson\hudson-slave\workspace\maven-plugins-ITs-m3-windows\maven-shade-plugin\target\it\finalNameShade\verify.bsh
[INFO] ..SUCCESS (4.7 s)
[INFO] Building: finalNameShade-attached\pom.xml
[INFO] run script F:\hudson\hudson-slave\workspace\maven-plugins-ITs-m3-windows\maven-shade-plugin\target\it\finalNameShade-attached\setup.bsh
[INFO] run script F:\hudson\hudson-slave\workspace\maven-plugins-ITs-m3-windows\maven-shade-plugin\target\it\finalNameShade-attached\verify.bsh
[INFO] ..SUCCESS (4.3 s)
[INFO] Building: implicit-inclusion-of-project-artifact\pom.xml
[INFO] run script F:\hudson\hudson-slave\workspace\maven-plugins-ITs-m3-windows\maven-shade-plugin\target\it\implicit-inclusion-of-project-artifact\verify.bsh
[INFO] ..SUCCESS (5.0 s)
[INFO] Building: manifest-retained\pom.xml
[INFO] run script F:\hudson\hudson-slave\workspace\maven-plugins-ITs-m3-windows\maven-shade-plugin\target\it\manifest-retained\verify.bsh
[INFO] ..SUCCESS (6.6 s)
[INFO] Building: manifest-transformed\pom.xml
[INFO] run script F:\hudson\hudson-slave\workspace\maven-plugins-ITs-m3-windows\maven-shade-plugin\target\it\manifest-transformed\verify.bsh
[INFO] ..SUCCESS (5.0 s)
[INFO] Building: mini-jar\pom.xml
[INFO] run script F:\hudson\hudson-slave\workspace\maven-plugins-ITs-m3-windows\maven-shade-plugin\target\it\mini-jar\verify.bsh
[INFO] ..SUCCESS (5.5 s)
[INFO] Building: mini-jar-malformed-dependencies\pom.xml
[INFO] ..SUCCESS (10.9 s)
[INFO] Building: mini-jar-package-info\pom.xml
[INFO] run script F:\hudson\hudson-slave\workspace\maven-plugins-ITs-m3-windows\maven-shade-plugin\target\it\mini-jar-package-info\verify.bsh
[INFO] ..SUCCESS (8.6 s)
[INFO] Building: mini-jar-respect-includes\pom.xml
[INFO] run script F:\hudson\hudson-slave\workspace\maven-plugins-ITs-m3-windows\maven-shade-plugin\target\it\mini-jar-respect-includes\verify.bsh
[INFO] ..SUCCESS (6.3 s)
[INFO] Building: MSHADE-105\pom.xml
[INFO] run script F:\hudson\hudson-slave\workspace\maven-plugins-ITs-m3-windows\maven-shade-plugin\target\it\MSHADE-105\verify.bsh
[INFO] ..SUCCESS (15.2 s)
[INFO] Building: mshade-123\pom.xml
[INFO] ..SUCCESS (9.7 s)
[INFO] Building: non-runtime-scope-excluded\pom.xml
[INFO] run script F:\hudson\hudson-slave\workspace\maven-plugins-ITs-m3-windows\maven-shade-plugin\target\it\non-runtime-scope-excluded\verify.bsh
[INFO] ..SUCCESS (5.4 s)
[INFO] Building: plugin-descriptor-relocation\pom.xml
[INFO] run script F:\hudson\hudson-slave\workspace\maven-plugins-ITs-m3-windows\maven-shade-plugin\target\it\plugin-descriptor-relocation\verify.groovy
[INFO] ..SUCCESS (11.2 s)
[INFO] Building: pom-packaging\pom.xml
[INFO] run script F:\hudson\hudson-slave\workspace\maven-plugins-ITs-m3-windows\maven-shade-plugin\target\it\pom-packaging\verify.bsh
[INFO] ..SUCCESS (3.0 s)
[INFO] Building: project-with-reactors-included\pom.xml
[INFO] run script F:\hudson\hudson-slave\workspace\maven-plugins-ITs-m3-windows\maven-shade-plugin\target\it\project-with-reactors-included\verify.bsh
[INFO] ..SUCCESS (7.2 s)
[INFO] Building: reloc-abs-resource-path\pom.xml
[INFO] ..SUCCESS (8.7 s)
[INFO] Building: reloc-anno\pom.xml
[INFO] ..SUCCESS (4.5 s)
[INFO] Building: reloc-class-from-string-pool\pom.xml
[INFO] ..SUCCESS (3.9 s)
[INFO] Building: reloc-enum-ref-from-anno\pom.xml
[INFO] ..SUCCESS (4.4 s)
[INFO] Building: reloc-includes-excludes\pom.xml
[INFO] run script F:\hudson\hudson-slave\workspace\maven-plugins-ITs-m3-windows\maven-shade-plugin\target\it\reloc-includes-excludes\verify.bsh
[INFO] ..SUCCESS (5.6 s)
[INFO] Building: rerun-with-reloc\pom.xml
[INFO] ..SUCCESS (5.5 s)
[INFO] Building: rerun-without-reloc\pom.xml
[INFO] ..SUCCESS (4.3 s)
[INFO] Building: services-resource-transformer\pom.xml
[INFO] run script F:\hudson\hudson-slave\workspace\maven-plugins-ITs-m3-windows\maven-shade-plugin\target\it\services-resource-transformer\verify.bsh
[INFO] ..SUCCESS (5.3 s)
[INFO] Building: shadePomDependency\pom.xml
[INFO] ..SUCCESS (5.2 s)
[INFO] Building: users-shader-impl\pom.xml
[INFO] run script F:\hudson\hudson-slave\workspace\maven-plugins-ITs-m3-windows\maven-shade-plugin\target\it\users-shader-impl\verify.groovy
[INFO] ..SUCCESS (5.1 s)
[INFO] Building: xml-transformer-ignores-dtd\pom.xml
[INFO] run script F:\hudson\hudson-slave\workspace\maven-plugins-ITs-m3-windows\maven-shade-plugin\target\it\xml-transformer-ignores-dtd\verify.bsh
[INFO] ..SUCCESS (4.8 s)
[INFO] 
[INFO] --- maven-invoker-plugin:1.6:verify (integration-test) @ maven-shade-plugin ---
[INFO] -------------------------------------------------
[INFO] Build Summary:
[INFO]   Passed: 43, Failed: 0, Errors: 0, Skipped: 0
[INFO] -------------------------------------------------
[INFO] 
[INFO] --- maven-install-plugin:2.3.1:install (default-install) @ maven-shade-plugin ---
[INFO] Installing F:\hudson\hudson-slave\workspace\maven-plugins-ITs-m3-windows\maven-shade-plugin\target\maven-shade-plugin-3.0-SNAPSHOT.jar
to C:\Users\hudson\.m2\repository\org\apache\maven\plugins\maven-shade-plugin\3.0-SNAPSHOT\maven-shade-plugin-3.0-SNAPSHOT.jar
[INFO] Installing F:\hudson\hudson-slave\workspace\maven-plugins-ITs-m3-windows\maven-shade-plugin\pom.xml
to C:\Users\hudson\.m2\repository\org\apache\maven\plugins\maven-shade-plugin\3.0-SNAPSHOT\maven-shade-plugin-3.0-SNAPSHOT.pom
[INFO] Installing F:\hudson\hudson-slave\workspace\maven-plugins-ITs-m3-windows\maven-shade-plugin\target\maven-shade-plugin-3.0-SNAPSHOT-tests.jar
to C:\Users\hudson\.m2\repository\org\apache\maven\plugins\maven-shade-plugin\3.0-SNAPSHOT\maven-shade-plugin-3.0-SNAPSHOT-tests.jar
[INFO]                                                                         
[INFO] ------------------------------------------------------------------------
[INFO] Building Maven Plugins Aggregator 1-SNAPSHOT
[INFO] ------------------------------------------------------------------------
[INFO] 
[INFO] --- maven-clean-plugin:2.4.1:clean (default-clean) @ maven-plugins-aggregator ---
[INFO] Deleting <https://builds.apache.org/job/maven-plugins-ITs-m3-windows/ws/target>
[INFO] 
[INFO] --- maven-remote-resources-plugin:1.1:process (default) @ maven-plugins-aggregator
---
[INFO] 
[INFO] --- maven-install-plugin:2.3.1:install (default-install) @ maven-plugins-aggregator
---
[INFO] Installing <https://builds.apache.org/job/maven-plugins-ITs-m3-windows/ws/pom.xml>
to C:\Users\hudson\.m2\repository\org\apache\maven\plugins\maven-plugins-aggregator\1-SNAPSHOT\maven-plugins-aggregator-1-SNAPSHOT.pom
[INFO] ------------------------------------------------------------------------
[INFO] Reactor Summary:
[INFO] 
[INFO] Maven Plugins ..................................... SUCCESS [15.466s]
[INFO] Maven ACR Plugin .................................. SUCCESS [43.366s]
[INFO] Maven Ant Plugin .................................. SUCCESS [1:44.217s]
[INFO] Maven AntRun Plugin ............................... SUCCESS [1:14.971s]
[INFO] Maven Eclipse Plugin .............................. SUCCESS [11:14.993s]
[INFO] Maven Assembly Plugin ............................. SUCCESS [13:50.414s]
[INFO] Maven Changelog Plugin ............................ FAILURE [10.955s]
[INFO] Maven Changes Report Plugin ....................... SUCCESS [1:45.724s]
[INFO] Maven Checkstyle Plugin ........................... FAILURE [23.470s]
[INFO] Maven Clean Plugin ................................ SUCCESS [25.176s]
[INFO] Maven Compiler Plugin ............................. SUCCESS [2:31.388s]
[INFO] Maven Dependency Plugin ........................... SUCCESS [3:30.594s]
[INFO] Maven Deploy Plugin ............................... SUCCESS [1:51.564s]
[INFO] Maven DOAP Plugin ................................. SUCCESS [32.242s]
[INFO] Maven Documentation Checker Plugin ................ SUCCESS [9.929s]
[INFO] Maven EAR Plugin .................................. SUCCESS [5:33.618s]
[INFO] Maven EJB Plugin .................................. SUCCESS [36.704s]
[INFO] Maven GPG Plugin .................................. SUCCESS [1.692s]
[INFO] Maven Help Plugin ................................. FAILURE [7.035s]
[INFO] Maven IDEA Plugin ................................. SUCCESS [10.688s]
[INFO] Maven Install Plugin .............................. SUCCESS [1:09.716s]
[INFO] Maven JAR Plugin .................................. FAILURE [3.542s]
[INFO] Maven Jarsigner Plugin ............................ SUCCESS [38.789s]
[INFO] Maven Javadoc Plugin .............................. FAILURE [1:17.586s]
[INFO] Maven Linkcheck Plugin ............................ SUCCESS [3.790s]
[INFO] Maven One Plugin .................................. SUCCESS [2.100s]
[INFO] Maven Patch Plugin ................................ SUCCESS [6.807s]
[INFO] Maven PDF Plugin .................................. SUCCESS [1:45.574s]
[INFO] Maven PMD Plugin .................................. SUCCESS [2:03.949s]
[INFO] Maven RAR Plugin .................................. SUCCESS [18.440s]
[INFO] Maven Reactor Plugin .............................. SUCCESS [3.359s]
[INFO] Maven Repository Plugin ........................... SUCCESS [1:09.143s]
[INFO] Maven Resources Plugin ............................ SUCCESS [1:13.846s]
[INFO] Maven Site Plugin 3 ............................... SUCCESS [10:55.392s]
[INFO] Maven Source Plugin ............................... SUCCESS [1:14.412s]
[INFO] Maven Stage Plugin ................................ SUCCESS [4.012s]
[INFO] Maven Toolchains Plugin ........................... SUCCESS [2.144s]
[INFO] Maven Verifier Plugin ............................. SUCCESS [27.030s]
[INFO] Maven WAR Plugin .................................. SUCCESS [1:40.432s]
[INFO] Maven SCM Publish Plugin .......................... SUCCESS [1:32.277s]
[INFO] Maven Invoker Plugin .............................. SUCCESS [6:39.968s]
[INFO] Maven Project Info Reports Plugin ................. SUCCESS [3:06.891s]
[INFO] Maven Remote Resources Plugin ..................... SUCCESS [1:31.120s]
[INFO] Maven Shade Plugin ................................ SUCCESS [4:51.009s]
[INFO] Maven Plugins Aggregator .......................... SUCCESS [0.052s]
[INFO] ------------------------------------------------------------------------
[INFO] BUILD FAILURE
[INFO] ------------------------------------------------------------------------
[INFO] Total time: 1:28:57.961s
[INFO] Finished at: Fri Feb 22 13:20:17 GMT 2013
[INFO] Final Memory: 134M/327M
[INFO] ------------------------------------------------------------------------
[WARNING] The requested profile "apache.snapshots" could not be activated because it does
not exist.
[ERROR] Failed to execute goal org.apache.maven.plugins:maven-surefire-plugin:2.12:test (default-test)
on project maven-changelog-plugin: There are test failures.
[ERROR] 
[ERROR] Please refer to F:\hudson\hudson-slave\workspace\maven-plugins-ITs-m3-windows\maven-changelog-plugin\target\surefire-reports
for the individual test results.
[ERROR] -> [Help 1]
[ERROR] Failed to execute goal org.apache.maven.plugins:maven-invoker-plugin:1.8:install (integration-test)
on project maven-checkstyle-plugin: Failed to install project dependencies: MavenProject:
org.apache.maven.plugins:maven-checkstyle-plugin:2.11-SNAPSHOT @ F:\hudson\hudson-slave\workspace\maven-plugins-ITs-m3-windows\maven-checkstyle-plugin\pom.xml:
Failed to install project artifacts: MavenProject: org.apache.maven.plugins:maven-changelog-plugin:2.3-SNAPSHOT
@ F:\hudson\hudson-slave\workspace\maven-plugins-ITs-m3-windows\maven-changelog-plugin\pom.xml:
Failed to install artifact: org.apache.maven.plugins:maven-changelog-plugin:maven-plugin:2.3-SNAPSHOT:
Artifact is not fully assembled: F:\hudson\hudson-slave\workspace\maven-plugins-ITs-m3-windows\maven-changelog-plugin\target\classes
-> [Help 2]
[ERROR] Failed to execute goal org.apache.maven.plugins:maven-invoker-plugin:1.8:install (integration-test)
on project maven-help-plugin: Failed to install project dependencies: MavenProject: org.apache.maven.plugins:maven-help-plugin:2.2.1-SNAPSHOT
@ F:\hudson\hudson-slave\workspace\maven-plugins-ITs-m3-windows\maven-help-plugin\pom.xml:
Failed to install project artifacts: MavenProject: org.apache.maven.plugins:maven-changelog-plugin:2.3-SNAPSHOT
@ F:\hudson\hudson-slave\workspace\maven-plugins-ITs-m3-windows\maven-changelog-plugin\pom.xml:
Failed to install artifact: org.apache.maven.plugins:maven-changelog-plugin:maven-plugin:2.3-SNAPSHOT:
Artifact is not fully assembled: F:\hudson\hudson-slave\workspace\maven-plugins-ITs-m3-windows\maven-changelog-plugin\target\classes
-> [Help 2]
[ERROR] Failed to execute goal org.apache.maven.plugins:maven-invoker-plugin:1.8:install (integration-test)
on project maven-jar-plugin: Failed to install project dependencies: MavenProject: org.apache.maven.plugins:maven-jar-plugin:2.5-SNAPSHOT
@ F:\hudson\hudson-slave\workspace\maven-plugins-ITs-m3-windows\maven-jar-plugin\pom.xml:
Failed to install project artifacts: MavenProject: org.apache.maven.plugins:maven-changelog-plugin:2.3-SNAPSHOT
@ F:\hudson\hudson-slave\workspace\maven-plugins-ITs-m3-windows\maven-changelog-plugin\pom.xml:
Failed to install artifact: org.apache.maven.plugins:maven-changelog-plugin:maven-plugin:2.3-SNAPSHOT:
Artifact is not fully assembled: F:\hudson\hudson-slave\workspace\maven-plugins-ITs-m3-windows\maven-changelog-plugin\target\classes
-> [Help 2]
[ERROR] Failed to execute goal org.apache.maven.plugins:maven-surefire-plugin:2.12:test (default-test)
on project maven-javadoc-plugin: There are test failures.
[ERROR] 
[ERROR] Please refer to F:\hudson\hudson-slave\workspace\maven-plugins-ITs-m3-windows\maven-javadoc-plugin\target\surefire-reports
for the individual test results.
[ERROR] -> [Help 1]
[ERROR] 
[ERROR] To see the full stack trace of the errors, re-run Maven with the -e switch.
[ERROR] Re-run Maven using the -X switch to enable full debug logging.
[ERROR] 
[ERROR] For more information about the errors and possible solutions, please read the following
articles:
[ERROR] [Help 1] http://cwiki.apache.org/confluence/display/MAVEN/MojoFailureException
[ERROR] [Help 2] http://cwiki.apache.org/confluence/display/MAVEN/MojoExecutionException
[ERROR] 
[ERROR] After correcting the problems, you can resume the build with the command
[ERROR]   mvn <goals> -rf :maven-changelog-plugin
Build step 'Invoke top-level Maven targets' marked build as failure
Recording test results

Mime
View raw message