maven-notifications mailing list archives

Site index · List index
Message view « Date » · « Thread »
Top « Date » · « Thread »
From Apache Jenkins Server <jenk...@builds.apache.org>
Subject Build failed in Jenkins: maven-plugins-ITs-m3 #917
Date Tue, 19 Feb 2013 20:26:13 GMT
See <https://builds.apache.org/job/maven-plugins-ITs-m3/917/changes>

Changes:

[olamy] add it for MPMD-163

[olamy] add contributor

[olamy] [MPMD-163] PMD issues are reported multiple times
Submitted by Mirko Friedenhagen.

------------------------------------------
[...truncated 7270 lines...]
[INFO] Copying 3 resources
[INFO] 
[INFO] --- maven-compiler-plugin:2.5.1:compile (default-compile) @ maven-resources-plugin
---
[INFO] Compiling 7 source files to /x1/jenkins/jenkins-slave/workspace/maven-plugins-ITs-m3/maven-resources-plugin/target/classes
[INFO] 
[INFO] --- maven-plugin-plugin:3.2:descriptor (mojo-descriptor) @ maven-resources-plugin ---
[INFO] Using 'UTF-8' encoding to read mojo metadata.
[INFO] Applying mojo extractor for language: java
[INFO] Mojo extractor for language: java found 0 mojo descriptors.
[INFO] Applying mojo extractor for language: bsh
[INFO] Mojo extractor for language: bsh found 0 mojo descriptors.
[INFO] Applying mojo extractor for language: java-annotations
[INFO] Mojo extractor for language: java-annotations found 4 mojo descriptors.
[INFO] 
[INFO] --- maven-resources-plugin:2.5:testResources (default-testResources) @ maven-resources-plugin
---
[debug] execute contextualize
[INFO] Using 'UTF-8' encoding to copy filtered resources.
[INFO] Copying 13 resources
[INFO] Copying 3 resources
[INFO] 
[INFO] --- maven-compiler-plugin:2.5.1:testCompile (default-testCompile) @ maven-resources-plugin
---
[INFO] Compiling 12 source files to /x1/jenkins/jenkins-slave/workspace/maven-plugins-ITs-m3/maven-resources-plugin/target/test-classes
[INFO] 
[INFO] --- plexus-component-metadata:1.5.5:generate-test-metadata (default) @ maven-resources-plugin
---
[INFO] Discovered 1 component descriptors(s)
[INFO] 
[INFO] --- maven-surefire-plugin:2.12:test (default-test) @ maven-resources-plugin ---
[INFO] Surefire report directory: /x1/jenkins/jenkins-slave/workspace/maven-plugins-ITs-m3/maven-resources-plugin/target/surefire-reports

-------------------------------------------------------
 T E S T S
-------------------------------------------------------
Running org.apache.maven.plugin.resources.ResourcesMojoTest
[INFO] Using 'UTF-8' encoding to copy filtered resources.
[INFO] Copying 5 resources
[INFO] Using 'UTF-8' encoding to copy filtered resources.
[INFO] Copying 5 resources
[INFO] Using 'UTF-8' encoding to copy filtered resources.
[INFO] Copying 1 resource
[INFO] Using 'UTF-8' encoding to copy filtered resources.
[INFO] Copying 4 resources
[INFO] Using 'UTF-8' encoding to copy filtered resources.
[INFO] Copying 8 resources
[INFO] Using 'UTF-8' encoding to copy filtered resources.
[INFO] Copying 5 resources to org/apache/maven/plugin/test
[INFO] Using 'UTF-8' encoding to copy filtered resources.
[INFO] Copying 1 resource
[INFO] Using 'UTF-8' encoding to copy filtered resources.
[INFO] Copying 1 resource
[INFO] Using 'UTF-8' encoding to copy filtered resources.
[INFO] Copying 1 resource
[INFO] Using 'UTF-8' encoding to copy filtered resources.
[INFO] Copying 2 resources
[INFO] Using 'UTF-8' encoding to copy filtered resources.
[INFO] Copying 2 resources
[INFO] Using 'UTF-8' encoding to copy filtered resources.
[INFO] Copying 3 resources
[INFO] Using 'UTF-8' encoding to copy filtered resources.
[INFO] Copying 2 resources
[INFO] Using 'UTF-8' encoding to copy filtered resources.
[INFO] Copying 1 resource
[INFO] Using 'UTF-8' encoding to copy filtered resources.
[INFO] Copying 1 resource
Tests run: 16, Failures: 0, Errors: 0, Skipped: 0, Time elapsed: 0.738 sec
Running org.apache.maven.plugin.resources.EnhancedPropertyUtilsTest
Tests run: 3, Failures: 0, Errors: 0, Skipped: 0, Time elapsed: 0.055 sec
Running org.apache.maven.plugin.resources.ReflectionPropertiesTest
Tests run: 2, Failures: 0, Errors: 0, Skipped: 0, Time elapsed: 0.041 sec
Running org.apache.maven.plugin.resources.AdvancePropertyUtilsTest
Tests run: 3, Failures: 0, Errors: 0, Skipped: 0, Time elapsed: 0.055 sec
Running org.apache.maven.plugin.resources.CopyResourcesMojoTest
[INFO] Using 'UTF-8' encoding to copy filtered resources.
[INFO] Copying 1 resource
Tests run: 1, Failures: 0, Errors: 0, Skipped: 0, Time elapsed: 0.031 sec
Running org.apache.maven.plugin.resources.BasicPropertyUtilsTest
Tests run: 5, Failures: 0, Errors: 0, Skipped: 0, Time elapsed: 0.089 sec
Running org.apache.maven.plugin.resources.TestResourcesTest
[INFO] Using 'UTF-8' encoding to copy filtered resources.
[INFO] Copying 5 resources
Tests run: 2, Failures: 0, Errors: 0, Skipped: 0, Time elapsed: 0.039 sec

Results :

Tests run: 32, Failures: 0, Errors: 0, Skipped: 0

[INFO] 
[INFO] --- maven-jar-plugin:2.4:jar (default-jar) @ maven-resources-plugin ---
[INFO] Building jar: /x1/jenkins/jenkins-slave/workspace/maven-plugins-ITs-m3/maven-resources-plugin/target/maven-resources-plugin-2.7-SNAPSHOT.jar
[INFO] 
[INFO] --- maven-plugin-plugin:3.2:addPluginArtifactMetadata (default-addPluginArtifactMetadata)
@ maven-resources-plugin ---
[INFO] 
[INFO] --- maven-jar-plugin:2.4:test-jar (default) @ maven-resources-plugin ---
[INFO] Building jar: /x1/jenkins/jenkins-slave/workspace/maven-plugins-ITs-m3/maven-resources-plugin/target/maven-resources-plugin-2.7-SNAPSHOT-tests.jar
[INFO] 
[INFO] --- maven-invoker-plugin:1.7:install (integration-test) @ maven-resources-plugin ---
[INFO] Installing /x1/jenkins/jenkins-slave/workspace/maven-plugins-ITs-m3/maven-resources-plugin/pom.xml
to /x1/jenkins/jenkins-slave/workspace/maven-plugins-ITs-m3/maven-resources-plugin/target/local-repo/org/apache/maven/plugins/maven-resources-plugin/2.7-SNAPSHOT/maven-resources-plugin-2.7-SNAPSHOT.pom
[INFO] Installing /x1/jenkins/jenkins-slave/workspace/maven-plugins-ITs-m3/maven-resources-plugin/target/maven-resources-plugin-2.7-SNAPSHOT.jar
to /x1/jenkins/jenkins-slave/workspace/maven-plugins-ITs-m3/maven-resources-plugin/target/local-repo/org/apache/maven/plugins/maven-resources-plugin/2.7-SNAPSHOT/maven-resources-plugin-2.7-SNAPSHOT.jar
[INFO] Installing /x1/jenkins/jenkins-slave/workspace/maven-plugins-ITs-m3/maven-resources-plugin/target/maven-resources-plugin-2.7-SNAPSHOT-tests.jar
to /x1/jenkins/jenkins-slave/workspace/maven-plugins-ITs-m3/maven-resources-plugin/target/local-repo/org/apache/maven/plugins/maven-resources-plugin/2.7-SNAPSHOT/maven-resources-plugin-2.7-SNAPSHOT-tests.jar
[INFO] 
[INFO] --- maven-invoker-plugin:1.7:integration-test (integration-test) @ maven-resources-plugin
---
[INFO] Building: MRESOURCES-20/pom.xml
[INFO] run script verify.bsh
[INFO] ..SUCCESS (1.8 s)
[INFO] Building: copy-resources-it/pom.xml
[INFO] run script verify.bsh
[INFO] ..SUCCESS (1.7 s)
[INFO] Building: MRESOURCES-104/pom.xml
[INFO] run script verify.groovy
[INFO] ..SUCCESS (1.7 s)
[INFO] Building: MRESOURCES-18/pom.xml
[INFO] ..SUCCESS (2.3 s)
[INFO] Building: filter/pom.xml
[INFO] run script verify.bsh
[INFO] ..SUCCESS (1.7 s)
[INFO] Building: MRESOURCES-77/pom.xml
[INFO] run script verify.bsh
[INFO] ..SUCCESS (1.7 s)
[INFO] Building: includeEmptyDirs/pom.xml
[INFO] run script verify.bsh
[INFO] ..SUCCESS (1.7 s)
[INFO] Building: custom-delimiter/pom.xml
[INFO] run script verify.bsh
[INFO] ..SUCCESS (1.7 s)
[INFO] Building: MRESOURCES-166/pom.xml
[INFO] run script verify.groovy
[INFO] ..SUCCESS (1.7 s)
[INFO] Building: MRESOURCES-131/pom.xml
[INFO] run script verify.groovy
[INFO] ..SUCCESS (2.0 s)
[INFO] Building: MRESOURCES-110/pom.xml
[INFO] run script verify.groovy
[INFO] ..SUCCESS (1.7 s)
[INFO] Building: filter-test-resources/pom.xml
[INFO] run script verify.bsh
[INFO] ..SUCCESS (1.7 s)
[INFO] Building: profile-override/pom.xml
[INFO] run script verify.bsh
[INFO] ..SUCCESS (1.6 s)
[INFO] Building: escapeInterpolation/pom.xml
[INFO] run script verify.bsh
[INFO] ..SUCCESS (1.7 s)
[INFO] Building: MRESOURCES-78/pom.xml
[INFO] run script verify.groovy
[INFO] ..SUCCESS (1.7 s)
[INFO] Building: MRESOURCES-105/pom.xml
[INFO] ..SUCCESS (1.8 s)
[INFO] Building: binaries-filtering/pom.xml
[INFO] run script verify.bsh
[INFO] ..SUCCESS (4.5 s)
[INFO] Building: user-filters/pom.xml
[INFO] run script verify.groovy
[INFO] ..SUCCESS (1.9 s)
[INFO] Building: MRESOURCES-106/pom.xml
[INFO] run script verify.bsh
[INFO] ..SUCCESS (1.8 s)
[INFO] 
[INFO] --- maven-invoker-plugin:1.7:verify (integration-test) @ maven-resources-plugin ---
[INFO] -------------------------------------------------
[INFO] Build Summary:
[INFO]   Passed: 19, Failed: 0, Errors: 0, Skipped: 0
[INFO] -------------------------------------------------
[INFO] 
[INFO] --- maven-install-plugin:2.3.1:install (default-install) @ maven-resources-plugin ---
[INFO] Installing /x1/jenkins/jenkins-slave/workspace/maven-plugins-ITs-m3/maven-resources-plugin/target/maven-resources-plugin-2.7-SNAPSHOT.jar
to /home/jenkins/.m2/repository/org/apache/maven/plugins/maven-resources-plugin/2.7-SNAPSHOT/maven-resources-plugin-2.7-SNAPSHOT.jar
[INFO] Installing /x1/jenkins/jenkins-slave/workspace/maven-plugins-ITs-m3/maven-resources-plugin/pom.xml
to /home/jenkins/.m2/repository/org/apache/maven/plugins/maven-resources-plugin/2.7-SNAPSHOT/maven-resources-plugin-2.7-SNAPSHOT.pom
[INFO] Installing /x1/jenkins/jenkins-slave/workspace/maven-plugins-ITs-m3/maven-resources-plugin/target/maven-resources-plugin-2.7-SNAPSHOT-tests.jar
to /home/jenkins/.m2/repository/org/apache/maven/plugins/maven-resources-plugin/2.7-SNAPSHOT/maven-resources-plugin-2.7-SNAPSHOT-tests.jar
[INFO]                                                                         
[INFO] ------------------------------------------------------------------------
[INFO] Building Maven Site Plugin 3 3.3-SNAPSHOT
[INFO] ------------------------------------------------------------------------
Downloading: http://repository.apache.org/snapshots/org/apache/maven/doxia/doxia-sink-api/1.4-SNAPSHOT/maven-metadata.xml
Downloaded: http://repository.apache.org/snapshots/org/apache/maven/doxia/doxia-sink-api/1.4-SNAPSHOT/maven-metadata.xml
(783 B at 4.8 KB/sec)
Downloading: http://repository.apache.org/snapshots/org/apache/maven/doxia/doxia/1.4-SNAPSHOT/maven-metadata.xml
Downloaded: http://repository.apache.org/snapshots/org/apache/maven/doxia/doxia/1.4-SNAPSHOT/maven-metadata.xml
(812 B at 6.7 KB/sec)
Downloading: http://repository.apache.org/snapshots/org/apache/maven/doxia/doxia-logging-api/1.4-SNAPSHOT/maven-metadata.xml
Downloaded: http://repository.apache.org/snapshots/org/apache/maven/doxia/doxia-logging-api/1.4-SNAPSHOT/maven-metadata.xml
(786 B at 8.4 KB/sec)
Downloading: http://repository.apache.org/snapshots/org/apache/maven/doxia/doxia-core/1.4-SNAPSHOT/maven-metadata.xml
Downloaded: http://repository.apache.org/snapshots/org/apache/maven/doxia/doxia-core/1.4-SNAPSHOT/maven-metadata.xml
(990 B at 9.4 KB/sec)
Downloading: http://repository.apache.org/snapshots/org/apache/maven/doxia/doxia-module-xhtml/1.4-SNAPSHOT/maven-metadata.xml
Downloaded: http://repository.apache.org/snapshots/org/apache/maven/doxia/doxia-module-xhtml/1.4-SNAPSHOT/maven-metadata.xml
(787 B at 8.0 KB/sec)
Downloading: http://repository.apache.org/snapshots/org/apache/maven/doxia/doxia-modules/1.4-SNAPSHOT/maven-metadata.xml
Downloaded: http://repository.apache.org/snapshots/org/apache/maven/doxia/doxia-modules/1.4-SNAPSHOT/maven-metadata.xml
(820 B at 13.3 KB/sec)
Downloading: http://repository.apache.org/snapshots/org/apache/maven/doxia/doxia-module-apt/1.4-SNAPSHOT/maven-metadata.xml
Downloaded: http://repository.apache.org/snapshots/org/apache/maven/doxia/doxia-module-apt/1.4-SNAPSHOT/maven-metadata.xml
(785 B at 8.2 KB/sec)
Downloading: http://repository.apache.org/snapshots/org/apache/maven/doxia/doxia-module-xdoc/1.4-SNAPSHOT/maven-metadata.xml
Downloaded: http://repository.apache.org/snapshots/org/apache/maven/doxia/doxia-module-xdoc/1.4-SNAPSHOT/maven-metadata.xml
(786 B at 8.7 KB/sec)
Downloading: http://repository.apache.org/snapshots/org/apache/maven/doxia/doxia-module-fml/1.4-SNAPSHOT/maven-metadata.xml
Downloaded: http://repository.apache.org/snapshots/org/apache/maven/doxia/doxia-module-fml/1.4-SNAPSHOT/maven-metadata.xml
(785 B at 10.5 KB/sec)
Downloading: http://repository.apache.org/snapshots/org/apache/maven/doxia/doxia-module-markdown/1.4-SNAPSHOT/maven-metadata.xml
Downloaded: http://repository.apache.org/snapshots/org/apache/maven/doxia/doxia-module-markdown/1.4-SNAPSHOT/maven-metadata.xml
(790 B at 6.2 KB/sec)
Downloading: http://repository.apache.org/snapshots/org/apache/maven/doxia/doxia-decoration-model/1.4-SNAPSHOT/maven-metadata.xml
Downloaded: http://repository.apache.org/snapshots/org/apache/maven/doxia/doxia-decoration-model/1.4-SNAPSHOT/maven-metadata.xml
(788 B at 13.5 KB/sec)
Downloading: http://repository.apache.org/snapshots/org/apache/maven/doxia/doxia-sitetools/1.4-SNAPSHOT/maven-metadata.xml
Downloaded: http://repository.apache.org/snapshots/org/apache/maven/doxia/doxia-sitetools/1.4-SNAPSHOT/maven-metadata.xml
(819 B at 11.3 KB/sec)
Downloading: http://repository.apache.org/snapshots/org/apache/maven/doxia/doxia-site-renderer/1.4-SNAPSHOT/maven-metadata.xml
Downloaded: http://repository.apache.org/snapshots/org/apache/maven/doxia/doxia-site-renderer/1.4-SNAPSHOT/maven-metadata.xml
(785 B at 4.8 KB/sec)
[INFO] 
[INFO] --- maven-clean-plugin:2.5:clean (default-clean) @ maven-site-plugin ---
[INFO] Deleting /x1/jenkins/jenkins-slave/workspace/maven-plugins-ITs-m3/maven-site-plugin/target
[INFO] 
[INFO] --- maven-enforcer-plugin:1.0.1:enforce (ensure-no-container-api) @ maven-site-plugin
---
[INFO] 
[INFO] --- maven-plugin-plugin:3.2:helpmojo (generated-helpmojo) @ maven-site-plugin ---
[INFO] Using 'UTF-8' encoding to read mojo metadata.
[INFO] Applying mojo extractor for language: java
[INFO] Mojo extractor for language: java found 0 mojo descriptors.
[INFO] Applying mojo extractor for language: bsh
[INFO] Mojo extractor for language: bsh found 0 mojo descriptors.
[INFO] Applying mojo extractor for language: java-annotations
[INFO] Mojo extractor for language: java-annotations found 0 mojo descriptors.
[INFO] 
[INFO] --- maven-plugin-plugin:3.2:descriptor (default-descriptor) @ maven-site-plugin ---
[INFO] Using 'UTF-8' encoding to read mojo metadata.
[INFO] Applying mojo extractor for language: java
[INFO] Mojo extractor for language: java found 0 mojo descriptors.
[INFO] Applying mojo extractor for language: bsh
[INFO] Mojo extractor for language: bsh found 0 mojo descriptors.
[INFO] Applying mojo extractor for language: java-annotations
[INFO] Mojo extractor for language: java-annotations found 0 mojo descriptors.
[INFO] 
[INFO] --- maven-remote-resources-plugin:1.3:process (default) @ maven-site-plugin ---
[INFO] 
[INFO] --- maven-resources-plugin:2.5:resources (default-resources) @ maven-site-plugin ---
[debug] execute contextualize
[INFO] Using 'UTF-8' encoding to copy filtered resources.
[INFO] Copying 26 resources
[INFO] Copying 3 resources
[INFO] 
[INFO] --- maven-compiler-plugin:2.5.1:compile (default-compile) @ maven-site-plugin ---
[INFO] Compiling 20 source files to /x1/jenkins/jenkins-slave/workspace/maven-plugins-ITs-m3/maven-site-plugin/target/classes
[INFO] 
[INFO] --- plexus-component-metadata:1.5.4:generate-metadata (default) @ maven-site-plugin
---
[INFO] 
[INFO] --- maven-plugin-plugin:3.2:descriptor (mojo-descriptor) @ maven-site-plugin ---
[INFO] Using 'UTF-8' encoding to read mojo metadata.
[INFO] Applying mojo extractor for language: java
[INFO] Mojo extractor for language: java found 0 mojo descriptors.
[INFO] Applying mojo extractor for language: bsh
[INFO] Mojo extractor for language: bsh found 0 mojo descriptors.
[INFO] Applying mojo extractor for language: java-annotations
[ERROR] PermGen space -> [Help 1]
[ERROR] 
[ERROR] To see the full stack trace of the errors, re-run Maven with the -e switch.
[ERROR] Re-run Maven using the -X switch to enable full debug logging.
[ERROR] 
[ERROR] For more information about the errors and possible solutions, please read the following
articles:
[ERROR] [Help 1] http://cwiki.apache.org/confluence/display/MAVEN/OutOfMemoryError
Build step 'Invoke top-level Maven targets' marked build as failure
Recording test results

Mime
View raw message