maven-notifications mailing list archives

Site index · List index
Message view « Date » · « Thread »
Top « Date » · « Thread »
From Apache Jenkins Server <jenk...@builds.apache.org>
Subject Build failed in Jenkins: core-it-maven-3-win #305
Date Sun, 06 Jan 2013 19:01:59 GMT
See <https://builds.apache.org/job/core-it-maven-3-win/305/>

------------------------------------------
[...truncated 7377 lines...]
Downloaded: http://repo.maven.apache.org/maven2/org/codehaus/plexus/plexus-utils/1.5.8/plexus-utils-1.5.8.jar
(262 KB at 3077.4 KB/sec)
Downloading: http://repo.maven.apache.org/maven2/org/mortbay/jetty/servlet-api-2.5/6.1.14/servlet-api-2.5-6.1.14.jar
Downloaded: http://repo.maven.apache.org/maven2/junit/junit/4.8.2/junit-4.8.2.jar (232 KB
at 2389.5 KB/sec)
Downloading: http://repo.maven.apache.org/maven2/org/apache/maven/wagon/wagon-webdav-jackrabbit/2.0/wagon-webdav-jackrabbit-2.0.jar
Downloaded: http://repo.maven.apache.org/maven2/org/apache/maven/shared/maven-verifier/1.4/maven-verifier-1.4.jar
(38 KB at 383.4 KB/sec)
Downloading: http://repo.maven.apache.org/maven2/org/apache/maven/wagon/wagon-http-shared/2.0/wagon-http-shared-2.0.jar
Downloaded: http://repo.maven.apache.org/maven2/org/apache/maven/wagon/wagon-webdav-jackrabbit/2.0/wagon-webdav-jackrabbit-2.0.jar
(19 KB at 347.2 KB/sec)
Downloading: http://repo.maven.apache.org/maven2/org/apache/jackrabbit/jackrabbit-webdav/2.2.5/jackrabbit-webdav-2.2.5.jar
Downloaded: http://repo.maven.apache.org/maven2/org/mortbay/jetty/servlet-api-2.5/6.1.14/servlet-api-2.5-6.1.14.jar
(130 KB at 2084.9 KB/sec)
Downloading: http://repo.maven.apache.org/maven2/org/apache/jackrabbit/jackrabbit-jcr-commons/2.2.5/jackrabbit-jcr-commons-2.2.5.jar
Downloaded: http://repo.maven.apache.org/maven2/org/apache/maven/wagon/wagon-http-shared/2.0/wagon-http-shared-2.0.jar
(26 KB at 349.7 KB/sec)
Downloading: http://repo.maven.apache.org/maven2/org/slf4j/jcl-over-slf4j/1.5.11/jcl-over-slf4j-1.5.11.jar
Downloaded: http://repo.maven.apache.org/maven2/org/slf4j/jcl-over-slf4j/1.5.11/jcl-over-slf4j-1.5.11.jar
(17 KB at 177.7 KB/sec)
Downloading: http://repo.maven.apache.org/maven2/org/apache/maven/wagon/wagon-provider-api/2.0/wagon-provider-api-2.0.jar
Downloaded: http://repo.maven.apache.org/maven2/org/apache/jackrabbit/jackrabbit-jcr-commons/2.2.5/jackrabbit-jcr-commons-2.2.5.jar
(280 KB at 2520.6 KB/sec)
Downloading: http://repo.maven.apache.org/maven2/org/slf4j/slf4j-api/1.6.1/slf4j-api-1.6.1.jar
Downloaded: http://repo.maven.apache.org/maven2/org/apache/jackrabbit/jackrabbit-webdav/2.2.5/jackrabbit-webdav-2.2.5.jar
(282 KB at 1677.5 KB/sec)
Downloading: http://repo.maven.apache.org/maven2/org/slf4j/slf4j-simple/1.6.1/slf4j-simple-1.6.1.jar
Downloaded: http://repo.maven.apache.org/maven2/org/slf4j/slf4j-api/1.6.1/slf4j-api-1.6.1.jar
(25 KB at 371.6 KB/sec)
Downloaded: http://repo.maven.apache.org/maven2/org/mortbay/jetty/jetty-util/6.1.14/jetty-util-6.1.14.jar
(160 KB at 452.6 KB/sec)
Downloaded: http://repo.maven.apache.org/maven2/org/mortbay/jetty/jetty/6.1.14/jetty-6.1.14.jar
(505 KB at 1420.6 KB/sec)
Downloaded: http://repo.maven.apache.org/maven2/org/slf4j/slf4j-simple/1.6.1/slf4j-simple-1.6.1.jar
(8 KB at 49.3 KB/sec)
Downloaded: http://repo.maven.apache.org/maven2/org/apache/maven/wagon/wagon-provider-api/2.0/wagon-provider-api-2.0.jar
(52 KB at 195.7 KB/sec)
[INFO] 
[INFO] --- maven-clean-plugin:2.5:clean (default-clean) @ core-it-suite ---
[INFO] 
[INFO] --- maven-remote-resources-plugin:1.3:process (default) @ core-it-suite ---
[INFO] 
[INFO] --- maven-resources-plugin:2.5:resources (default-resources) @ core-it-suite ---
[debug] execute contextualize
[INFO] Using 'UTF-8' encoding to copy filtered resources.
[INFO] skip non existing resourceDirectory F:\ws\m3-its\core-integration-testing-trunk\core-it-suite\src\main\resources
[INFO] Copying 3 resources
[INFO] 
[INFO] --- maven-compiler-plugin:2.5.1:compile (default-compile) @ core-it-suite ---
[INFO] No sources to compile
[INFO] 
[INFO] --- maven-resources-plugin:2.5:testResources (default-testResources) @ core-it-suite
---
[debug] execute contextualize
[INFO] Using 'UTF-8' encoding to copy filtered resources.
[INFO] Copying 2734 resources
[INFO] Copying 2 resources
[INFO] Copying 3 resources
[INFO] 
[INFO] --- maven-compiler-plugin:2.5.1:testCompile (default-testCompile) @ core-it-suite ---
[INFO] Compiling 570 source files to F:\ws\m3-its\core-integration-testing-trunk\core-it-suite\target\test-classes
[INFO] 
[INFO] --- maven-surefire-plugin:2.12.4:test (default-test) @ core-it-suite ---
[WARNING] useSystemClassloader setting has no effect when not forking
[INFO] Surefire report directory: F:\ws\m3-its\core-integration-testing-trunk\core-it-suite\target\surefire-reports
Downloading: http://repo.maven.apache.org/maven2/org/apache/maven/surefire/surefire-junit4/2.12.4/surefire-junit4-2.12.4.pom
Downloaded: http://repo.maven.apache.org/maven2/org/apache/maven/surefire/surefire-junit4/2.12.4/surefire-junit4-2.12.4.pom
(3 KB at 0.5 KB/sec)
Downloading: http://repo.maven.apache.org/maven2/org/apache/maven/surefire/surefire-junit4/2.12.4/surefire-junit4-2.12.4.jar
Downloaded: http://repo.maven.apache.org/maven2/org/apache/maven/surefire/surefire-junit4/2.12.4/surefire-junit4-2.12.4.jar
(37 KB at 313.5 KB/sec)

-------------------------------------------------------
 T E S T S
-------------------------------------------------------
Running org.apache.maven.it.IntegrationTestSuite
Tests run: 1, Failures: 0, Errors: 1, Skipped: 0, Time elapsed: 0.048 sec <<< FAILURE!
initializationError(org.apache.maven.it.IntegrationTestSuite)  Time elapsed: 0.003 sec  <<<
ERROR!
org.apache.maven.it.VerificationException: Illegal maven output: String 'Maven version: '
not found in the following output:
The system cannot find the path specified.
	at org.apache.maven.it.Verifier.getMavenVersion(Verifier.java:1445)
	at org.apache.maven.it.IntegrationTestSuite.suite(IntegrationTestSuite.java:54)
	at sun.reflect.NativeMethodAccessorImpl.invoke0(Native Method)
	at sun.reflect.NativeMethodAccessorImpl.invoke(NativeMethodAccessorImpl.java:39)
	at sun.reflect.DelegatingMethodAccessorImpl.invoke(DelegatingMethodAccessorImpl.java:25)
	at java.lang.reflect.Method.invoke(Method.java:597)
	at org.junit.internal.runners.SuiteMethod.testFromSuiteMethod(SuiteMethod.java:34)
	at org.junit.internal.runners.SuiteMethod.<init>(SuiteMethod.java:23)
	at org.junit.internal.builders.SuiteMethodBuilder.runnerForClass(SuiteMethodBuilder.java:14)
	at org.junit.runners.model.RunnerBuilder.safeRunnerForClass(RunnerBuilder.java:57)
	at org.junit.internal.builders.AllDefaultPossibilitiesBuilder.runnerForClass(AllDefaultPossibilitiesBuilder.java:29)
	at org.junit.runners.model.RunnerBuilder.safeRunnerForClass(RunnerBuilder.java:57)
	at org.junit.internal.requests.ClassRequest.getRunner(ClassRequest.java:24)
	at org.apache.maven.surefire.junit4.JUnit4Provider.execute(JUnit4Provider.java:250)
	at org.apache.maven.surefire.junit4.JUnit4Provider.executeTestSet(JUnit4Provider.java:141)
	at org.apache.maven.surefire.junit4.JUnit4Provider.invoke(JUnit4Provider.java:112)
	at sun.reflect.NativeMethodAccessorImpl.invoke0(Native Method)
	at sun.reflect.NativeMethodAccessorImpl.invoke(NativeMethodAccessorImpl.java:39)
	at sun.reflect.DelegatingMethodAccessorImpl.invoke(DelegatingMethodAccessorImpl.java:25)
	at java.lang.reflect.Method.invoke(Method.java:597)
	at org.apache.maven.surefire.util.ReflectionUtils.invokeMethodWithArray(ReflectionUtils.java:189)
	at org.apache.maven.surefire.booter.ProviderFactory$ProviderProxy.invoke(ProviderFactory.java:165)
	at org.apache.maven.surefire.booter.ProviderFactory.invokeProvider(ProviderFactory.java:85)
	at org.apache.maven.plugin.surefire.InPluginVMSurefireStarter.runSuitesInProcess(InPluginVMSurefireStarter.java:80)
	at org.apache.maven.plugin.surefire.AbstractSurefireMojo.executeProvider(AbstractSurefireMojo.java:724)
	at org.apache.maven.plugin.surefire.AbstractSurefireMojo.executeAllProviders(AbstractSurefireMojo.java:682)
	at org.apache.maven.plugin.surefire.AbstractSurefireMojo.executeAfterPreconditionsChecked(AbstractSurefireMojo.java:648)
	at org.apache.maven.plugin.surefire.AbstractSurefireMojo.execute(AbstractSurefireMojo.java:586)
	at org.apache.maven.plugin.DefaultBuildPluginManager.executeMojo(DefaultBuildPluginManager.java:101)
	at org.apache.maven.lifecycle.internal.MojoExecutor.execute(MojoExecutor.java:209)
	at org.apache.maven.lifecycle.internal.MojoExecutor.execute(MojoExecutor.java:153)
	at org.apache.maven.lifecycle.internal.MojoExecutor.execute(MojoExecutor.java:145)
	at org.apache.maven.lifecycle.internal.LifecycleModuleBuilder.buildProject(LifecycleModuleBuilder.java:84)
	at org.apache.maven.lifecycle.internal.LifecycleModuleBuilder.buildProject(LifecycleModuleBuilder.java:59)
	at org.apache.maven.lifecycle.internal.LifecycleStarter.singleThreadedBuild(LifecycleStarter.java:183)
	at org.apache.maven.lifecycle.internal.LifecycleStarter.execute(LifecycleStarter.java:161)
	at org.apache.maven.DefaultMaven.doExecute(DefaultMaven.java:320)
	at org.apache.maven.DefaultMaven.execute(DefaultMaven.java:156)
	at org.apache.maven.cli.MavenCli.execute(MavenCli.java:537)
	at org.apache.maven.cli.MavenCli.doMain(MavenCli.java:196)
	at org.apache.maven.cli.MavenCli.main(MavenCli.java:141)
	at sun.reflect.NativeMethodAccessorImpl.invoke0(Native Method)
	at sun.reflect.NativeMethodAccessorImpl.invoke(NativeMethodAccessorImpl.java:39)
	at sun.reflect.DelegatingMethodAccessorImpl.invoke(DelegatingMethodAccessorImpl.java:25)
	at java.lang.reflect.Method.invoke(Method.java:597)
	at org.codehaus.plexus.classworlds.launcher.Launcher.launchEnhanced(Launcher.java:290)
	at org.codehaus.plexus.classworlds.launcher.Launcher.launch(Launcher.java:230)
	at org.codehaus.plexus.classworlds.launcher.Launcher.mainWithExitCode(Launcher.java:409)
	at org.codehaus.plexus.classworlds.launcher.Launcher.main(Launcher.java:352)


Results :

Tests in error: 
  initializationError(org.apache.maven.it.IntegrationTestSuite): Illegal maven output: String
'Maven version: ' not found in the following output:(..)

Tests run: 1, Failures: 0, Errors: 1, Skipped: 0

[INFO] ------------------------------------------------------------------------
[INFO] Reactor Summary:
[INFO] 
[INFO] Maven Core ITs .................................... SUCCESS [30.797s]
[INFO] Maven IT Support .................................. SUCCESS [0.106s]
[INFO] Maven IT :: Plugins ............................... SUCCESS [0.098s]
[INFO] Maven IT Plugin :: Active Collection .............. SUCCESS [10.881s]
[INFO] Maven IT Plugin :: Ant-Based ...................... SUCCESS [4.535s]
[INFO] Maven IT Plugin :: Artifact ....................... SUCCESS [3.412s]
[INFO] Maven IT Plugin :: Class Loader :: Dependency A ... SUCCESS [0.125s]
[INFO] Maven IT Plugin :: Class Loader :: Dependency B ... SUCCESS [0.112s]
[INFO] Maven IT Plugin :: Class Loader :: Dependency C ... SUCCESS [0.063s]
[INFO] Maven IT Plugin :: Class Loader ................... SUCCESS [2.129s]
[INFO] Maven IT Plugin :: Class Loader :: Aggregator ..... SUCCESS [0.027s]
[INFO] Maven IT Plugin :: Configuration .................. SUCCESS [1.024s]
[INFO] Maven IT Plugin :: Context Passing ................ SUCCESS [0.252s]
[INFO] Maven ITs :: Core Plugin Stubs .................... SUCCESS [0.061s]
[INFO] Maven IT Clean Plugin Stub ........................ SUCCESS [0.329s]
[INFO] Maven IT Compiler Plugin Stub ..................... SUCCESS [0.579s]
[INFO] Maven IT Deploy Plugin Stub ....................... SUCCESS [0.303s]
[INFO] Maven IT EAR Plugin Stub .......................... SUCCESS [0.542s]
[INFO] Maven IT EJB Plugin Stub .......................... SUCCESS [0.131s]
[INFO] Maven IT Install Plugin Stub ...................... SUCCESS [0.548s]
[INFO] Maven IT JAR Plugin Stub .......................... SUCCESS [0.303s]
[INFO] Maven IT Javadoc Plugin Stub ...................... SUCCESS [0.280s]
[INFO] Maven IT Plugin Plugin Stub ....................... SUCCESS [0.193s]
[INFO] Maven IT RAR Plugin Stub .......................... SUCCESS [0.150s]
[INFO] Maven IT Resources Plugin Stub .................... SUCCESS [0.158s]
[INFO] Maven IT Site Plugin Stub ......................... SUCCESS [0.228s]
[INFO] Maven IT Source Plugin Stub ....................... SUCCESS [0.303s]
[INFO] Maven IT Surefire Plugin Stub ..................... SUCCESS [0.149s]
[INFO] Maven IT WAR Plugin Stub .......................... SUCCESS [0.533s]
[INFO] Maven IT Plugin :: Dependency Collection .......... SUCCESS [5.118s]
[INFO] Maven IT Plugin :: Dependency Resolution .......... SUCCESS [7.512s]
[INFO] Maven IT Plugin :: Expression ..................... SUCCESS [0.723s]
[INFO] Maven IT Plugin :: Error Mojos .................... SUCCESS [5.240s]
[INFO] Maven IT Component ................................ SUCCESS [0.117s]
[INFO] Maven IT Plugin :: Extension Consumer ............. SUCCESS [0.102s]
[INFO] Maven IT Plugin :: Extension Provider ............. SUCCESS [0.120s]
[INFO] Maven IT Plugin :: Fork ........................... SUCCESS [0.250s]
[INFO] Maven IT Plugin :: Invalid Descriptor ............. SUCCESS [0.091s]
[INFO] Maven IT Plugin :: Log File ....................... SUCCESS [0.132s]
[INFO] Maven IT Plugin :: No Default Component ........... SUCCESS [0.102s]
[INFO] Maven IT Plugin :: No Project ..................... SUCCESS [0.109s]
[INFO] Maven IT Plugin :: Online ......................... SUCCESS [0.087s]
[INFO] Maven IT Plugin :: Optional Mojos ................. SUCCESS [0.437s]
[INFO] Maven IT Plugin :: Packaging ...................... SUCCESS [0.144s]
[INFO] Maven IT Plugin :: Parameter Implementation ....... SUCCESS [0.168s]
[INFO] Maven IT Plugin :: Plugin Dependency .............. SUCCESS [0.235s]
[INFO] Maven IT Plugin :: Project ........................ SUCCESS [0.237s]
[INFO] Maven IT Helper Library ........................... SUCCESS [2.134s]
[INFO] Maven IT Plugin :: Project Interpolation .......... SUCCESS [0.359s]
[INFO] Maven IT Plugin :: Setter ......................... SUCCESS [0.118s]
[INFO] Maven IT Plugin :: Singleton Component ............ SUCCESS [0.442s]
[INFO] Maven IT Plugin :: Site ........................... SUCCESS [0.780s]
[INFO] Maven IT Plugin :: Toolchain ...................... SUCCESS [7.680s]
[INFO] Maven IT Plugin :: Touch .......................... SUCCESS [0.508s]
[INFO] Maven IT Plugin :: Uses Properties Plugin ......... SUCCESS [0.134s]
[INFO] Maven IT Plugin :: Uses Wagon Plugin .............. SUCCESS [1.682s]
[INFO] Maven IT Plugin :: This plugin should contain the mojos needed by all tests.  SUCCESS
[0.500s]
[INFO] Maven IT Plugin :: Plexus Utils 1.1 ............... SUCCESS [0.368s]
[INFO] Maven IT Plugin :: Plexus Utils New ............... SUCCESS [0.565s]
[INFO] Maven IT Plugin :: Plexus Component API ........... SUCCESS [0.972s]
[INFO] Maven IT Plugin :: Log4J Client ................... SUCCESS [0.528s]
[INFO] Maven IT Plugin :: Extension 1 .................... SUCCESS [0.760s]
[INFO] Maven IT Plugin :: Extension 2 .................... SUCCESS [0.676s]
[INFO] Maven IT Plugin :: Plexus Lifecycle ............... SUCCESS [1.634s]
[INFO] Maven IT Plugin :: Settings ....................... SUCCESS [1.327s]
[INFO] Maven IT Toolchain ................................ SUCCESS [0.515s]
[INFO] Maven IT Wagon .................................... SUCCESS [1.157s]
[INFO] Maven IT Support Artifacts ........................ SUCCESS [3.381s]
[INFO] Maven IT Extension ................................ SUCCESS [0.052s]
[INFO] Maven ITs ......................................... FAILURE [39.936s]
[INFO] ------------------------------------------------------------------------
[INFO] BUILD FAILURE
[INFO] ------------------------------------------------------------------------
[INFO] Total time: 2:29.738s
[INFO] Finished at: Sun Jan 06 19:01:55 GMT 2013
[INFO] Final Memory: 40M/748M
[INFO] ------------------------------------------------------------------------
[ERROR] Failed to execute goal org.apache.maven.plugins:maven-surefire-plugin:2.12.4:test
(default-test) on project core-it-suite: There are test failures.
[ERROR] 
[ERROR] Please refer to F:\ws\m3-its\core-integration-testing-trunk\core-it-suite\target\surefire-reports
for the individual test results.
[ERROR] -> [Help 1]
org.apache.maven.lifecycle.LifecycleExecutionException: Failed to execute goal org.apache.maven.plugins:maven-surefire-plugin:2.12.4:test
(default-test) on project core-it-suite: There are test failures.

Please refer to F:\ws\m3-its\core-integration-testing-trunk\core-it-suite\target\surefire-reports
for the individual test results.
	at org.apache.maven.lifecycle.internal.MojoExecutor.execute(MojoExecutor.java:213)
	at org.apache.maven.lifecycle.internal.MojoExecutor.execute(MojoExecutor.java:153)
	at org.apache.maven.lifecycle.internal.MojoExecutor.execute(MojoExecutor.java:145)
	at org.apache.maven.lifecycle.internal.LifecycleModuleBuilder.buildProject(LifecycleModuleBuilder.java:84)
	at org.apache.maven.lifecycle.internal.LifecycleModuleBuilder.buildProject(LifecycleModuleBuilder.java:59)
	at org.apache.maven.lifecycle.internal.LifecycleStarter.singleThreadedBuild(LifecycleStarter.java:183)
	at org.apache.maven.lifecycle.internal.LifecycleStarter.execute(LifecycleStarter.java:161)
	at org.apache.maven.DefaultMaven.doExecute(DefaultMaven.java:320)
	at org.apache.maven.DefaultMaven.execute(DefaultMaven.java:156)
	at org.apache.maven.cli.MavenCli.execute(MavenCli.java:537)
	at org.apache.maven.cli.MavenCli.doMain(MavenCli.java:196)
	at org.apache.maven.cli.MavenCli.main(MavenCli.java:141)
	at sun.reflect.NativeMethodAccessorImpl.invoke0(Native Method)
	at sun.reflect.NativeMethodAccessorImpl.invoke(NativeMethodAccessorImpl.java:39)
	at sun.reflect.DelegatingMethodAccessorImpl.invoke(DelegatingMethodAccessorImpl.java:25)
	at java.lang.reflect.Method.invoke(Method.java:597)
	at org.codehaus.plexus.classworlds.launcher.Launcher.launchEnhanced(Launcher.java:290)
	at org.codehaus.plexus.classworlds.launcher.Launcher.launch(Launcher.java:230)
	at org.codehaus.plexus.classworlds.launcher.Launcher.mainWithExitCode(Launcher.java:409)
	at org.codehaus.plexus.classworlds.launcher.Launcher.main(Launcher.java:352)
Caused by: org.apache.maven.plugin.MojoFailureException: There are test failures.

Please refer to F:\ws\m3-its\core-integration-testing-trunk\core-it-suite\target\surefire-reports
for the individual test results.
	at org.apache.maven.plugin.surefire.SurefireHelper.reportExecution(SurefireHelper.java:83)
	at org.apache.maven.plugin.surefire.SurefirePlugin.writeSummary(SurefirePlugin.java:176)
	at org.apache.maven.plugin.surefire.SurefirePlugin.handleSummary(SurefirePlugin.java:150)
	at org.apache.maven.plugin.surefire.AbstractSurefireMojo.executeAfterPreconditionsChecked(AbstractSurefireMojo.java:650)
	at org.apache.maven.plugin.surefire.AbstractSurefireMojo.execute(AbstractSurefireMojo.java:586)
	at org.apache.maven.plugin.DefaultBuildPluginManager.executeMojo(DefaultBuildPluginManager.java:101)
	at org.apache.maven.lifecycle.internal.MojoExecutor.execute(MojoExecutor.java:209)
	... 19 more
[ERROR] 
[ERROR] Re-run Maven using the -X switch to enable full debug logging.
[ERROR] 
[ERROR] For more information about the errors and possible solutions, please read the following
articles:
[ERROR] [Help 1] http://cwiki.apache.org/confluence/display/MAVEN/MojoFailureException
[ERROR] 
[ERROR] After correcting the problems, you can resume the build with the command
[ERROR]   mvn <goals> -rf :core-it-suite
Build step 'Invoke top-level Maven targets' marked build as failure
Recording test results

Mime
View raw message