maven-notifications mailing list archives

Site index · List index
Message view « Date » · « Thread »
Top « Date » · « Thread »
From Apache Jenkins Server <jenk...@builds.apache.org>
Subject Build failed in Jenkins: maven-plugins-ITs-m3.0.3 #109
Date Thu, 20 Dec 2012 12:10:48 GMT
See <https://builds.apache.org/job/maven-plugins-ITs-m3.0.3/109/changes>

Changes:

[olamy] add license header

[olamy] missed to add it.

[olamy] [MCOMPILER-192] Compiler includes non java files
use last plexus-compiler snapshot

[olamy] add plugin version

------------------------------------------
[...truncated 10127 lines...]
[INFO] Installing /x1/jenkins/jenkins-slave/workspace/maven-plugins-ITs-m3.0.3/maven-shade-plugin/pom.xml
to /x1/jenkins/jenkins-slave/workspace/maven-plugins-ITs-m3.0.3/maven-shade-plugin/target/local-repo/org/apache/maven/plugins/maven-shade-plugin/3.0-SNAPSHOT/maven-shade-plugin-3.0-SNAPSHOT.pom
[INFO] Installing /x1/jenkins/jenkins-slave/workspace/maven-plugins-ITs-m3.0.3/maven-shade-plugin/target/maven-shade-plugin-3.0-SNAPSHOT.jar
to /x1/jenkins/jenkins-slave/workspace/maven-plugins-ITs-m3.0.3/maven-shade-plugin/target/local-repo/org/apache/maven/plugins/maven-shade-plugin/3.0-SNAPSHOT/maven-shade-plugin-3.0-SNAPSHOT.jar
[INFO] Installing /x1/jenkins/jenkins-slave/workspace/maven-plugins-ITs-m3.0.3/maven-shade-plugin/target/maven-shade-plugin-3.0-SNAPSHOT-tests.jar
to /x1/jenkins/jenkins-slave/workspace/maven-plugins-ITs-m3.0.3/maven-shade-plugin/target/local-repo/org/apache/maven/plugins/maven-shade-plugin/3.0-SNAPSHOT/maven-shade-plugin-3.0-SNAPSHOT-tests.jar
[INFO] 
[INFO] --- maven-invoker-plugin:1.6:integration-test (integration-test) @ maven-shade-plugin
---
[INFO] Building: project-with-reactors-included/pom.xml
[INFO] run script /x1/jenkins/jenkins-slave/workspace/maven-plugins-ITs-m3.0.3/maven-shade-plugin/target/it/project-with-reactors-included/verify.bsh
[INFO] ..SUCCESS (4.1 s)
[INFO] Building: manifest-retained/pom.xml
[INFO] run script /x1/jenkins/jenkins-slave/workspace/maven-plugins-ITs-m3.0.3/maven-shade-plugin/target/it/manifest-retained/verify.bsh
[INFO] ..SUCCESS (3.6 s)
[INFO] Building: duplicate-classes-with-reloc/pom.xml
[INFO] ..SUCCESS (2.3 s)
[INFO] Building: dep-reduced-pom/pom.xml
[INFO] run script /x1/jenkins/jenkins-slave/workspace/maven-plugins-ITs-m3.0.3/maven-shade-plugin/target/it/dep-reduced-pom/verify.groovy
[INFO] ..SUCCESS (2.8 s)
[INFO] Building: dep-reduced-pom-with-local-parent/pom.xml
[INFO] ..SUCCESS (2.2 s)
[INFO] Building: mshade-123/pom.xml
[INFO] ..SUCCESS (3.9 s)
[INFO] Building: finalNameBuild/pom.xml
[INFO] run script /x1/jenkins/jenkins-slave/workspace/maven-plugins-ITs-m3.0.3/maven-shade-plugin/target/it/finalNameBuild/setup.bsh
[INFO] run script /x1/jenkins/jenkins-slave/workspace/maven-plugins-ITs-m3.0.3/maven-shade-plugin/target/it/finalNameBuild/verify.bsh
[INFO] ..SUCCESS (2.8 s)
[INFO] Building: empty-relocation-pattern/pom.xml
[INFO] ..SUCCESS (3.0 s)
[INFO] Building: non-runtime-scope-excluded/pom.xml
[INFO] run script /x1/jenkins/jenkins-slave/workspace/maven-plugins-ITs-m3.0.3/maven-shade-plugin/target/it/non-runtime-scope-excluded/verify.bsh
[INFO] ..SUCCESS (3.1 s)
[INFO] Building: attach-after-lifecycle-fork/pom.xml
[INFO] run script /x1/jenkins/jenkins-slave/workspace/maven-plugins-ITs-m3.0.3/maven-shade-plugin/target/it/attach-after-lifecycle-fork/setup.bsh
[INFO] run script /x1/jenkins/jenkins-slave/workspace/maven-plugins-ITs-m3.0.3/maven-shade-plugin/target/it/attach-after-lifecycle-fork/verify.bsh
[INFO] ..SUCCESS (2.4 s)
[INFO] Building: empty-relocation-shaded-pattern/pom.xml
[INFO] ..SUCCESS (2.7 s)
[INFO] Building: MSHADE-105/pom.xml
[INFO] run script /x1/jenkins/jenkins-slave/workspace/maven-plugins-ITs-m3.0.3/maven-shade-plugin/target/it/MSHADE-105/verify.bsh
[INFO] ..SUCCESS (4.9 s)
[INFO] Building: rerun-without-reloc/pom.xml
[INFO] ..SUCCESS (3.1 s)
[INFO] Building: users-shader-impl/pom.xml
[INFO] run script /x1/jenkins/jenkins-slave/workspace/maven-plugins-ITs-m3.0.3/maven-shade-plugin/target/it/users-shader-impl/verify.groovy
[INFO] ..SUCCESS (3.6 s)
[INFO] Building: finalNameBuild-attached/pom.xml
[INFO] run script /x1/jenkins/jenkins-slave/workspace/maven-plugins-ITs-m3.0.3/maven-shade-plugin/target/it/finalNameBuild-attached/setup.bsh
[INFO] run script /x1/jenkins/jenkins-slave/workspace/maven-plugins-ITs-m3.0.3/maven-shade-plugin/target/it/finalNameBuild-attached/verify.bsh
[INFO] ..SUCCESS (2.9 s)
[INFO] Building: reloc-enum-ref-from-anno/pom.xml
[INFO] ..SUCCESS (2.6 s)
[INFO] Building: xml-transformer-ignores-dtd/pom.xml
[INFO] run script /x1/jenkins/jenkins-slave/workspace/maven-plugins-ITs-m3.0.3/maven-shade-plugin/target/it/xml-transformer-ignores-dtd/verify.bsh
[INFO] ..SUCCESS (2.9 s)
[INFO] Building: empty-apache-notice-transform/pom.xml
[INFO] ..SUCCESS (3.3 s)
[INFO] Building: duplicate-classes-without-reloc/pom.xml
[INFO] ..SUCCESS (2.6 s)
[INFO] Building: component-descriptor-relocation/pom.xml
[INFO] ..SUCCESS (3.3 s)
[INFO] Building: manifest-transformed/pom.xml
[INFO] run script /x1/jenkins/jenkins-slave/workspace/maven-plugins-ITs-m3.0.3/maven-shade-plugin/target/it/manifest-transformed/verify.bsh
[INFO] ..SUCCESS (3.6 s)
[INFO] Building: mini-jar-malformed-dependencies/pom.xml
[INFO] ..SUCCESS (5.1 s)
[INFO] Building: finalNameShade/pom.xml
[INFO] run script /x1/jenkins/jenkins-slave/workspace/maven-plugins-ITs-m3.0.3/maven-shade-plugin/target/it/finalNameShade/setup.bsh
[INFO] run script /x1/jenkins/jenkins-slave/workspace/maven-plugins-ITs-m3.0.3/maven-shade-plugin/target/it/finalNameShade/verify.bsh
[INFO] ..SUCCESS (3.1 s)
[INFO] Building: dep-reduced-pom-relocated-result/pom.xml
[INFO] ..SUCCESS (2.5 s)
[INFO] Building: reloc-abs-resource-path/pom.xml
[INFO] ..SUCCESS (4.3 s)
[INFO] Building: pom-packaging/pom.xml
[INFO] run script /x1/jenkins/jenkins-slave/workspace/maven-plugins-ITs-m3.0.3/maven-shade-plugin/target/it/pom-packaging/verify.bsh
[INFO] ..SUCCESS (1.9 s)
[INFO] Building: artifact-includes-excludes/pom.xml
[INFO] run script /x1/jenkins/jenkins-slave/workspace/maven-plugins-ITs-m3.0.3/maven-shade-plugin/target/it/artifact-includes-excludes/verify.bsh
[INFO] ..SUCCESS (3.0 s)
[INFO] Building: mini-jar-respect-includes/pom.xml
[INFO] run script /x1/jenkins/jenkins-slave/workspace/maven-plugins-ITs-m3.0.3/maven-shade-plugin/target/it/mini-jar-respect-includes/verify.bsh
[INFO] ..SUCCESS (3.6 s)
[INFO] Building: dep-reduced-pom-unique/pom.xml
[INFO] run script /x1/jenkins/jenkins-slave/workspace/maven-plugins-ITs-m3.0.3/maven-shade-plugin/target/it/dep-reduced-pom-unique/verify.groovy
[INFO] ..SUCCESS (3.6 s)
[INFO] Building: services-resource-transformer/pom.xml
[INFO] run script /x1/jenkins/jenkins-slave/workspace/maven-plugins-ITs-m3.0.3/maven-shade-plugin/target/it/services-resource-transformer/verify.bsh
[INFO] ..SUCCESS (3.1 s)
[INFO] Building: shadePomDependency/pom.xml
[INFO] ..SUCCESS (3.5 s)
[INFO] Building: reloc-includes-excludes/pom.xml
[INFO] run script /x1/jenkins/jenkins-slave/workspace/maven-plugins-ITs-m3.0.3/maven-shade-plugin/target/it/reloc-includes-excludes/verify.bsh
[INFO] ..SUCCESS (3.3 s)
[INFO] Building: rerun-with-reloc/pom.xml
[INFO] ..SUCCESS (4.6 s)
[INFO] Building: mini-jar-package-info/pom.xml
[INFO] run script /x1/jenkins/jenkins-slave/workspace/maven-plugins-ITs-m3.0.3/maven-shade-plugin/target/it/mini-jar-package-info/verify.bsh
[INFO] ..SUCCESS (3.6 s)
[INFO] Building: attached-artifact-type/pom.xml
[INFO] ..SUCCESS (2.3 s)
[INFO] Building: implicit-inclusion-of-project-artifact/pom.xml
[INFO] run script /x1/jenkins/jenkins-slave/workspace/maven-plugins-ITs-m3.0.3/maven-shade-plugin/target/it/implicit-inclusion-of-project-artifact/verify.bsh
[INFO] ..SUCCESS (3.2 s)
[INFO] Building: finalNameShade-attached/pom.xml
[INFO] run script /x1/jenkins/jenkins-slave/workspace/maven-plugins-ITs-m3.0.3/maven-shade-plugin/target/it/finalNameShade-attached/setup.bsh
[INFO] run script /x1/jenkins/jenkins-slave/workspace/maven-plugins-ITs-m3.0.3/maven-shade-plugin/target/it/finalNameShade-attached/verify.bsh
[INFO] ..SUCCESS (3.5 s)
[INFO] Building: mini-jar/pom.xml
[INFO] run script /x1/jenkins/jenkins-slave/workspace/maven-plugins-ITs-m3.0.3/maven-shade-plugin/target/it/mini-jar/verify.bsh
[INFO] ..SUCCESS (3.3 s)
[INFO] Building: reloc-anno/pom.xml
[INFO] ..SUCCESS (2.8 s)
[INFO] Building: filter-artifact-contents/pom.xml
[INFO] run script /x1/jenkins/jenkins-slave/workspace/maven-plugins-ITs-m3.0.3/maven-shade-plugin/target/it/filter-artifact-contents/verify.bsh
[INFO] ..SUCCESS (3.0 s)
[INFO] Building: plugin-descriptor-relocation/pom.xml
[INFO] run script /x1/jenkins/jenkins-slave/workspace/maven-plugins-ITs-m3.0.3/maven-shade-plugin/target/it/plugin-descriptor-relocation/verify.groovy
[INFO] ..SUCCESS (5.6 s)
[INFO] Building: reloc-class-from-string-pool/pom.xml
[INFO] ..SUCCESS (2.6 s)
[INFO] 
[INFO] --- maven-invoker-plugin:1.6:verify (integration-test) @ maven-shade-plugin ---
[INFO] -------------------------------------------------
[INFO] Build Summary:
[INFO]   Passed: 42, Failed: 0, Errors: 0, Skipped: 0
[INFO] -------------------------------------------------
[INFO] 
[INFO] --- maven-install-plugin:2.3.1:install (default-install) @ maven-shade-plugin ---
[INFO] Installing /x1/jenkins/jenkins-slave/workspace/maven-plugins-ITs-m3.0.3/maven-shade-plugin/target/maven-shade-plugin-3.0-SNAPSHOT.jar
to /home/jenkins/.m2/repository/org/apache/maven/plugins/maven-shade-plugin/3.0-SNAPSHOT/maven-shade-plugin-3.0-SNAPSHOT.jar
[INFO] Installing /x1/jenkins/jenkins-slave/workspace/maven-plugins-ITs-m3.0.3/maven-shade-plugin/pom.xml
to /home/jenkins/.m2/repository/org/apache/maven/plugins/maven-shade-plugin/3.0-SNAPSHOT/maven-shade-plugin-3.0-SNAPSHOT.pom
[INFO] Installing /x1/jenkins/jenkins-slave/workspace/maven-plugins-ITs-m3.0.3/maven-shade-plugin/target/maven-shade-plugin-3.0-SNAPSHOT-tests.jar
to /home/jenkins/.m2/repository/org/apache/maven/plugins/maven-shade-plugin/3.0-SNAPSHOT/maven-shade-plugin-3.0-SNAPSHOT-tests.jar
[INFO]                                                                         
[INFO] ------------------------------------------------------------------------
[INFO] Building Maven Plugins Aggregator 1-SNAPSHOT
[INFO] ------------------------------------------------------------------------
[INFO] 
[INFO] --- maven-clean-plugin:2.4.1:clean (default-clean) @ maven-plugins-aggregator ---
[INFO] Deleting /x1/jenkins/jenkins-slave/workspace/maven-plugins-ITs-m3.0.3/target
[INFO] 
[INFO] --- maven-remote-resources-plugin:1.1:process (default) @ maven-plugins-aggregator
---
[INFO] 
[INFO] --- maven-install-plugin:2.3.1:install (default-install) @ maven-plugins-aggregator
---
[INFO] Installing /x1/jenkins/jenkins-slave/workspace/maven-plugins-ITs-m3.0.3/pom.xml to
/home/jenkins/.m2/repository/org/apache/maven/plugins/maven-plugins-aggregator/1-SNAPSHOT/maven-plugins-aggregator-1-SNAPSHOT.pom
[INFO] ------------------------------------------------------------------------
[INFO] Reactor Summary:
[INFO] 
[INFO] Maven Plugins ..................................... SUCCESS [4.284s]
[INFO] Maven ACR Plugin .................................. SUCCESS [30.037s]
[INFO] Maven Ant Plugin .................................. SUCCESS [1:03.029s]
[INFO] Maven AntRun Plugin ............................... SUCCESS [43.707s]
[INFO] Maven Eclipse Plugin .............................. SUCCESS [5:10.841s]
[INFO] Maven Assembly Plugin ............................. SUCCESS [8:31.246s]
[INFO] Maven Changelog Plugin ............................ SUCCESS [30.886s]
[INFO] Maven Changes Report Plugin ....................... FAILURE [7.351s]
[INFO] Maven Checkstyle Plugin ........................... SUCCESS [1:19.079s]
[INFO] Maven Clean Plugin ................................ SUCCESS [16.744s]
[INFO] Maven Compiler Plugin ............................. SUCCESS [1:06.733s]
[INFO] Maven Dependency Plugin ........................... SUCCESS [1:57.370s]
[INFO] Maven Deploy Plugin ............................... SUCCESS [55.639s]
[INFO] Maven DOAP Plugin ................................. SUCCESS [12.924s]
[INFO] Maven Documentation Checker Plugin ................ SUCCESS [5.742s]
[INFO] Maven EAR Plugin .................................. SUCCESS [2:59.706s]
[INFO] Maven EJB Plugin .................................. SUCCESS [19.942s]
[INFO] Maven GPG Plugin .................................. SUCCESS [8.945s]
[INFO] Maven Help Plugin ................................. SUCCESS [27.493s]
[INFO] Maven IDEA Plugin ................................. SUCCESS [6.421s]
[INFO] Maven Install Plugin .............................. SUCCESS [36.594s]
[INFO] Maven JAR Plugin .................................. SUCCESS [58.477s]
[INFO] Maven Jarsigner Plugin ............................ SUCCESS [19.992s]
[INFO] Maven Javadoc Plugin .............................. SUCCESS [2:13.720s]
[INFO] Maven Linkcheck Plugin ............................ SUCCESS [2.522s]
[INFO] Maven One Plugin .................................. SUCCESS [1.352s]
[INFO] Maven Patch Plugin ................................ SUCCESS [10.586s]
[INFO] Maven PDF Plugin .................................. SUCCESS [26.263s]
[INFO] Maven PMD Plugin .................................. SUCCESS [34.480s]
[INFO] Maven RAR Plugin .................................. SUCCESS [8.902s]
[INFO] Maven Reactor Plugin .............................. SUCCESS [1.577s]
[INFO] Maven Repository Plugin ........................... SUCCESS [31.295s]
[INFO] Maven Resources Plugin ............................ SUCCESS [43.716s]
[INFO] Maven Site Plugin 3 ............................... SUCCESS [5:17.291s]
[INFO] Maven Source Plugin ............................... SUCCESS [34.915s]
[INFO] Maven Stage Plugin ................................ SUCCESS [1.610s]
[INFO] Maven Toolchains Plugin ........................... SUCCESS [1.254s]
[INFO] Maven Verifier Plugin ............................. SUCCESS [13.335s]
[INFO] Maven WAR Plugin .................................. SUCCESS [55.651s]
[INFO] Maven SCM Publish Plugin .......................... SUCCESS [37.829s]
[INFO] Maven Invoker Plugin .............................. SUCCESS [3:39.777s]
[INFO] Maven Project Info Reports Plugin ................. SUCCESS [1:59.010s]
[INFO] Maven Remote Resources Plugin ..................... SUCCESS [48.674s]
[INFO] Maven Shade Plugin ................................ SUCCESS [2:33.249s]
[INFO] Maven Plugins Aggregator .......................... SUCCESS [0.034s]
[INFO] ------------------------------------------------------------------------
[INFO] BUILD FAILURE
[INFO] ------------------------------------------------------------------------
[INFO] Total time: 50:11.532s
[INFO] Finished at: Thu Dec 20 12:10:39 GMT 2012
[INFO] Final Memory: 107M/552M
[INFO] ------------------------------------------------------------------------
[WARNING] The requested profile "apache.snapshots" could not be activated because it does
not exist.
[ERROR] Failed to execute goal org.apache.maven.plugins:maven-compiler-plugin:2.5.1:compile
(default-compile) on project maven-changes-plugin: Compilation failure: Compilation failure:
[ERROR] /x1/jenkins/jenkins-slave/workspace/maven-plugins-ITs-m3.0.3/maven-changes-plugin/target/generated-sources/modello/org/apache/maven/plugins/changes/model/Release.java:[184,33]
[unchecked] unchecked call to add(E) as a member of the raw type java.util.List
[ERROR] /x1/jenkins/jenkins-slave/workspace/maven-plugins-ITs-m3.0.3/maven-changes-plugin/target/generated-sources/modello/org/apache/maven/plugins/changes/model/Release.java:[198,32]
[unchecked] unchecked call to add(E) as a member of the raw type java.util.List
[ERROR] /x1/jenkins/jenkins-slave/workspace/maven-plugins-ITs-m3.0.3/maven-changes-plugin/src/main/java/org/apache/maven/plugin/changes/ReleaseUtils.java:[231,61]
[unchecked] unchecked conversion
[ERROR] found   : java.util.List
[ERROR] required: java.util.List<org.apache.maven.plugins.changes.model.Release>
[ERROR] /x1/jenkins/jenkins-slave/workspace/maven-plugins-ITs-m3.0.3/maven-changes-plugin/src/main/java/org/apache/maven/plugin/changes/ReleaseUtils.java:[235,34]
[unchecked] unchecked call to add(E) as a member of the raw type java.util.List
[ERROR] /x1/jenkins/jenkins-slave/workspace/maven-plugins-ITs-m3.0.3/maven-changes-plugin/src/main/java/org/apache/maven/plugin/changes/ReleaseUtils.java:[242,54]
[unchecked] unchecked conversion
[ERROR] found   : java.util.List
[ERROR] required: java.util.List<org.apache.maven.plugins.changes.model.Release>
[ERROR] /x1/jenkins/jenkins-slave/workspace/maven-plugins-ITs-m3.0.3/maven-changes-plugin/src/main/java/org/apache/maven/plugin/changes/ReleaseUtils.java:[249,34]
[unchecked] unchecked call to add(E) as a member of the raw type java.util.List
[ERROR] /x1/jenkins/jenkins-slave/workspace/maven-plugins-ITs-m3.0.3/maven-changes-plugin/src/main/java/org/apache/maven/plugin/changes/AbstractChangesReport.java:[180,12]
[deprecation] generate(org.codehaus.doxia.sink.Sink,java.util.Locale) in org.apache.maven.reporting.AbstractMavenReport
has been deprecated
[ERROR] /x1/jenkins/jenkins-slave/workspace/maven-plugins-ITs-m3.0.3/maven-changes-plugin/target/generated-sources/modello/org/apache/maven/plugins/changes/model/io/xpp3/ChangesXpp3Reader.java:[83,18]
[unchecked] unchecked call to add(E) as a member of the raw type java.util.Set
[ERROR] /x1/jenkins/jenkins-slave/workspace/maven-plugins-ITs-m3.0.3/maven-changes-plugin/target/generated-sources/modello/org/apache/maven/plugins/changes/model/io/xpp3/ChangesXpp3Reader.java:[491,43]
[unchecked] unchecked conversion
[ERROR] found   : java.util.List
[ERROR] required: java.util.List<org.apache.maven.plugins.changes.model.FixedIssue>
[ERROR] /x1/jenkins/jenkins-slave/workspace/maven-plugins-ITs-m3.0.3/maven-changes-plugin/target/generated-sources/modello/org/apache/maven/plugins/changes/model/io/xpp3/ChangesXpp3Reader.java:[493,31]
[unchecked] unchecked call to add(E) as a member of the raw type java.util.List
[ERROR] /x1/jenkins/jenkins-slave/workspace/maven-plugins-ITs-m3.0.3/maven-changes-plugin/target/generated-sources/modello/org/apache/maven/plugins/changes/model/io/xpp3/ChangesXpp3Reader.java:[501,38]
[unchecked] unchecked conversion
[ERROR] found   : java.util.List
[ERROR] required: java.util.List<org.apache.maven.plugins.changes.model.DueTo>
[ERROR] /x1/jenkins/jenkins-slave/workspace/maven-plugins-ITs-m3.0.3/maven-changes-plugin/target/generated-sources/modello/org/apache/maven/plugins/changes/model/io/xpp3/ChangesXpp3Reader.java:[503,26]
[unchecked] unchecked call to add(E) as a member of the raw type java.util.List
[ERROR] /x1/jenkins/jenkins-slave/workspace/maven-plugins-ITs-m3.0.3/maven-changes-plugin/target/generated-sources/modello/org/apache/maven/plugins/changes/model/io/xpp3/ChangesXpp3Reader.java:[586,38]
[unchecked] unchecked conversion
[ERROR] found   : java.util.List
[ERROR] required: java.util.List<org.apache.maven.plugins.changes.model.Release>
[ERROR] /x1/jenkins/jenkins-slave/workspace/maven-plugins-ITs-m3.0.3/maven-changes-plugin/target/generated-sources/modello/org/apache/maven/plugins/changes/model/io/xpp3/ChangesXpp3Reader.java:[588,28]
[unchecked] unchecked call to add(E) as a member of the raw type java.util.List
[ERROR] /x1/jenkins/jenkins-slave/workspace/maven-plugins-ITs-m3.0.3/maven-changes-plugin/target/generated-sources/modello/org/apache/maven/plugins/changes/model/io/xpp3/ChangesXpp3Reader.java:[681,38]
[unchecked] unchecked conversion
[ERROR] found   : java.util.List
[ERROR] required: java.util.List<org.apache.maven.plugins.changes.model.Action>
[ERROR] /x1/jenkins/jenkins-slave/workspace/maven-plugins-ITs-m3.0.3/maven-changes-plugin/target/generated-sources/modello/org/apache/maven/plugins/changes/model/io/xpp3/ChangesXpp3Reader.java:[686,35]
[unchecked] unchecked call to add(E) as a member of the raw type java.util.List
[ERROR] /x1/jenkins/jenkins-slave/workspace/maven-plugins-ITs-m3.0.3/maven-changes-plugin/target/generated-sources/modello/org/apache/maven/plugins/changes/model/io/xpp3/ChangesXpp3Reader.java:[863,40]
[unchecked] unchecked conversion
[ERROR] found   : java.util.List
[ERROR] required: java.util.List<org.apache.maven.plugins.changes.model.Action>
[ERROR] /x1/jenkins/jenkins-slave/workspace/maven-plugins-ITs-m3.0.3/maven-changes-plugin/target/generated-sources/modello/org/apache/maven/plugins/changes/model/io/xpp3/ChangesXpp3Reader.java:[865,27]
[unchecked] unchecked call to add(E) as a member of the raw type java.util.List
[ERROR] /x1/jenkins/jenkins-slave/workspace/maven-plugins-ITs-m3.0.3/maven-changes-plugin/src/main/java/org/apache/maven/plugin/changes/FeedGenerator.java:[212,18]
cannot find symbol
[ERROR] symbol  : constructor IOException(com.sun.syndication.io.FeedException)
[ERROR] location: class java.io.IOException
[ERROR] /x1/jenkins/jenkins-slave/workspace/maven-plugins-ITs-m3.0.3/maven-changes-plugin/src/main/java/org/apache/maven/plugin/changes/ChangesMojo.java:[524,50]
[unchecked] unchecked conversion
[ERROR] found   : java.util.List
[ERROR] required: java.util.List<org.apache.maven.plugins.changes.model.Release>
[ERROR] /x1/jenkins/jenkins-slave/workspace/maven-plugins-ITs-m3.0.3/maven-changes-plugin/src/main/java/org/apache/maven/plugin/changes/schema/DefaultChangesSchemaValidator.java:[108,32]
[unchecked] unchecked call to put(K,V) as a member of the raw type java.util.Map
[ERROR] -> [Help 1]
[ERROR] 
[ERROR] To see the full stack trace of the errors, re-run Maven with the -e switch.
[ERROR] Re-run Maven using the -X switch to enable full debug logging.
[ERROR] 
[ERROR] For more information about the errors and possible solutions, please read the following
articles:
[ERROR] [Help 1] http://cwiki.apache.org/confluence/display/MAVEN/MojoFailureException
[ERROR] 
[ERROR] After correcting the problems, you can resume the build with the command
[ERROR]   mvn <goals> -rf :maven-changes-plugin
Build step 'Invoke top-level Maven targets' marked build as failure
Recording test results

Mime
View raw message