maven-notifications mailing list archives

Site index · List index
Message view « Date » · « Thread »
Top « Date » · « Thread »
From Apache Jenkins Server <jenk...@builds.apache.org>
Subject Build failed in Jenkins: maven-plugins-ITs-m3-windows #91
Date Sat, 15 Dec 2012 02:12:14 GMT
See <https://builds.apache.org/job/maven-plugins-ITs-m3-windows/91/changes>

Changes:

[hboutemy] removed configuration inherited from parent

------------------------------------------
[...truncated 9501 lines...]
Running org.apache.maven.plugins.shade.mojo.ArtifactSelectorTest
Tests run: 1, Failures: 0, Errors: 0, Skipped: 0, Time elapsed: 0 sec
Running org.apache.maven.plugins.shade.mojo.RelativizePathTest
Tests run: 1, Failures: 0, Errors: 0, Skipped: 0, Time elapsed: 0.111 sec
Running org.apache.maven.plugins.shade.mojo.ShadeMojoTest
Tests run: 4, Failures: 0, Errors: 0, Skipped: 0, Time elapsed: 5.155 sec
Running org.apache.maven.plugins.shade.relocation.SimpleRelocatorParameterTest
Tests run: 2, Failures: 0, Errors: 0, Skipped: 0, Time elapsed: 0.066 sec
Running org.apache.maven.plugins.shade.relocation.SimpleRelocatorTest
Tests run: 7, Failures: 0, Errors: 0, Skipped: 0, Time elapsed: 0 sec
Running org.apache.maven.plugins.shade.resource.ApacheLicenseResourceTransformerTest
Tests run: 1, Failures: 0, Errors: 0, Skipped: 0, Time elapsed: 0.001 sec
Running org.apache.maven.plugins.shade.resource.ApacheNoticeResourceTransformerTest
Tests run: 1, Failures: 0, Errors: 0, Skipped: 0, Time elapsed: 0.007 sec
Running org.apache.maven.plugins.shade.resource.AppendingTransformerTest
Tests run: 1, Failures: 0, Errors: 0, Skipped: 0, Time elapsed: 0.005 sec
Running org.apache.maven.plugins.shade.resource.ComponentsXmlResourceTransformerTest
Tests run: 1, Failures: 0, Errors: 0, Skipped: 0, Time elapsed: 0.335 sec
Running org.apache.maven.plugins.shade.resource.XmlAppendingTransformerTest
Tests run: 1, Failures: 0, Errors: 0, Skipped: 0, Time elapsed: 0.087 sec

Results :

Tests run: 27, Failures: 0, Errors: 0, Skipped: 0

[INFO] 
[INFO] --- maven-jar-plugin:2.4:jar (default-jar) @ maven-shade-plugin ---
[INFO] Building jar: F:\hudson\hudson-slave\workspace\maven-plugins-ITs-m3-windows\maven-shade-plugin\target\maven-shade-plugin-3.0-SNAPSHOT.jar
[INFO] 
[INFO] --- maven-plugin-plugin:3.2:addPluginArtifactMetadata (default-addPluginArtifactMetadata)
@ maven-shade-plugin ---
[INFO] 
[INFO] --- maven-jar-plugin:2.4:test-jar (default) @ maven-shade-plugin ---
[INFO] Building jar: F:\hudson\hudson-slave\workspace\maven-plugins-ITs-m3-windows\maven-shade-plugin\target\maven-shade-plugin-3.0-SNAPSHOT-tests.jar
[INFO] 
[INFO] --- maven-invoker-plugin:1.6:install (integration-test) @ maven-shade-plugin ---
[INFO] Installing F:\hudson\hudson-slave\workspace\maven-plugins-ITs-m3-windows\maven-shade-plugin\pom.xml
to F:\hudson\hudson-slave\workspace\maven-plugins-ITs-m3-windows\maven-shade-plugin\target\local-repo\org\apache\maven\plugins\maven-shade-plugin\3.0-SNAPSHOT\maven-shade-plugin-3.0-SNAPSHOT.pom
[INFO] Installing F:\hudson\hudson-slave\workspace\maven-plugins-ITs-m3-windows\maven-shade-plugin\target\maven-shade-plugin-3.0-SNAPSHOT.jar
to F:\hudson\hudson-slave\workspace\maven-plugins-ITs-m3-windows\maven-shade-plugin\target\local-repo\org\apache\maven\plugins\maven-shade-plugin\3.0-SNAPSHOT\maven-shade-plugin-3.0-SNAPSHOT.jar
[INFO] Installing F:\hudson\hudson-slave\workspace\maven-plugins-ITs-m3-windows\maven-shade-plugin\target\maven-shade-plugin-3.0-SNAPSHOT-tests.jar
to F:\hudson\hudson-slave\workspace\maven-plugins-ITs-m3-windows\maven-shade-plugin\target\local-repo\org\apache\maven\plugins\maven-shade-plugin\3.0-SNAPSHOT\maven-shade-plugin-3.0-SNAPSHOT-tests.jar
[INFO] 
[INFO] --- maven-invoker-plugin:1.6:integration-test (integration-test) @ maven-shade-plugin
---
[INFO] Building: artifact-includes-excludes\pom.xml
[INFO] run script F:\hudson\hudson-slave\workspace\maven-plugins-ITs-m3-windows\maven-shade-plugin\target\it\artifact-includes-excludes\verify.bsh
[INFO] ..SUCCESS (23.8 s)
[INFO] Building: attach-after-lifecycle-fork\pom.xml
[INFO] run script F:\hudson\hudson-slave\workspace\maven-plugins-ITs-m3-windows\maven-shade-plugin\target\it\attach-after-lifecycle-fork\setup.bsh
[INFO] run script F:\hudson\hudson-slave\workspace\maven-plugins-ITs-m3-windows\maven-shade-plugin\target\it\attach-after-lifecycle-fork\verify.bsh
[INFO] ..SUCCESS (8.6 s)
[INFO] Building: attached-artifact-type\pom.xml
[INFO] ..SUCCESS (6.1 s)
[INFO] Building: component-descriptor-relocation\pom.xml
[INFO] ..SUCCESS (9.3 s)
[INFO] Building: dep-reduced-pom\pom.xml
[INFO] run script F:\hudson\hudson-slave\workspace\maven-plugins-ITs-m3-windows\maven-shade-plugin\target\it\dep-reduced-pom\verify.groovy
[INFO] ..SUCCESS (9.4 s)
[INFO] Building: dep-reduced-pom-relocated-result\pom.xml
[INFO] ..SUCCESS (4.8 s)
[INFO] Building: dep-reduced-pom-unique\pom.xml
[INFO] run script F:\hudson\hudson-slave\workspace\maven-plugins-ITs-m3-windows\maven-shade-plugin\target\it\dep-reduced-pom-unique\verify.groovy
[INFO] ..SUCCESS (10.2 s)
[INFO] Building: dep-reduced-pom-with-local-parent\pom.xml
[INFO] ..SUCCESS (6.9 s)
[INFO] Building: duplicate-classes-with-reloc\pom.xml
[INFO] ..SUCCESS (8.7 s)
[INFO] Building: duplicate-classes-without-reloc\pom.xml
[INFO] ..SUCCESS (7.3 s)
[INFO] Building: empty-apache-notice-transform\pom.xml
[INFO] ..SUCCESS (12.8 s)
[INFO] Building: empty-relocation-pattern\pom.xml
[INFO] ..SUCCESS (7.6 s)
[INFO] Building: empty-relocation-shaded-pattern\pom.xml
[INFO] ..SUCCESS (5.9 s)
[INFO] Building: filter-artifact-contents\pom.xml
[INFO] run script F:\hudson\hudson-slave\workspace\maven-plugins-ITs-m3-windows\maven-shade-plugin\target\it\filter-artifact-contents\verify.bsh
[INFO] ..SUCCESS (6.8 s)
[INFO] Building: finalNameBuild\pom.xml
[INFO] run script F:\hudson\hudson-slave\workspace\maven-plugins-ITs-m3-windows\maven-shade-plugin\target\it\finalNameBuild\setup.bsh
[INFO] run script F:\hudson\hudson-slave\workspace\maven-plugins-ITs-m3-windows\maven-shade-plugin\target\it\finalNameBuild\verify.bsh
[INFO] ..SUCCESS (11.3 s)
[INFO] Building: finalNameBuild-attached\pom.xml
[INFO] run script F:\hudson\hudson-slave\workspace\maven-plugins-ITs-m3-windows\maven-shade-plugin\target\it\finalNameBuild-attached\setup.bsh
[INFO] run script F:\hudson\hudson-slave\workspace\maven-plugins-ITs-m3-windows\maven-shade-plugin\target\it\finalNameBuild-attached\verify.bsh
[INFO] ..SUCCESS (11.4 s)
[INFO] Building: finalNameShade\pom.xml
[INFO] run script F:\hudson\hudson-slave\workspace\maven-plugins-ITs-m3-windows\maven-shade-plugin\target\it\finalNameShade\setup.bsh
[INFO] run script F:\hudson\hudson-slave\workspace\maven-plugins-ITs-m3-windows\maven-shade-plugin\target\it\finalNameShade\verify.bsh
[INFO] ..SUCCESS (6.3 s)
[INFO] Building: finalNameShade-attached\pom.xml
[INFO] run script F:\hudson\hudson-slave\workspace\maven-plugins-ITs-m3-windows\maven-shade-plugin\target\it\finalNameShade-attached\setup.bsh
[INFO] run script F:\hudson\hudson-slave\workspace\maven-plugins-ITs-m3-windows\maven-shade-plugin\target\it\finalNameShade-attached\verify.bsh
[INFO] ..SUCCESS (8.2 s)
[INFO] Building: implicit-inclusion-of-project-artifact\pom.xml
[INFO] run script F:\hudson\hudson-slave\workspace\maven-plugins-ITs-m3-windows\maven-shade-plugin\target\it\implicit-inclusion-of-project-artifact\verify.bsh
[INFO] ..SUCCESS (6.0 s)
[INFO] Building: manifest-retained\pom.xml
[INFO] run script F:\hudson\hudson-slave\workspace\maven-plugins-ITs-m3-windows\maven-shade-plugin\target\it\manifest-retained\verify.bsh
[INFO] ..SUCCESS (16.2 s)
[INFO] Building: manifest-transformed\pom.xml
[INFO] run script F:\hudson\hudson-slave\workspace\maven-plugins-ITs-m3-windows\maven-shade-plugin\target\it\manifest-transformed\verify.bsh
[INFO] ..SUCCESS (7.9 s)
[INFO] Building: mini-jar\pom.xml
[INFO] run script F:\hudson\hudson-slave\workspace\maven-plugins-ITs-m3-windows\maven-shade-plugin\target\it\mini-jar\verify.bsh
[INFO] ..SUCCESS (6.9 s)
[INFO] Building: mini-jar-malformed-dependencies\pom.xml
[INFO] ..SUCCESS (9.0 s)
[INFO] Building: mini-jar-package-info\pom.xml
[INFO] run script F:\hudson\hudson-slave\workspace\maven-plugins-ITs-m3-windows\maven-shade-plugin\target\it\mini-jar-package-info\verify.bsh
[INFO] ..SUCCESS (9.9 s)
[INFO] Building: mini-jar-respect-includes\pom.xml
[INFO] run script F:\hudson\hudson-slave\workspace\maven-plugins-ITs-m3-windows\maven-shade-plugin\target\it\mini-jar-respect-includes\verify.bsh
[INFO] ..SUCCESS (12.8 s)
[INFO] Building: MSHADE-105\pom.xml
[INFO] run script F:\hudson\hudson-slave\workspace\maven-plugins-ITs-m3-windows\maven-shade-plugin\target\it\MSHADE-105\verify.bsh
[INFO] ..SUCCESS (19.9 s)
[INFO] Building: mshade-123\pom.xml
[INFO] ..SUCCESS (9.0 s)
[INFO] Building: non-runtime-scope-excluded\pom.xml
[INFO] run script F:\hudson\hudson-slave\workspace\maven-plugins-ITs-m3-windows\maven-shade-plugin\target\it\non-runtime-scope-excluded\verify.bsh
[INFO] ..SUCCESS (7.8 s)
[INFO] Building: plugin-descriptor-relocation\pom.xml
[INFO] run script F:\hudson\hudson-slave\workspace\maven-plugins-ITs-m3-windows\maven-shade-plugin\target\it\plugin-descriptor-relocation\verify.groovy
[INFO] ..SUCCESS (24.0 s)
[INFO] Building: pom-packaging\pom.xml
[INFO] run script F:\hudson\hudson-slave\workspace\maven-plugins-ITs-m3-windows\maven-shade-plugin\target\it\pom-packaging\verify.bsh
[INFO] ..SUCCESS (6.4 s)
[INFO] Building: project-with-reactors-included\pom.xml
[INFO] run script F:\hudson\hudson-slave\workspace\maven-plugins-ITs-m3-windows\maven-shade-plugin\target\it\project-with-reactors-included\verify.bsh
[INFO] ..SUCCESS (21.2 s)
[INFO] Building: reloc-abs-resource-path\pom.xml
[INFO] ..SUCCESS (16.5 s)
[INFO] Building: reloc-anno\pom.xml
[INFO] ..SUCCESS (5.2 s)
[INFO] Building: reloc-class-from-string-pool\pom.xml
[INFO] ..SUCCESS (4.3 s)
[INFO] Building: reloc-enum-ref-from-anno\pom.xml
[INFO] ..SUCCESS (4.3 s)
[INFO] Building: reloc-includes-excludes\pom.xml
[INFO] run script F:\hudson\hudson-slave\workspace\maven-plugins-ITs-m3-windows\maven-shade-plugin\target\it\reloc-includes-excludes\verify.bsh
[INFO] ..SUCCESS (7.0 s)
[INFO] Building: rerun-with-reloc\pom.xml
[INFO] ..SUCCESS (6.4 s)
[INFO] Building: rerun-without-reloc\pom.xml
[INFO] ..SUCCESS (5.5 s)
[INFO] Building: services-resource-transformer\pom.xml
[INFO] run script F:\hudson\hudson-slave\workspace\maven-plugins-ITs-m3-windows\maven-shade-plugin\target\it\services-resource-transformer\verify.bsh
[INFO] ..SUCCESS (10.7 s)
[INFO] Building: shadePomDependency\pom.xml
[INFO] ..SUCCESS (9.3 s)
[INFO] Building: users-shader-impl\pom.xml
[INFO] run script F:\hudson\hudson-slave\workspace\maven-plugins-ITs-m3-windows\maven-shade-plugin\target\it\users-shader-impl\verify.groovy
[INFO] ..SUCCESS (8.3 s)
[INFO] Building: xml-transformer-ignores-dtd\pom.xml
[INFO] run script F:\hudson\hudson-slave\workspace\maven-plugins-ITs-m3-windows\maven-shade-plugin\target\it\xml-transformer-ignores-dtd\verify.bsh
[INFO] ..SUCCESS (9.1 s)
[INFO] 
[INFO] --- maven-invoker-plugin:1.6:verify (integration-test) @ maven-shade-plugin ---
[INFO] -------------------------------------------------
[INFO] Build Summary:
[INFO]   Passed: 42, Failed: 0, Errors: 0, Skipped: 0
[INFO] -------------------------------------------------
[INFO] 
[INFO] --- maven-install-plugin:2.3.1:install (default-install) @ maven-shade-plugin ---
[INFO] Installing F:\hudson\hudson-slave\workspace\maven-plugins-ITs-m3-windows\maven-shade-plugin\target\maven-shade-plugin-3.0-SNAPSHOT.jar
to C:\Users\hudson\.m2\repository\org\apache\maven\plugins\maven-shade-plugin\3.0-SNAPSHOT\maven-shade-plugin-3.0-SNAPSHOT.jar
[INFO] Installing F:\hudson\hudson-slave\workspace\maven-plugins-ITs-m3-windows\maven-shade-plugin\pom.xml
to C:\Users\hudson\.m2\repository\org\apache\maven\plugins\maven-shade-plugin\3.0-SNAPSHOT\maven-shade-plugin-3.0-SNAPSHOT.pom
[INFO] Installing F:\hudson\hudson-slave\workspace\maven-plugins-ITs-m3-windows\maven-shade-plugin\target\maven-shade-plugin-3.0-SNAPSHOT-tests.jar
to C:\Users\hudson\.m2\repository\org\apache\maven\plugins\maven-shade-plugin\3.0-SNAPSHOT\maven-shade-plugin-3.0-SNAPSHOT-tests.jar
[INFO]                                                                         
[INFO] ------------------------------------------------------------------------
[INFO] Building Maven Plugins Aggregator 1-SNAPSHOT
[INFO] ------------------------------------------------------------------------
[INFO] 
[INFO] --- maven-clean-plugin:2.4.1:clean (default-clean) @ maven-plugins-aggregator ---
[INFO] Deleting <https://builds.apache.org/job/maven-plugins-ITs-m3-windows/ws/target>
[INFO] 
[INFO] --- maven-remote-resources-plugin:1.1:process (default) @ maven-plugins-aggregator
---
[INFO] 
[INFO] --- maven-install-plugin:2.3.1:install (default-install) @ maven-plugins-aggregator
---
[INFO] Installing <https://builds.apache.org/job/maven-plugins-ITs-m3-windows/ws/pom.xml>
to C:\Users\hudson\.m2\repository\org\apache\maven\plugins\maven-plugins-aggregator\1-SNAPSHOT\maven-plugins-aggregator-1-SNAPSHOT.pom
[INFO] ------------------------------------------------------------------------
[INFO] Reactor Summary:
[INFO] 
[INFO] Maven SCM Publish Plugin .......................... FAILURE [2:57.730s]
[INFO] Maven Plugins ..................................... SKIPPED
[INFO] Maven ACR Plugin .................................. SUCCESS [37.361s]
[INFO] Maven Ant Plugin .................................. SUCCESS [1:42.766s]
[INFO] Maven AntRun Plugin ............................... SUCCESS [1:21.022s]
[INFO] Maven Eclipse Plugin .............................. SUCCESS [12:25.365s]
[INFO] Maven Assembly Plugin ............................. SUCCESS [20:29.274s]
[INFO] Maven Changelog Plugin ............................ FAILURE [42.114s]
[INFO] Maven Changes Report Plugin ....................... SUCCESS [4:04.089s]
[INFO] Maven Checkstyle Plugin ........................... SUCCESS [5:14.156s]
[INFO] Maven Clean Plugin ................................ SUCCESS [59.810s]
[INFO] Maven Compiler Plugin ............................. SKIPPED
[INFO] Maven Dependency Plugin ........................... SUCCESS [5:50.575s]
[INFO] Maven Deploy Plugin ............................... SUCCESS [3:02.232s]
[INFO] Maven DOAP Plugin ................................. SUCCESS [59.845s]
[INFO] Maven Documentation Checker Plugin ................ SUCCESS [23.164s]
[INFO] Maven EAR Plugin .................................. SUCCESS [10:38.983s]
[INFO] Maven EJB Plugin .................................. SUCCESS [1:26.715s]
[INFO] Maven GPG Plugin .................................. SUCCESS [11.368s]
[INFO] Maven Help Plugin ................................. SUCCESS [1:06.329s]
[INFO] Maven IDEA Plugin ................................. SUCCESS [42.060s]
[INFO] Maven Install Plugin .............................. SUCCESS [1:23.192s]
[INFO] Maven JAR Plugin .................................. SUCCESS [2:01.893s]
[INFO] Maven Jarsigner Plugin ............................ SUCCESS [41.145s]
[INFO] Maven Javadoc Plugin .............................. FAILURE [3:33.312s]
[INFO] Maven Linkcheck Plugin ............................ SUCCESS [10.051s]
[INFO] Maven One Plugin .................................. SUCCESS [17.626s]
[INFO] Maven Patch Plugin ................................ SUCCESS [24.546s]
[INFO] Maven PDF Plugin .................................. SUCCESS [2:00.550s]
[INFO] Maven PMD Plugin .................................. SUCCESS [1:21.605s]
[INFO] Maven RAR Plugin .................................. SUCCESS [19.185s]
[INFO] Maven Reactor Plugin .............................. SUCCESS [3.885s]
[INFO] Maven Repository Plugin ........................... SUCCESS [1:04.618s]
[INFO] Maven Resources Plugin ............................ SUCCESS [1:19.108s]
[INFO] Maven Site Plugin 3 ............................... SUCCESS [10:04.463s]
[INFO] Maven Source Plugin ............................... SUCCESS [1:06.995s]
[INFO] Maven Stage Plugin ................................ SUCCESS [2.405s]
[INFO] Maven Toolchains Plugin ........................... SUCCESS [2.318s]
[INFO] Maven Verifier Plugin ............................. SUCCESS [25.630s]
[INFO] Maven WAR Plugin .................................. SUCCESS [1:42.754s]
[INFO] Maven Invoker Plugin .............................. SUCCESS [7:48.205s]
[INFO] Maven Project Info Reports Plugin ................. SUCCESS [4:42.264s]
[INFO] Maven Remote Resources Plugin ..................... SUCCESS [2:32.291s]
[INFO] Maven Shade Plugin ................................ SUCCESS [7:59.898s]
[INFO] Maven Plugins Aggregator .......................... SUCCESS [1.711s]
[INFO] ------------------------------------------------------------------------
[INFO] BUILD FAILURE
[INFO] ------------------------------------------------------------------------
[INFO] Total time: 2:06:09.008s
[INFO] Finished at: Sat Dec 15 02:05:25 GMT 2012
[INFO] Final Memory: 122M/291M
[INFO] ------------------------------------------------------------------------
[WARNING] The requested profile "apache.snapshots" could not be activated because it does
not exist.
[ERROR] Failed to execute goal org.apache.maven.plugins:maven-invoker-plugin:1.7:verify (integration-test)
on project maven-scm-publish-plugin: 2 builds failed. See console output above for details.
-> [Help 1]
[ERROR] Failed to execute goal org.apache.maven.plugins:maven-surefire-plugin:2.12:test (default-test)
on project maven-changelog-plugin: There are test failures.
[ERROR] 
[ERROR] Please refer to F:\hudson\hudson-slave\workspace\maven-plugins-ITs-m3-windows\maven-changelog-plugin\target\surefire-reports
for the individual test results.
[ERROR] -> [Help 1]
[ERROR] Failed to execute goal org.apache.maven.plugins:maven-surefire-plugin:2.12:test (default-test)
on project maven-javadoc-plugin: There are test failures.
[ERROR] 
[ERROR] Please refer to F:\hudson\hudson-slave\workspace\maven-plugins-ITs-m3-windows\maven-javadoc-plugin\target\surefire-reports
for the individual test results.
[ERROR] -> [Help 1]
[ERROR] 
[ERROR] To see the full stack trace of the errors, re-run Maven with the -e switch.
[ERROR] Re-run Maven using the -X switch to enable full debug logging.
[ERROR] 
[ERROR] For more information about the errors and possible solutions, please read the following
articles:
[ERROR] [Help 1] http://cwiki.apache.org/confluence/display/MAVEN/MojoFailureException
Build step 'Invoke top-level Maven targets' marked build as failure
Recording test results

Mime
View raw message