maven-notifications mailing list archives

Site index · List index
Message view « Date » · « Thread »
Top « Date » · « Thread »
From Apache Jenkins Server <jenk...@builds.apache.org>
Subject Build failed in Jenkins: maven-plugins-ITs-m3 #773
Date Sat, 03 Nov 2012 23:35:53 GMT
See <https://builds.apache.org/job/maven-plugins-ITs-m3/773/changes>

Changes:

[olamy] use released version

------------------------------------------
[...truncated 10101 lines...]
Running org.apache.maven.plugins.shade.DefaultShaderTest
Tests run: 4, Failures: 0, Errors: 0, Skipped: 0, Time elapsed: 1.487 sec
Running org.apache.maven.plugins.shade.resource.ApacheLicenseResourceTransformerTest
Tests run: 1, Failures: 0, Errors: 0, Skipped: 0, Time elapsed: 0.004 sec
Running org.apache.maven.plugins.shade.resource.XmlAppendingTransformerTest
Tests run: 1, Failures: 0, Errors: 0, Skipped: 0, Time elapsed: 0.006 sec
Running org.apache.maven.plugins.shade.resource.AppendingTransformerTest
Tests run: 1, Failures: 0, Errors: 0, Skipped: 0, Time elapsed: 0.001 sec
Running org.apache.maven.plugins.shade.resource.ApacheNoticeResourceTransformerTest
Tests run: 1, Failures: 0, Errors: 0, Skipped: 0, Time elapsed: 0.002 sec
Running org.apache.maven.plugins.shade.resource.ComponentsXmlResourceTransformerTest
Tests run: 1, Failures: 0, Errors: 0, Skipped: 0, Time elapsed: 0.063 sec
Running org.apache.maven.plugins.shade.mojo.ShadeMojoTest
Tests run: 4, Failures: 0, Errors: 0, Skipped: 0, Time elapsed: 1.82 sec
Running org.apache.maven.plugins.shade.mojo.RelativizePathTest
Tests run: 1, Failures: 0, Errors: 0, Skipped: 0, Time elapsed: 0.015 sec
Running org.apache.maven.plugins.shade.mojo.ArtifactSelectorTest
Tests run: 1, Failures: 0, Errors: 0, Skipped: 0, Time elapsed: 0.001 sec
Running org.apache.maven.plugins.shade.mojo.ArtifactIdTest
Tests run: 2, Failures: 0, Errors: 0, Skipped: 0, Time elapsed: 0.001 sec
Running org.apache.maven.plugins.shade.filter.SimpleFilterTest
Tests run: 1, Failures: 0, Errors: 0, Skipped: 0, Time elapsed: 0 sec
Running org.apache.maven.plugins.shade.relocation.SimpleRelocatorTest
Tests run: 7, Failures: 0, Errors: 0, Skipped: 0, Time elapsed: 0.002 sec
Running org.apache.maven.plugins.shade.relocation.SimpleRelocatorParameterTest
Tests run: 2, Failures: 0, Errors: 0, Skipped: 0, Time elapsed: 0 sec

Results :

Tests run: 27, Failures: 0, Errors: 0, Skipped: 0

[INFO] 
[INFO] --- maven-jar-plugin:2.4:jar (default-jar) @ maven-shade-plugin ---
[INFO] Building jar: <https://builds.apache.org/job/maven-plugins-ITs-m3/ws/maven-shade-plugin/target/maven-shade-plugin-2.0.1-SNAPSHOT.jar>
[INFO] 
[INFO] --- maven-plugin-plugin:3.1:addPluginArtifactMetadata (default-addPluginArtifactMetadata)
@ maven-shade-plugin ---
[INFO] 
[INFO] --- maven-jar-plugin:2.4:test-jar (default) @ maven-shade-plugin ---
[INFO] Building jar: <https://builds.apache.org/job/maven-plugins-ITs-m3/ws/maven-shade-plugin/target/maven-shade-plugin-2.0.1-SNAPSHOT-tests.jar>
[INFO] 
[INFO] --- maven-invoker-plugin:1.6:install (integration-test) @ maven-shade-plugin ---
[INFO] Installing <https://builds.apache.org/job/maven-plugins-ITs-m3/ws/maven-shade-plugin/pom.xml>
to <https://builds.apache.org/job/maven-plugins-ITs-m3/ws/maven-shade-plugin/target/local-repo/org/apache/maven/plugins/maven-shade-plugin/2.0.1-SNAPSHOT/maven-shade-plugin-2.0.1-SNAPSHOT.pom>
[INFO] Installing <https://builds.apache.org/job/maven-plugins-ITs-m3/ws/maven-shade-plugin/target/maven-shade-plugin-2.0.1-SNAPSHOT.jar>
to <https://builds.apache.org/job/maven-plugins-ITs-m3/ws/maven-shade-plugin/target/local-repo/org/apache/maven/plugins/maven-shade-plugin/2.0.1-SNAPSHOT/maven-shade-plugin-2.0.1-SNAPSHOT.jar>
[INFO] Installing <https://builds.apache.org/job/maven-plugins-ITs-m3/ws/maven-shade-plugin/target/maven-shade-plugin-2.0.1-SNAPSHOT-tests.jar>
to <https://builds.apache.org/job/maven-plugins-ITs-m3/ws/maven-shade-plugin/target/local-repo/org/apache/maven/plugins/maven-shade-plugin/2.0.1-SNAPSHOT/maven-shade-plugin-2.0.1-SNAPSHOT-tests.jar>
[INFO] 
[INFO] --- maven-invoker-plugin:1.6:integration-test (integration-test) @ maven-shade-plugin
---
[INFO] Building: artifact-includes-excludes/pom.xml
[INFO] run script <https://builds.apache.org/job/maven-plugins-ITs-m3/ws/maven-shade-plugin/target/it/artifact-includes-excludes/verify.bsh>
[INFO] ..SUCCESS (4.0 s)
[INFO] Building: dep-reduced-pom-with-local-parent/pom.xml
[INFO] ..SUCCESS (5.4 s)
[INFO] Building: implicit-inclusion-of-project-artifact/pom.xml
[INFO] run script <https://builds.apache.org/job/maven-plugins-ITs-m3/ws/maven-shade-plugin/target/it/implicit-inclusion-of-project-artifact/verify.bsh>
[INFO] ..SUCCESS (3.8 s)
[INFO] Building: reloc-class-from-string-pool/pom.xml
[INFO] ..SUCCESS (3.4 s)
[INFO] Building: dep-reduced-pom-unique/pom.xml
[INFO] run script <https://builds.apache.org/job/maven-plugins-ITs-m3/ws/maven-shade-plugin/target/it/dep-reduced-pom-unique/verify.groovy>
[INFO] ..SUCCESS (3.9 s)
[INFO] Building: non-runtime-scope-excluded/pom.xml
[INFO] run script <https://builds.apache.org/job/maven-plugins-ITs-m3/ws/maven-shade-plugin/target/it/non-runtime-scope-excluded/verify.bsh>
[INFO] ..SUCCESS (3.5 s)
[INFO] Building: manifest-transformed/pom.xml
[INFO] run script <https://builds.apache.org/job/maven-plugins-ITs-m3/ws/maven-shade-plugin/target/it/manifest-transformed/verify.bsh>
[INFO] ..SUCCESS (4.7 s)
[INFO] Building: duplicate-classes-without-reloc/pom.xml
[INFO] ..SUCCESS (2.8 s)
[INFO] Building: mini-jar-respect-includes/pom.xml
[INFO] run script <https://builds.apache.org/job/maven-plugins-ITs-m3/ws/maven-shade-plugin/target/it/mini-jar-respect-includes/verify.bsh>
[INFO] ..SUCCESS (4.3 s)
[INFO] Building: pom-packaging/pom.xml
[INFO] run script <https://builds.apache.org/job/maven-plugins-ITs-m3/ws/maven-shade-plugin/target/it/pom-packaging/verify.bsh>
[INFO] ..SUCCESS (2.4 s)
[INFO] Building: xml-transformer-ignores-dtd/pom.xml
[INFO] run script <https://builds.apache.org/job/maven-plugins-ITs-m3/ws/maven-shade-plugin/target/it/xml-transformer-ignores-dtd/verify.bsh>
[INFO] ..SUCCESS (3.5 s)
[INFO] Building: empty-relocation-shaded-pattern/pom.xml
[INFO] ..SUCCESS (3.4 s)
[INFO] Building: mshade-123/pom.xml
[INFO] ..SUCCESS (5.4 s)
[INFO] Building: manifest-retained/pom.xml
[INFO] run script <https://builds.apache.org/job/maven-plugins-ITs-m3/ws/maven-shade-plugin/target/it/manifest-retained/verify.bsh>
[INFO] ..SUCCESS (4.3 s)
[INFO] Building: finalNameBuild/pom.xml
[INFO] run script <https://builds.apache.org/job/maven-plugins-ITs-m3/ws/maven-shade-plugin/target/it/finalNameBuild/setup.bsh>
[INFO] run script <https://builds.apache.org/job/maven-plugins-ITs-m3/ws/maven-shade-plugin/target/it/finalNameBuild/verify.bsh>
[INFO] ..SUCCESS (3.6 s)
[INFO] Building: finalNameShade/pom.xml
[INFO] run script <https://builds.apache.org/job/maven-plugins-ITs-m3/ws/maven-shade-plugin/target/it/finalNameShade/setup.bsh>
[INFO] run script <https://builds.apache.org/job/maven-plugins-ITs-m3/ws/maven-shade-plugin/target/it/finalNameShade/verify.bsh>
[INFO] ..SUCCESS (3.5 s)
[INFO] Building: reloc-abs-resource-path/pom.xml
[INFO] ..SUCCESS (5.5 s)
[INFO] Building: empty-apache-notice-transform/pom.xml
[INFO] ..SUCCESS (4.1 s)
[INFO] Building: services-resource-transformer/pom.xml
[INFO] run script <https://builds.apache.org/job/maven-plugins-ITs-m3/ws/maven-shade-plugin/target/it/services-resource-transformer/verify.bsh>
[INFO] ..SUCCESS (3.5 s)
[INFO] Building: mini-jar-package-info/pom.xml
[INFO] run script <https://builds.apache.org/job/maven-plugins-ITs-m3/ws/maven-shade-plugin/target/it/mini-jar-package-info/verify.bsh>
[INFO] ..SUCCESS (4.3 s)
[INFO] Building: rerun-without-reloc/pom.xml
[INFO] ..SUCCESS (3.5 s)
[INFO] Building: shadePomDependency/pom.xml
[INFO] ..SUCCESS (4.6 s)
[INFO] Building: reloc-includes-excludes/pom.xml
[INFO] run script <https://builds.apache.org/job/maven-plugins-ITs-m3/ws/maven-shade-plugin/target/it/reloc-includes-excludes/verify.bsh>
[INFO] ..SUCCESS (4.2 s)
[INFO] Building: finalNameShade-attached/pom.xml
[INFO] run script <https://builds.apache.org/job/maven-plugins-ITs-m3/ws/maven-shade-plugin/target/it/finalNameShade-attached/setup.bsh>
[INFO] run script <https://builds.apache.org/job/maven-plugins-ITs-m3/ws/maven-shade-plugin/target/it/finalNameShade-attached/verify.bsh>
[INFO] ..SUCCESS (3.5 s)
[INFO] Building: component-descriptor-relocation/pom.xml
[INFO] ..SUCCESS (4.0 s)
[INFO] Building: users-shader-impl/pom.xml
[INFO] run script <https://builds.apache.org/job/maven-plugins-ITs-m3/ws/maven-shade-plugin/target/it/users-shader-impl/verify.groovy>
[INFO] ..SUCCESS (4.0 s)
[INFO] Building: mini-jar-malformed-dependencies/pom.xml
[INFO] ..SUCCESS (7.6 s)
[INFO] Building: finalNameBuild-attached/pom.xml
[INFO] run script <https://builds.apache.org/job/maven-plugins-ITs-m3/ws/maven-shade-plugin/target/it/finalNameBuild-attached/setup.bsh>
[INFO] run script <https://builds.apache.org/job/maven-plugins-ITs-m3/ws/maven-shade-plugin/target/it/finalNameBuild-attached/verify.bsh>
[INFO] ..SUCCESS (3.5 s)
[INFO] Building: attach-after-lifecycle-fork/pom.xml
[INFO] run script <https://builds.apache.org/job/maven-plugins-ITs-m3/ws/maven-shade-plugin/target/it/attach-after-lifecycle-fork/setup.bsh>
[INFO] run script <https://builds.apache.org/job/maven-plugins-ITs-m3/ws/maven-shade-plugin/target/it/attach-after-lifecycle-fork/verify.bsh>
[INFO] ..SUCCESS (2.9 s)
[INFO] Building: empty-relocation-pattern/pom.xml
[INFO] ..SUCCESS (3.3 s)
[INFO] Building: mini-jar/pom.xml
[INFO] run script <https://builds.apache.org/job/maven-plugins-ITs-m3/ws/maven-shade-plugin/target/it/mini-jar/verify.bsh>
[INFO] ..SUCCESS (3.8 s)
[INFO] Building: reloc-anno/pom.xml
[INFO] ..SUCCESS (3.3 s)
[INFO] Building: MSHADE-105/pom.xml
[INFO] run script <https://builds.apache.org/job/maven-plugins-ITs-m3/ws/maven-shade-plugin/target/it/MSHADE-105/verify.bsh>
[INFO] ..SUCCESS (7.2 s)
[INFO] Building: dep-reduced-pom-relocated-result/pom.xml
[INFO] ..SUCCESS (2.7 s)
[INFO] Building: attached-artifact-type/pom.xml
[INFO] ..SUCCESS (3.2 s)
[INFO] Building: dep-reduced-pom/pom.xml
[INFO] run script <https://builds.apache.org/job/maven-plugins-ITs-m3/ws/maven-shade-plugin/target/it/dep-reduced-pom/verify.groovy>
[INFO] ..SUCCESS (3.4 s)
[INFO] Building: rerun-with-reloc/pom.xml
[INFO] ..SUCCESS (5.3 s)
[INFO] Building: duplicate-classes-with-reloc/pom.xml
[INFO] ..SUCCESS (2.9 s)
[INFO] Building: filter-artifact-contents/pom.xml
[INFO] run script <https://builds.apache.org/job/maven-plugins-ITs-m3/ws/maven-shade-plugin/target/it/filter-artifact-contents/verify.bsh>
[INFO] ..SUCCESS (3.6 s)
[INFO] Building: project-with-reactors-included/pom.xml
[INFO] run script <https://builds.apache.org/job/maven-plugins-ITs-m3/ws/maven-shade-plugin/target/it/project-with-reactors-included/verify.bsh>
[INFO] ..SUCCESS (5.0 s)
[INFO] Building: reloc-enum-ref-from-anno/pom.xml
[INFO] ..SUCCESS (3.3 s)
[INFO] 
[INFO] --- maven-invoker-plugin:1.6:verify (integration-test) @ maven-shade-plugin ---
[INFO] -------------------------------------------------
[INFO] Build Summary:
[INFO]   Passed: 41, Failed: 0, Errors: 0, Skipped: 0
[INFO] -------------------------------------------------
[INFO] 
[INFO] --- maven-install-plugin:2.3.1:install (default-install) @ maven-shade-plugin ---
[INFO] Installing <https://builds.apache.org/job/maven-plugins-ITs-m3/ws/maven-shade-plugin/target/maven-shade-plugin-2.0.1-SNAPSHOT.jar>
to /home/jenkins/.m2/repository/org/apache/maven/plugins/maven-shade-plugin/2.0.1-SNAPSHOT/maven-shade-plugin-2.0.1-SNAPSHOT.jar
[INFO] Installing <https://builds.apache.org/job/maven-plugins-ITs-m3/ws/maven-shade-plugin/pom.xml>
to /home/jenkins/.m2/repository/org/apache/maven/plugins/maven-shade-plugin/2.0.1-SNAPSHOT/maven-shade-plugin-2.0.1-SNAPSHOT.pom
[INFO] Installing <https://builds.apache.org/job/maven-plugins-ITs-m3/ws/maven-shade-plugin/target/maven-shade-plugin-2.0.1-SNAPSHOT-tests.jar>
to /home/jenkins/.m2/repository/org/apache/maven/plugins/maven-shade-plugin/2.0.1-SNAPSHOT/maven-shade-plugin-2.0.1-SNAPSHOT-tests.jar
[INFO]                                                                         
[INFO] ------------------------------------------------------------------------
[INFO] Building Maven Plugins Aggregator 1-SNAPSHOT
[INFO] ------------------------------------------------------------------------
[INFO] 
[INFO] --- maven-clean-plugin:2.4.1:clean (default-clean) @ maven-plugins-aggregator ---
[INFO] Deleting <https://builds.apache.org/job/maven-plugins-ITs-m3/ws/target>
[INFO] 
[INFO] --- maven-remote-resources-plugin:1.1:process (default) @ maven-plugins-aggregator
---
[INFO] 
[INFO] --- maven-install-plugin:2.3.1:install (default-install) @ maven-plugins-aggregator
---
[INFO] Installing <https://builds.apache.org/job/maven-plugins-ITs-m3/ws/pom.xml> to
/home/jenkins/.m2/repository/org/apache/maven/plugins/maven-plugins-aggregator/1-SNAPSHOT/maven-plugins-aggregator-1-SNAPSHOT.pom
[INFO] ------------------------------------------------------------------------
[INFO] Reactor Summary:
[INFO] 
[INFO] Maven Plugins ..................................... SUCCESS [18.677s]
[INFO] Maven ACR Plugin .................................. SUCCESS [27.259s]
[INFO] Maven Ant Plugin .................................. SUCCESS [1:19.228s]
[INFO] Maven AntRun Plugin ............................... SUCCESS [55.469s]
[INFO] Maven Eclipse Plugin .............................. SUCCESS [6:51.955s]
[INFO] Maven Assembly Plugin ............................. SUCCESS [11:23.052s]
[INFO] Maven Changelog Plugin ............................ SUCCESS [50.522s]
[INFO] Maven Changes Report Plugin ....................... SUCCESS [1:00.771s]
[INFO] Maven Checkstyle Plugin ........................... SUCCESS [1:38.775s]
[INFO] Maven Clean Plugin ................................ SUCCESS [20.798s]
[INFO] Maven Compiler Plugin ............................. SUCCESS [1:15.252s]
[INFO] Maven Dependency Plugin ........................... FAILURE [2:43.523s]
[INFO] Maven Deploy Plugin ............................... SUCCESS [1:03.338s]
[INFO] Maven DOAP Plugin ................................. SUCCESS [18.918s]
[INFO] Maven Documentation Checker Plugin ................ SUCCESS [7.369s]
[INFO] Maven EAR Plugin .................................. SUCCESS [3:54.269s]
[INFO] Maven EJB Plugin .................................. SUCCESS [28.279s]
[INFO] Maven GPG Plugin .................................. SUCCESS [12.237s]
[INFO] Maven Help Plugin ................................. SUCCESS [35.799s]
[INFO] Maven IDEA Plugin ................................. SUCCESS [8.346s]
[INFO] Maven Install Plugin .............................. SUCCESS [41.510s]
[INFO] Maven JAR Plugin .................................. SUCCESS [1:10.891s]
[INFO] Maven Jarsigner Plugin ............................ SUCCESS [25.802s]
[INFO] Maven Javadoc Plugin .............................. SUCCESS [3:34.175s]
[INFO] Maven Linkcheck Plugin ............................ SUCCESS [3.532s]
[INFO] Maven One Plugin .................................. SUCCESS [2.400s]
[INFO] Maven Patch Plugin ................................ SUCCESS [13.137s]
[INFO] Maven PDF Plugin .................................. SUCCESS [41.832s]
[INFO] Maven PMD Plugin .................................. SUCCESS [58.162s]
[INFO] Maven RAR Plugin .................................. SUCCESS [12.215s]
[INFO] Maven Reactor Plugin .............................. SUCCESS [4.215s]
[INFO] Maven Repository Plugin ........................... SUCCESS [51.575s]
[INFO] Maven Resources Plugin ............................ SUCCESS [1:00.525s]
[INFO] Maven Site Plugin 3 ............................... SUCCESS [8:18.398s]
[INFO] Maven Source Plugin ............................... SUCCESS [50.625s]
[INFO] Maven Stage Plugin ................................ SUCCESS [3.460s]
[INFO] Maven Toolchains Plugin ........................... SUCCESS [2.837s]
[INFO] Maven Verifier Plugin ............................. SUCCESS [16.705s]
[INFO] Maven WAR Plugin .................................. SUCCESS [1:39.228s]
[INFO] SCM Publish Maven Plugin .......................... FAILURE [2.146s]
[INFO] Maven Invoker Plugin .............................. SUCCESS [4:28.631s]
[INFO] Maven Project Info Reports Plugin ................. SUCCESS [2:34.595s]
[INFO] Maven Remote Resources Plugin ..................... SUCCESS [59.446s]
[INFO] Maven Shade Plugin ................................ SUCCESS [3:14.038s]
[INFO] Maven Plugins Aggregator .......................... SUCCESS [0.103s]
[INFO] ------------------------------------------------------------------------
[INFO] BUILD FAILURE
[INFO] ------------------------------------------------------------------------
[INFO] Total time: 1:08:28.494s
[INFO] Finished at: Sat Nov 03 23:34:34 UTC 2012
[INFO] Final Memory: 105M/414M
[INFO] ------------------------------------------------------------------------
[WARNING] The requested profile "apache.snapshots" could not be activated because it does
not exist.
[ERROR] Failed to execute goal org.apache.maven.plugins:maven-invoker-plugin:1.6:verify (integration-test)
on project maven-dependency-plugin: 1 build failed. See console output above for details.
-> [Help 1]
[ERROR] Failed to execute goal on project maven-scm-publish-plugin: Could not resolve dependencies
for project org.apache.maven.plugins:maven-scm-publish-plugin:maven-plugin:1.0-SNAPSHOT: The
following artifacts could not be resolved: org.apache.maven.scm:maven-scm-api:jar:1.8.1, org.apache.maven.scm:maven-scm-provider-gitexe:jar:1.8.1,
org.apache.maven.scm:maven-scm-provider-svnexe:jar:1.8.1, org.apache.maven.scm:maven-scm-provider-svn-commons:jar:1.8.1,
org.apache.maven.scm:maven-scm-provider-svntest:jar:1.8.1: Could not find artifact org.apache.maven.scm:maven-scm-api:jar:1.8.1
in central (http://repo.maven.apache.org/maven2) -> [Help 2]
[ERROR] 
[ERROR] To see the full stack trace of the errors, re-run Maven with the -e switch.
[ERROR] Re-run Maven using the -X switch to enable full debug logging.
[ERROR] 
[ERROR] For more information about the errors and possible solutions, please read the following
articles:
[ERROR] [Help 1] http://cwiki.apache.org/confluence/display/MAVEN/MojoFailureException
[ERROR] [Help 2] http://cwiki.apache.org/confluence/display/MAVEN/DependencyResolutionException
[ERROR] 
[ERROR] After correcting the problems, you can resume the build with the command
[ERROR]   mvn <goals> -rf :maven-dependency-plugin
Build step 'Invoke top-level Maven targets' marked build as failure
Recording test results

Mime
View raw message