maven-notifications mailing list archives

Site index · List index
Message view « Date » · « Thread »
Top « Date » · « Thread »
From Apache Jenkins Server <jenk...@builds.apache.org>
Subject Build failed in Jenkins: core-integration-testing-maven-3-windows #177
Date Wed, 07 Nov 2012 10:27:48 GMT
See <https://builds.apache.org/job/core-integration-testing-maven-3-windows/177/>

------------------------------------------
Started by an SCM change
Started by an SCM change
Started by an SCM change
Started by an SCM change
Started by an SCM change
Started by an SCM change
Started by an SCM change
Started by an SCM change
Started by an SCM change
Started by an SCM change
Started by an SCM change
Started by an SCM change
Started by an SCM change
Started by an SCM change
Started by an SCM change
Building remotely on windows1 in workspace <https://builds.apache.org/job/core-integration-testing-maven-3-windows/ws/>
Checking out a fresh workspace because there's no workspace at F:\hudson\hudson-slave\workspace\core-integration-testing-maven-3-windows\maven-3-trunk
Cleaning local Directory maven-3-trunk
hudson.util.IOException2: remote file operation failed: <https://builds.apache.org/job/core-integration-testing-maven-3-windows/ws/>
at hudson.remoting.Channel@2aba709e:windows1
	at hudson.FilePath.act(FilePath.java:838)
	at hudson.FilePath.act(FilePath.java:824)
	at hudson.scm.SubversionSCM.checkout(SubversionSCM.java:743)
	at hudson.scm.SubversionSCM.checkout(SubversionSCM.java:685)
	at hudson.model.AbstractProject.checkout(AbstractProject.java:1256)
	at hudson.model.AbstractBuild$AbstractBuildExecution.defaultCheckout(AbstractBuild.java:589)
	at jenkins.scm.SCMCheckoutStrategy.checkout(SCMCheckoutStrategy.java:88)
	at hudson.model.AbstractBuild$AbstractBuildExecution.run(AbstractBuild.java:494)
	at hudson.model.Run.execute(Run.java:1502)
	at hudson.model.FreeStyleBuild.run(FreeStyleBuild.java:46)
	at hudson.model.ResourceController.execute(ResourceController.java:88)
	at hudson.model.Executor.run(Executor.java:236)
Caused by: java.io.IOException: Unable to delete <https://builds.apache.org/job/core-integration-testing-maven-3-windows/ws/maven-3-trunk\hudsonhudson-slaveworkspacecore-integration-testing-maven-3-windowscore-integration-testing-maven-3-trunklocal-repository\backport-util-concurrent\backport-util-concurrent\3.1>
- files in dir: [<https://builds.apache.org/job/core-integration-testing-maven-3-windows/ws/maven-3-trunk\hudsonhudson-slaveworkspacecore-integration-testing-maven-3-windowscore-integration-testing-maven-3-trunklocal-repository\backport-util-concurrent\backport-util-concurrent\3.1\backport-util-concurrent-3.1.jar,>
<https://builds.apache.org/job/core-integration-testing-maven-3-windows/ws/maven-3-trunk\hudsonhudson-slaveworkspacecore-integration-testing-maven-3-windowscore-integration-testing-maven-3-trunklocal-repository\backport-util-concurrent\backport-util-concurrent\3.1\backport-util-concurrent-3.1.jar.sha1,>
<https://builds.apache.org/job/core-integration-testing-maven-3-windows/ws/maven-3-trunk\hudsonhudson-slaveworkspacecore-integration-testing-maven-3-windowscore-integration-testing-maven-3-trunklocal-repository\backport-util-concurrent\backport-util-concurrent\3.1\backport-util-concurrent-3.1.pom,>
<https://builds.apache.org/job/core-integration-testing-maven-3-windows/ws/maven-3-trunk\hudsonhudson-slaveworkspacecore-integration-testing-maven-3-windowscore-integration-testing-maven-3-trunklocal-repository\backport-util-concurrent\backport-util-concurrent\3.1\backport-util-concurrent-3.1.pom.sha1,>
<https://builds.apache.org/job/core-integration-testing-maven-3-windows/ws/maven-3-trunk\hudsonhudson-slaveworkspacecore-integration-testing-maven-3-windowscore-integration-testing-maven-3-trunklocal-repository\backport-util-concurrent\backport-util-concurrent\3.1\_maven.repositories]>
	at hudson.Util.deleteFile(Util.java:238)
	at hudson.Util.deleteRecursive(Util.java:289)
	at hudson.Util.deleteContentsRecursive(Util.java:200)
	at hudson.Util.deleteRecursive(Util.java:280)
	at hudson.Util.deleteContentsRecursive(Util.java:200)
	at hudson.Util.deleteRecursive(Util.java:280)
	at hudson.Util.deleteContentsRecursive(Util.java:200)
	at hudson.Util.deleteRecursive(Util.java:280)
	at hudson.Util.deleteContentsRecursive(Util.java:200)
	at hudson.scm.subversion.CheckoutUpdater$1.perform(CheckoutUpdater.java:71)
	at hudson.scm.subversion.WorkspaceUpdater$UpdateTask.delegateTo(WorkspaceUpdater.java:136)
	at hudson.scm.subversion.WorkspaceUpdater$UpdateTask.delegateTo(WorkspaceUpdater.java:144)
	at hudson.scm.subversion.UpdateUpdater$TaskImpl.perform(UpdateUpdater.java:121)
	at hudson.scm.subversion.WorkspaceUpdater$UpdateTask.delegateTo(WorkspaceUpdater.java:136)
	at hudson.scm.SubversionSCM$CheckOutTask.perform(SubversionSCM.java:788)
	at hudson.scm.SubversionSCM$CheckOutTask.invoke(SubversionSCM.java:769)
	at hudson.scm.SubversionSCM$CheckOutTask.invoke(SubversionSCM.java:753)
	at hudson.FilePath$FileCallableWrapper.call(FilePath.java:2200)
	at hudson.remoting.UserRequest.perform(UserRequest.java:118)
	at hudson.remoting.UserRequest.perform(UserRequest.java:48)
	at hudson.remoting.Request$2.run(Request.java:326)
	at hudson.remoting.InterceptingExecutorService$1.call(InterceptingExecutorService.java:72)
	at java.util.concurrent.FutureTask$Sync.innerRun(Unknown Source)
	at java.util.concurrent.FutureTask.run(Unknown Source)
	at java.util.concurrent.ThreadPoolExecutor.runWorker(Unknown Source)
	at java.util.concurrent.ThreadPoolExecutor$Worker.run(Unknown Source)
	at hudson.remoting.Engine$1$1.run(Engine.java:60)
	at java.lang.Thread.run(Unknown Source)
Retrying after 10 seconds
Checking out a fresh workspace because there's no workspace at F:\hudson\hudson-slave\workspace\core-integration-testing-maven-3-windows\maven-3-trunk
Cleaning local Directory maven-3-trunk
hudson.util.IOException2: remote file operation failed: <https://builds.apache.org/job/core-integration-testing-maven-3-windows/ws/>
at hudson.remoting.Channel@2aba709e:windows1
	at hudson.FilePath.act(FilePath.java:838)
	at hudson.FilePath.act(FilePath.java:824)
	at hudson.scm.SubversionSCM.checkout(SubversionSCM.java:743)
	at hudson.scm.SubversionSCM.checkout(SubversionSCM.java:685)
	at hudson.model.AbstractProject.checkout(AbstractProject.java:1256)
	at hudson.model.AbstractBuild$AbstractBuildExecution.defaultCheckout(AbstractBuild.java:589)
	at jenkins.scm.SCMCheckoutStrategy.checkout(SCMCheckoutStrategy.java:88)
	at hudson.model.AbstractBuild$AbstractBuildExecution.run(AbstractBuild.java:494)
	at hudson.model.Run.execute(Run.java:1502)
	at hudson.model.FreeStyleBuild.run(FreeStyleBuild.java:46)
	at hudson.model.ResourceController.execute(ResourceController.java:88)
	at hudson.model.Executor.run(Executor.java:236)
Caused by: java.io.IOException: Unable to delete <https://builds.apache.org/job/core-integration-testing-maven-3-windows/ws/maven-3-trunk\hudsonhudson-slaveworkspacecore-integration-testing-maven-3-windowscore-integration-testing-maven-3-trunklocal-repository\backport-util-concurrent\backport-util-concurrent\3.1>
- files in dir: [<https://builds.apache.org/job/core-integration-testing-maven-3-windows/ws/maven-3-trunk\hudsonhudson-slaveworkspacecore-integration-testing-maven-3-windowscore-integration-testing-maven-3-trunklocal-repository\backport-util-concurrent\backport-util-concurrent\3.1\backport-util-concurrent-3.1.jar,>
<https://builds.apache.org/job/core-integration-testing-maven-3-windows/ws/maven-3-trunk\hudsonhudson-slaveworkspacecore-integration-testing-maven-3-windowscore-integration-testing-maven-3-trunklocal-repository\backport-util-concurrent\backport-util-concurrent\3.1\backport-util-concurrent-3.1.jar.sha1,>
<https://builds.apache.org/job/core-integration-testing-maven-3-windows/ws/maven-3-trunk\hudsonhudson-slaveworkspacecore-integration-testing-maven-3-windowscore-integration-testing-maven-3-trunklocal-repository\backport-util-concurrent\backport-util-concurrent\3.1\backport-util-concurrent-3.1.pom,>
<https://builds.apache.org/job/core-integration-testing-maven-3-windows/ws/maven-3-trunk\hudsonhudson-slaveworkspacecore-integration-testing-maven-3-windowscore-integration-testing-maven-3-trunklocal-repository\backport-util-concurrent\backport-util-concurrent\3.1\backport-util-concurrent-3.1.pom.sha1,>
<https://builds.apache.org/job/core-integration-testing-maven-3-windows/ws/maven-3-trunk\hudsonhudson-slaveworkspacecore-integration-testing-maven-3-windowscore-integration-testing-maven-3-trunklocal-repository\backport-util-concurrent\backport-util-concurrent\3.1\_maven.repositories]>
	at hudson.Util.deleteFile(Util.java:238)
	at hudson.Util.deleteRecursive(Util.java:289)
	at hudson.Util.deleteContentsRecursive(Util.java:200)
	at hudson.Util.deleteRecursive(Util.java:280)
	at hudson.Util.deleteContentsRecursive(Util.java:200)
	at hudson.Util.deleteRecursive(Util.java:280)
	at hudson.Util.deleteContentsRecursive(Util.java:200)
	at hudson.Util.deleteRecursive(Util.java:280)
	at hudson.Util.deleteContentsRecursive(Util.java:200)
	at hudson.scm.subversion.CheckoutUpdater$1.perform(CheckoutUpdater.java:71)
	at hudson.scm.subversion.WorkspaceUpdater$UpdateTask.delegateTo(WorkspaceUpdater.java:136)
	at hudson.scm.subversion.WorkspaceUpdater$UpdateTask.delegateTo(WorkspaceUpdater.java:144)
	at hudson.scm.subversion.UpdateUpdater$TaskImpl.perform(UpdateUpdater.java:121)
	at hudson.scm.subversion.WorkspaceUpdater$UpdateTask.delegateTo(WorkspaceUpdater.java:136)
	at hudson.scm.SubversionSCM$CheckOutTask.perform(SubversionSCM.java:788)
	at hudson.scm.SubversionSCM$CheckOutTask.invoke(SubversionSCM.java:769)
	at hudson.scm.SubversionSCM$CheckOutTask.invoke(SubversionSCM.java:753)
	at hudson.FilePath$FileCallableWrapper.call(FilePath.java:2200)
	at hudson.remoting.UserRequest.perform(UserRequest.java:118)
	at hudson.remoting.UserRequest.perform(UserRequest.java:48)
	at hudson.remoting.Request$2.run(Request.java:326)
	at hudson.remoting.InterceptingExecutorService$1.call(InterceptingExecutorService.java:72)
	at java.util.concurrent.FutureTask$Sync.innerRun(Unknown Source)
	at java.util.concurrent.FutureTask.run(Unknown Source)
	at java.util.concurrent.ThreadPoolExecutor.runWorker(Unknown Source)
	at java.util.concurrent.ThreadPoolExecutor$Worker.run(Unknown Source)
	at hudson.remoting.Engine$1$1.run(Engine.java:60)
	at java.lang.Thread.run(Unknown Source)
Retrying after 10 seconds
Checking out a fresh workspace because there's no workspace at F:\hudson\hudson-slave\workspace\core-integration-testing-maven-3-windows\maven-3-trunk
Cleaning local Directory maven-3-trunk
hudson.util.IOException2: remote file operation failed: <https://builds.apache.org/job/core-integration-testing-maven-3-windows/ws/>
at hudson.remoting.Channel@2aba709e:windows1
	at hudson.FilePath.act(FilePath.java:838)
	at hudson.FilePath.act(FilePath.java:824)
	at hudson.scm.SubversionSCM.checkout(SubversionSCM.java:743)
	at hudson.scm.SubversionSCM.checkout(SubversionSCM.java:685)
	at hudson.model.AbstractProject.checkout(AbstractProject.java:1256)
	at hudson.model.AbstractBuild$AbstractBuildExecution.defaultCheckout(AbstractBuild.java:589)
	at jenkins.scm.SCMCheckoutStrategy.checkout(SCMCheckoutStrategy.java:88)
	at hudson.model.AbstractBuild$AbstractBuildExecution.run(AbstractBuild.java:494)
	at hudson.model.Run.execute(Run.java:1502)
	at hudson.model.FreeStyleBuild.run(FreeStyleBuild.java:46)
	at hudson.model.ResourceController.execute(ResourceController.java:88)
	at hudson.model.Executor.run(Executor.java:236)
Caused by: java.io.IOException: Unable to delete <https://builds.apache.org/job/core-integration-testing-maven-3-windows/ws/maven-3-trunk\hudsonhudson-slaveworkspacecore-integration-testing-maven-3-windowscore-integration-testing-maven-3-trunklocal-repository\backport-util-concurrent\backport-util-concurrent\3.1>
- files in dir: [<https://builds.apache.org/job/core-integration-testing-maven-3-windows/ws/maven-3-trunk\hudsonhudson-slaveworkspacecore-integration-testing-maven-3-windowscore-integration-testing-maven-3-trunklocal-repository\backport-util-concurrent\backport-util-concurrent\3.1\backport-util-concurrent-3.1.jar,>
<https://builds.apache.org/job/core-integration-testing-maven-3-windows/ws/maven-3-trunk\hudsonhudson-slaveworkspacecore-integration-testing-maven-3-windowscore-integration-testing-maven-3-trunklocal-repository\backport-util-concurrent\backport-util-concurrent\3.1\backport-util-concurrent-3.1.jar.sha1,>
<https://builds.apache.org/job/core-integration-testing-maven-3-windows/ws/maven-3-trunk\hudsonhudson-slaveworkspacecore-integration-testing-maven-3-windowscore-integration-testing-maven-3-trunklocal-repository\backport-util-concurrent\backport-util-concurrent\3.1\backport-util-concurrent-3.1.pom,>
<https://builds.apache.org/job/core-integration-testing-maven-3-windows/ws/maven-3-trunk\hudsonhudson-slaveworkspacecore-integration-testing-maven-3-windowscore-integration-testing-maven-3-trunklocal-repository\backport-util-concurrent\backport-util-concurrent\3.1\backport-util-concurrent-3.1.pom.sha1,>
<https://builds.apache.org/job/core-integration-testing-maven-3-windows/ws/maven-3-trunk\hudsonhudson-slaveworkspacecore-integration-testing-maven-3-windowscore-integration-testing-maven-3-trunklocal-repository\backport-util-concurrent\backport-util-concurrent\3.1\_maven.repositories]>
	at hudson.Util.deleteFile(Util.java:238)
	at hudson.Util.deleteRecursive(Util.java:289)
	at hudson.Util.deleteContentsRecursive(Util.java:200)
	at hudson.Util.deleteRecursive(Util.java:280)
	at hudson.Util.deleteContentsRecursive(Util.java:200)
	at hudson.Util.deleteRecursive(Util.java:280)
	at hudson.Util.deleteContentsRecursive(Util.java:200)
	at hudson.Util.deleteRecursive(Util.java:280)
	at hudson.Util.deleteContentsRecursive(Util.java:200)
	at hudson.scm.subversion.CheckoutUpdater$1.perform(CheckoutUpdater.java:71)
	at hudson.scm.subversion.WorkspaceUpdater$UpdateTask.delegateTo(WorkspaceUpdater.java:136)
	at hudson.scm.subversion.WorkspaceUpdater$UpdateTask.delegateTo(WorkspaceUpdater.java:144)
	at hudson.scm.subversion.UpdateUpdater$TaskImpl.perform(UpdateUpdater.java:121)
	at hudson.scm.subversion.WorkspaceUpdater$UpdateTask.delegateTo(WorkspaceUpdater.java:136)
	at hudson.scm.SubversionSCM$CheckOutTask.perform(SubversionSCM.java:788)
	at hudson.scm.SubversionSCM$CheckOutTask.invoke(SubversionSCM.java:769)
	at hudson.scm.SubversionSCM$CheckOutTask.invoke(SubversionSCM.java:753)
	at hudson.FilePath$FileCallableWrapper.call(FilePath.java:2200)
	at hudson.remoting.UserRequest.perform(UserRequest.java:118)
	at hudson.remoting.UserRequest.perform(UserRequest.java:48)
	at hudson.remoting.Request$2.run(Request.java:326)
	at hudson.remoting.InterceptingExecutorService$1.call(InterceptingExecutorService.java:72)
	at java.util.concurrent.FutureTask$Sync.innerRun(Unknown Source)
	at java.util.concurrent.FutureTask.run(Unknown Source)
	at java.util.concurrent.ThreadPoolExecutor.runWorker(Unknown Source)
	at java.util.concurrent.ThreadPoolExecutor$Worker.run(Unknown Source)
	at hudson.remoting.Engine$1$1.run(Engine.java:60)
	at java.lang.Thread.run(Unknown Source)
Recording test results

Mime
View raw message